{
    "id": 1,
    "title": "Cult of Chucky",
    "genre": "horror",
    "year": 2017,
    "duration": 91,
    "cast": [
        {
            "name": "Fiona Dourif",
            "age": 36
        },
        {
            "name": "Michael Therriault",
            "age": 39
        },
        {
            "name": "Alex Vincent",
            "age": 36
        }
    ]
}