{
    "id": 4,
    "title": "Beauty and the Beast",
    "genre": "musical",
    "year": 2017,
    "duration": 129,
    "cast": [
        {
            "name": "Emma Watson",
            "age": 27
        },
        {
            "name": "Dan Stevens",
            "age": 35
        },
        {
            "name": "Luke Evans",
            "age": 38
        }
    ]
}