{
    "name": "six",
    "members": {
        "deities": [
            {
                "type": "angel",
                "name": "Vados",
                "desc": "Vados is a kind-hearted being, and can sometimes be pretty straight forward. She also, often teases Champa for being overweight. She is also the one who politely introduced Champa to Goku after the latter asked who he is. She also displays concern with her God of Destruction's physique and health problems, as well as his selection of diet. Examples are shown when she and Champa walked together in a forest, with Champa tiring out very quickly, leading Vados to point out his obesity as the cause of his low stamina and why he couldn't keep with her anymore. Another is when he was drinking a sugary beverage between meals, which also lead Vados to declare in skipping breakfast dinner tomorrow to even out her master's newly gained weight. This essentially makes her Champa's dietitian as well. Like her younger brother Whis, she tends to love consuming different foods. It is also said by Vegeta that Vados walks leaving 'no openings for an attack', stating that she at least must be as strong as Whis. She is also eloquent, respectful, wise, and can be rather remorseless when it comes to which she is responsible for, or at the very least are aware of, as she is seen destroying a planet when Champa commanded her to without batting an eye. After the Grand Priest announces that the losing Universes will be obliterated and that only the Angels will be preserved, Vados simply closes her eyes and silently smiles, which showcases that, despite the length of time she and Champa spent together, she is at least not openly emotionally attached to him. She also sarcastically cried for him in the tournament in case he was erased. When Hit seemed to be losing against Dyspo, however, she did have a concerned expresson on her face. She is a very composed and insightful individual. Noteworthy, she is the only Angel of the other universes who has any respect for Goku, while all the attending Destroyers and Angels mutually hated and blamed Goku for the Tournament of Power, Vados responds by stating that they are all in debt to Goku. She pointed out that Zen-oh was already going to erase all of them with their universes completely, but Goku's closeness with Zen-oh was able to convince the Omni-King to give the underdeveloped universes a chance to survive by winning the Tournament of Power, which they all ignore. At the same time, she can also be rather mischievous as she once intentionally instigated a fight between Beerus and Champa as she made a birthday cake with but one Puff-Puff fruit on it. This is pointed out by Whis when Beerus and Champa are fighting."
            },
            {
                "type": "hakai",
                "name": "Champa",
                "desc": "Much like his brother, Champa is very confident in his abilities and rather indifferent to other people dying. At the same time, Champa is shown to be even lazier, often asking Vados to handle matters for him. He is also shown to be underhanded and care little for rules and order, as he snuck into Universe 7 to collect its portion of the Super Dragon Balls set. Even more, he added various modifications in the Tournament of Destroyers to support his fighters. Champa tends to carry himself in a less-dignified manner compared to Beerus, as he tends to avoid answering questions that incriminate or embarrass him. Unlike Beerus, Champa has not been seen with a very polite and sophisticated manner towards others when the time comes, further exemplifying his lack of emotional maturity. Champa is also shown to be very selfish and takes his rivalry with Beerus much more seriously. Even with the looming threat of being erased should he lose the Tournament of Power, Champa's main goal was to humiliate Beerus. He is also very selfish as upon learning of Universe 7's Earth providing Beerus with such wonderful food, Champa immediately voiced his desire to obtain the planet for himself. Like the most of other Supreme Kais and all other Gods of Destruction, Champa has a low tolerance for failure. Even more, he is a sore loser, going into a childish tantrum and making baseless accusations in hopes of getting his way. Champa is shown to have a strong like towards sweets, particularly in his drinks, which seems to be the driving reason for his larger frame. Champa is also somewhat dimwitted compared to his brother as he fails to realize Goku and Vegeta were moving slowly due to the weighted training suits they were wearing causing him to underestimate their strength. Like the other Destroyers, Champa is shown to be fearfully respectful of Zen-Oh. He is also shocked to learn that Vados will be spared if Universe 6 is destroyed. However, despite his pettiness, Champa nevertheless appears capable of possessing genuine respect and admiration; upon Hit's elimination by Jiren, rather than getting mad as he typically would, Champa instead proudly reassured Hit that he fought well, and stated that his loss wouldn't be in vain."
            },
            {
                "type": "kaio",
                "name": "Fuwa",
                "desc": "Fuwa is shown to be a rather nervous and absentminded person. When first meeting Goku he is rather surprised that a mortal would so casually talk to a God, implying his encounters with individuals in his Universe are much more respectful to him. He appears to be rather lazy, as he asks if Champa will gather the warriors representing their Universe for the Tournament of Power. He tends to have a habit of repeating himself in the same sentence. During the Tournament of Destroyers, he acted rather cocky about his teams fighters, and tended to bicker with and tease Old Kai."
            }
        ],
        "fighters": [
            {
                "id": 1,
                "name": "Hit",
                "desc": "Hit is stoic and composed, constantly appearing emotionless and indifferent to most events. An expert in his craft, Hit shows great confidence and fortitude in any challenge presented before him. Hit also seems to be confident in his abilities. Showing a very no-nonsense attitude, he is straight to the point and speaks no more than necessary. To which, Hit will carry out his contracts, no matter whom his targets may be, nor can he be bribed or convince to turn away from the assignment. More to his unwavering commitment and resolve, even when at a disadvantage, Hit refuses to back down from the challenge, choosing to face the opponent head-on, as noted by Cabba. The only instance in which Hit has ever shown fear of anything, is when Champa, the God of Destruction of Universe 6, was determined on destroying him, but even then he was not willing to go down without a fight. Stemming from his antisocial nature, he apparently is somewhat ignorant of certain forms of showing respect, as he was slightly surprised when Goku bows to him. At the same time, he is a very astute and intuitive individual, constantly perceiving the situation at hand determining how best to handle it. While an assassin, Hit is shown to be very trustworthy and honorable, as he will revealing himself to the target as he does not believe in striking from behind and explaining why he is present. Against one he is not required to kill, he will show mercy, offering his opponents a chance to surrender and use no more strength than absolutely necessary. While solemn in attitude, Hit believes in being fair, showing his respect by action as he allowed Goku to stand up because Goku helped him improve his Time-Skip. He is also shown to be a team-player as during the Tournament of Power, he saved his teammate Caulifla from elimination. A warrior at heart, Hit is shown to enjoy a true challenge, smiling from facing Goku's own competitive nature and sportsmanship, developing respect to him as the first person to make him fight seriously. Even more, he showed said respect as he gave Goku his approval with a friendly fist bump. Even on mission, should the opponent prove capable enough, his hardened demeanor will give way somewhat to all his martial artist spirit to revel in the competition. Despite his profession, he does not approve of the idea of people being demeaned and treated as pawns. This is proven after Goku intentionally lost their fight to show the Gods of Destruction that they were in control of their own actions. Hit followed with Goku's method and let Team Universe 7 win by feigning defeat in the final match. Even more, he surprisingly attempts to avoid killing those he feels undeserving, as he offers Goku the option to vanish while he would report the target dead. After having clinically killed Goku for a few seconds, he was willing to part ways peacefully, as he technically completed his task, until Goku insisted they finish the fight. Hit is also shown very understanding, as after learning that Goku placed the contract on himself to face Hit at his best, the assassin smiled and acknowledged his further respect of the Saiyan, leaving with no regrets and patiently wait for their next fight."
            },
            {
                "id": 2,
                "name": "Frost",
                "desc": "Frost portrays himself as a gentleman who respects his opponents while in combat. He does seem to have somewhat of a cocky side as he suggested to Goku after he overpowered him after his first transformation that he surrender lest he suffer more pain, claiming to be a pacifist as he even noted that he would rather avoid killing if at all possible. Similarly to Goku, Frost enjoys playing around with his opponents and testing them before using his full strength. Despite this, he is not so arrogant as to view himself as invincible, openly admitting to when he believes an individual can challenge his might. Even more, Frost acts as though he has a very caring nature to him. Throughout Universe 6, Frost has constantly used his empire and own sheer power to help end wars and save lives, becoming a hero and idol to many, particularly having a soft spot for children, refusing to give up in fear of destroying their hope. During the battle with Goku, he was saying to himself how he could not give up and would always stand up for the children who needed him the most, which is completely opposite of what Frieza would ever even consider. In the anime, however, in truth Frost is just like his tyrannical counterpart from the seventh universe, with Vegeta noting that no matter the universe 'Frieza is still Frieza'. Despite being the one to stop wars, he is also the one who discreetly starts them—only to 'heroically' stop them in order to gain good publicity, and also so that he can buy out the war torn lands at a cheaper price. He is also a dirty fighter—using poison to gain an advantage when he is losing. Therefore, he is shown to be much more shrewd and cunning than Frieza, where he was able to fool almost everyone he meets, providing a fake image of a benevolent leader. Also like Frieza, Frost is shown to possess psychopathic qualities, seeing as how he takes sadistic pleasure in torturing Roshi, similar to how Frieza revels in the suffering of others."
            },
            {
                "id": 3,
                "name": "Botamo",
                "desc": "Botamo displays a rather confident attitude as he is extremely prideful in his abilities, however, his overconfidence in his abilites was his own downfall in both the Universe 6 and 7 Gods of Destruction Selection Martial Arts Competition and the Tournament of Power. He shows more emotion when he lost to Goku and Gohan. He also has a degree of sympathy, as he is seen patting Magetta on the back when he was insulted by Vegeta to attempt to make him feel better. Furthermore, it appears that Botamo and Magetta have a more friendly relationship and can cooperate very well together, as seen when they use a combo move to catch a ball batted by Gohan. This continues in the Tournament of Power, with Magetta saving Botamo from being ringed out by Vegeta, and the two teaming up to take on the Saiyan prince."
            },
            {
                "id": 4,
                "name": "Auta Magetta",
                "desc": "Magetta is confident in his abilities. Like the rest of the Metalmen race, Magetta is very sensitive and is rendered unable to fight when insulted. This is shown when Vegeta calls Magetta a 'piece of junk' during their match, making Magetta lose and cry afterwards. Much like Majin Buu, he lacks academic intelligence like many other fighters. This is seen when he barely passed his exam required to participate in the tournament. He also seems to lack enough intellect to talk (in the Japanese version, his only lines are based on the syllables 'choo-po' and nothing more; in the English dub, he says things like 'Clankity clankity whir' and 'Chugga chugga chugga spark'). However, he can perfectly understand what others say to him. He appears to have a very friendly or close relationship with Botamo, likely due to them both being the large fighters of Champa's team. This is evidenced when he and Botamo are able to perform a combo move and catch a ball batted by Gohan. Magetta saves Botamo from being eliminated by Vegeta, and Botamo covers Magetta's ears so he won't hear Vegeta's insults."
            },
            {
                "id": 5,
                "name": "Cabba",
                "desc": "Cabba is a good-natured, polite, and humble Saiyan, but when in a fight his disposition changes to a serious, no-nonsense attitude. Contrasting the violent and arrogant nature exhibited by the vast majority of Saiyans from Universe 7, he speaks respectfully to everyone and prides himself as a protector of the weak. He is ashamed that Frost, once thought to be a close ally who he initially thought to have shared the same sense of justice; was not only a cheater but also a manipulative, cold-hearted space pirate lord who ended the wars he started to gain public support. In spite of (as well as due to) his good nature, when Vegeta tried to provoke him into turning into a Super Saiyan by telling him that he would kill off all of Sadala including Cabba's family, the young Saiyan became extremely angry and transformed attacking in rage. After finding out this was a test, he calmed himself and developed respect towards Vegeta even calling him 'Master'. Due to his very polite nature, he has a very hard time making fun of others, and in fact, seems almost incapable of faking anger. This is seen when he tries to provoke Caulifla, but does it in a very quiet, non-threatening way. When he witnessed Universe 9 being erased, Cabba realized what he was fighting for and confronted Vegeta telling him he will be eliminated from the tournament, showing that despite respecting his self proclaimed mentor, he wanted to protect his universe even more."
            },
            {
                "id": 6,
                "name": "Caulifla",
                "desc": "As noted by her brother, she has a very punkish attitude and is also recognized as a tomboy, to which she shows a strong contrast to the rest of her race, acting more akin to the Universe 7 Saiyans. Caulifla is shown to be very lazy if not self-absorbed as she initially refused to join the Tournament of Power even when learning her universe's or her own existence were on the line. It took Cabba telling her about the Super Saiyan form as well as about being able to achieve greater heights in her strength to make her agree, showing her desire to become stronger. She also got angry at Cabba for his attempts at provoking her, even to have her obtain the Super Saiyan form. After obtaining the Super Saiyan transformation, Caulifla seemed grateful for Cabba teaching her. To which, she showed a new drive, eager to fight in the Tournament of Power. In her Super Saiyan form, her personality remains unchanged whatsoever, due to her using another method (concentrating ki to her back) to transform. Despite her tomboyish attitude, Caulifla cares about others, especially her protégée, Kale, whom she treats like a younger sister. When Cabba attempts to get Kale to transform and the latter starts crying, Caulifla is angered by this and tells Cabba to stop. She was also the only one able to get Kale to calm down after Kale finally transformed and tried to kill Cabba. During her meeting with Goku and Vegeta at the Tournament of Power, she is shown to be very arrogant and cocky towards them and says that she came to see the strongest fighters of all universes, and Goku notes that she is just like him in that sense. Caulifla also has somewhat of a cocky attitude and displayed this when she saw Goku and Vegeta become shocked at the overwhelming power of the Universe 11 warriors by saying that 'Universe 7's warriors were nothing to worry about if they're afraid of such such wimps'. This opinion changes after she witnesses them using Super Saiyan Blue, a form she had never seen before which caught her immediate interest. While she questioned Goku about it, she referred to him as an old man and promised to beat him up as gratitude, showing disrespect to him. However, like the Saiyans of Universe 7, she displays a love for getting stronger which was shown after she heard there were other Super Saiyan forms. Also she showed a love for battle as shown when she enjoyed her match with Goku which caused her to get so caught up that she ignored Kale. During the Tournament of Power after being rescued by Hit's Time-Skip ability, Caulifla is shown to be very respectful to the assassin; in fact, Hit is the only person to date not get any rude treatment from her. She also has confidence in Hit's abilities when he faces off against the Universe 11 fighter Dyspo and was willing to return him the favor when Dyspo was about to defeat him."
            },
            {
                "id": 7,
                "name": "Kale",
                "desc": "While normally a very shy and timid individual, upon accessing her Super Saiyan power, Kale apparently becomes very aggressive, like her film counterpart Broly. During the interactions with Cabba and Caulifla, she was seen smirking in amusement when Cabba insulted Caulifla in order to draw out her rage to become a Super Saiyan and in response, the latter was insulting the former. After entering her uncontrollable state, Kale becomes much more violent and cocky, confidently stating to Cabba that she will kill him before attacking him without mercy. As she stayed in this state, her anger seemed to increase, all similar to Broly himself, although he is already like that even at his base form. In contrast to the nearly schizophrenic and maniacal Broly, Kale seems to have intense feelings of respect and adoration for Caulifla, admiring her much like a younger sister would, and is jealous of Cabba's interaction with her superior. She was not able to let go of her rage and snap out of her Uncontrollable state until Caulifla told her that she was not interested in a relationship with Cabba. She also harbors insecurities over being a burden to Caulifla and becomes discouraged when she is unable to support her. Just as Broly is mentally unbalanced, Kale is also very emotionally unbalanced and seems to want to be the only one who Caulifla should pay attention to as she was shown to go into a mad rage and transform into her Uncontrollable Super Saiyan state because Goku was seemingly 'taking Caulifla away from her' by fighting Caulifla one-on-one. When Kale enters her uncontrollable state her only objective is to ensure that she kills the person who caused her to enter her uncontrollable state and this was shown twice with Cabba and Goku when they both interacted with Caulifla which caused Caulifla to pay little to no attention to her. Interestingly despite the respect she has for Caulifla, her mental state within the berserk form causes her to lose any recognition skills and attack anyone in the arena (including Caulifla). During the fight against most of the Pride Troopers and watching Caulifla on the brink of being defeated; Kale becomes angry and pushed past her insecurities, unlocking her Unique Super Saiyan form and mastered control over her transformations. Afterwards, Kale is able to enter her Uncontrolled Super Saiyan form without physically assaulting anyone (namely Goku, whom she viciously attacked earlier)."
            },
            {
                "id": 8,
                "name": "Dr. Rota",
                "desc": "Dr. Rota has red skin, with a large snout and tusks protruding out of his face, similar to a warthog. He has a small pair of glasses, and a black shark fin on his head. He wears a black robe, fastened at the waist with a white belt."
            },
            {
                "id": 9,
                "name": "Saonel",
                "desc": "Like his teammate Pilina, Saonel seems to be a dirty fighter at times, as shown when he and Pilina attempted to ambush an exhausted Goku."
            },
            {
                "id": 10,
                "name": "Pilina",
                "desc": "Like his teammate Saonel, Pilina seems to be a dirty fighter at times, as shown when he and Saonel attempted to ambush an exhausted Goku."
            }
        ]
    }
}