{
    "0": {
        "data": 0, 
        "color": [
            177, 
            12, 
            183
        ], 
        "edges": [
            5, 
            2, 
            6
        ]
    }, 
    "1": {
        "data": 1, 
        "color": [
            177, 
            12, 
            183
        ], 
        "edges": [
            5
        ]
    }, 
    "2": {
        "data": 2, 
        "color": [
            177, 
            12, 
            183
        ], 
        "edges": [
            0, 
            9
        ]
    }, 
    "3": {
        "data": 3, 
        "color": [
            177, 
            12, 
            183
        ], 
        "edges": [
            5, 
            6, 
            8
        ]
    }, 
    "4": {
        "data": 4, 
        "color": [
            177, 
            12, 
            183
        ], 
        "edges": [
            8, 
            7
        ]
    }, 
    "5": {
        "data": 5, 
        "color": [
            177, 
            12, 
            183
        ], 
        "edges": [
            0, 
            1, 
            3
        ]
    }, 
    "6": {
        "data": 6, 
        "color": [
            177, 
            12, 
            183
        ], 
        "edges": [
            3, 
            0
        ]
    }, 
    "7": {
        "data": 7, 
        "color": [
            177, 
            12, 
            183
        ], 
        "edges": [
            4
        ]
    }, 
    "8": {
        "data": 8, 
        "color": [
            177, 
            12, 
            183
        ], 
        "edges": [
            4, 
            3
        ]
    }, 
    "9": {
        "data": 9, 
        "color": [
            177, 
            12, 
            183
        ], 
        "edges": [
            2
        ]
    }
}