module app

go 1.16

require (
	github.com/davecgh/go-spew v1.1.1 // indirect
	github.com/pmezard/go-difflib v1.0.0 // indirect
	github.com/stretchr/testify v1.7.1
	gopkg.in/yaml.v3 v3.0.0-20210107192922-496545a6307b // indirect
)
