%YAML 1.1
%TAG !u! tag:unity3d.com,2011:
--- !u!1 &740151251009991421
GameObject:
  m_ObjectHideFlags: 0
  m_CorrespondingSourceObject: {fileID: 0}
  m_PrefabInstance: {fileID: 0}
  m_PrefabAsset: {fileID: 0}
  serializedVersion: 6
  m_Component:
  - component: {fileID: 4539003999109435234}
  - component: {fileID: 1062965453458929485}
  m_Layer: 31
  m_Name: Ground
  m_TagString: Untagged
  m_Icon: {fileID: 0}
  m_NavMeshLayer: 0
  m_StaticEditorFlags: 0
  m_IsActive: 1
--- !u!4 &4539003999109435234
Transform:
  m_ObjectHideFlags: 0
  m_CorrespondingSourceObject: {fileID: 0}
  m_PrefabInstance: {fileID: 0}
  m_PrefabAsset: {fileID: 0}
  m_GameObject: {fileID: 740151251009991421}
  m_LocalRotation: {x: 0, y: 0, z: 0, w: 1}
  m_LocalPosition: {x: 0, y: 0, z: 0}
  m_LocalScale: {x: 1, y: 1, z: 1}
  m_Children:
  - {fileID: 3953746454900427514}
  m_Father: {fileID: 0}
  m_RootOrder: 0
  m_LocalEulerAnglesHint: {x: 0, y: 0, z: 0}
--- !u!156049354 &1062965453458929485
Grid:
  m_ObjectHideFlags: 0
  m_CorrespondingSourceObject: {fileID: 0}
  m_PrefabInstance: {fileID: 0}
  m_PrefabAsset: {fileID: 0}
  m_GameObject: {fileID: 740151251009991421}
  m_Enabled: 1
  m_CellSize: {x: 1, y: 1, z: 0}
  m_CellGap: {x: 0, y: 0, z: 0}
  m_CellLayout: 0
  m_CellSwizzle: 0
--- !u!1 &7278842424424194691
GameObject:
  m_ObjectHideFlags: 0
  m_CorrespondingSourceObject: {fileID: 0}
  m_PrefabInstance: {fileID: 0}
  m_PrefabAsset: {fileID: 0}
  serializedVersion: 6
  m_Component:
  - component: {fileID: 3953746454900427514}
  - component: {fileID: 618021439083352146}
  - component: {fileID: 3892346728527524762}
  m_Layer: 0
  m_Name: Layer1
  m_TagString: Untagged
  m_Icon: {fileID: 0}
  m_NavMeshLayer: 0
  m_StaticEditorFlags: 0
  m_IsActive: 1
--- !u!4 &3953746454900427514
Transform:
  m_ObjectHideFlags: 0
  m_CorrespondingSourceObject: {fileID: 0}
  m_PrefabInstance: {fileID: 0}
  m_PrefabAsset: {fileID: 0}
  m_GameObject: {fileID: 7278842424424194691}
  m_LocalRotation: {x: -0, y: -0, z: -0, w: 1}
  m_LocalPosition: {x: 0, y: 0, z: 0}
  m_LocalScale: {x: 1, y: 1, z: 1}
  m_Children: []
  m_Father: {fileID: 4539003999109435234}
  m_RootOrder: 0
  m_LocalEulerAnglesHint: {x: 0, y: 0, z: 0}
--- !u!1839735485 &618021439083352146
Tilemap:
  m_ObjectHideFlags: 0
  m_CorrespondingSourceObject: {fileID: 0}
  m_PrefabInstance: {fileID: 0}
  m_PrefabAsset: {fileID: 0}
  m_GameObject: {fileID: 7278842424424194691}
  m_Enabled: 1
  m_Tiles:
  - first: {x: -1, y: -11, z: 0}
    second:
      serializedVersion: 2
      m_TileIndex: 56
      m_TileSpriteIndex: 56
      m_TileMatrixIndex: 0
      m_TileColorIndex: 0
      m_TileObjectToInstantiateIndex: 65535
      dummyAlignment: 0
      m_AllTileFlags: 1073741825
  - first: {x: 0, y: -11, z: 0}
    second:
      serializedVersion: 2
      m_TileIndex: 57
      m_TileSpriteIndex: 57
      m_TileMatrixIndex: 0
      m_TileColorIndex: 0
      m_TileObjectToInstantiateIndex: 65535
      dummyAlignment: 0
      m_AllTileFlags: 1073741825
  - first: {x: 1, y: -11, z: 0}
    second:
      serializedVersion: 2
      m_TileIndex: 58
      m_TileSpriteIndex: 58
      m_TileMatrixIndex: 0
      m_TileColorIndex: 0
      m_TileObjectToInstantiateIndex: 65535
      dummyAlignment: 0
      m_AllTileFlags: 1073741825
  - first: {x: 2, y: -11, z: 0}
    second:
      serializedVersion: 2
      m_TileIndex: 59
      m_TileSpriteIndex: 59
      m_TileMatrixIndex: 0
      m_TileColorIndex: 0
      m_TileObjectToInstantiateIndex: 65535
      dummyAlignment: 0
      m_AllTileFlags: 1073741825
  - first: {x: 3, y: -11, z: 0}
    second:
      serializedVersion: 2
      m_TileIndex: 60
      m_TileSpriteIndex: 60
      m_TileMatrixIndex: 0
      m_TileColorIndex: 0
      m_TileObjectToInstantiateIndex: 65535
      dummyAlignment: 0
      m_AllTileFlags: 1073741825
  - first: {x: 4, y: -11, z: 0}
    second:
      serializedVersion: 2
      m_TileIndex: 61
      m_TileSpriteIndex: 61
      m_TileMatrixIndex: 0
      m_TileColorIndex: 0
      m_TileObjectToInstantiateIndex: 65535
      dummyAlignment: 0
      m_AllTileFlags: 1073741825
  - first: {x: 5, y: -11, z: 0}
    second:
      serializedVersion: 2
      m_TileIndex: 62
      m_TileSpriteIndex: 62
      m_TileMatrixIndex: 0
      m_TileColorIndex: 0
      m_TileObjectToInstantiateIndex: 65535
      dummyAlignment: 0
      m_AllTileFlags: 1073741825
  - first: {x: 6, y: -11, z: 0}
    second:
      serializedVersion: 2
      m_TileIndex: 63
      m_TileSpriteIndex: 63
      m_TileMatrixIndex: 0
      m_TileColorIndex: 0
      m_TileObjectToInstantiateIndex: 65535
      dummyAlignment: 0
      m_AllTileFlags: 1073741825
  - first: {x: 7, y: -11, z: 0}
    second:
      serializedVersion: 2
      m_TileIndex: 64
      m_TileSpriteIndex: 64
      m_TileMatrixIndex: 0
      m_TileColorIndex: 0
      m_TileObjectToInstantiateIndex: 65535
      dummyAlignment: 0
      m_AllTileFlags: 1073741825
  - first: {x: 8, y: -11, z: 0}
    second:
      serializedVersion: 2
      m_TileIndex: 65
      m_TileSpriteIndex: 65
      m_TileMatrixIndex: 0
      m_TileColorIndex: 0
      m_TileObjectToInstantiateIndex: 65535
      dummyAlignment: 0
      m_AllTileFlags: 1073741825
  - first: {x: -1, y: -10, z: 0}
    second:
      serializedVersion: 2
      m_TileIndex: 46
      m_TileSpriteIndex: 46
      m_TileMatrixIndex: 0
      m_TileColorIndex: 0
      m_TileObjectToInstantiateIndex: 65535
      dummyAlignment: 0
      m_AllTileFlags: 1073741825
  - first: {x: 0, y: -10, z: 0}
    second:
      serializedVersion: 2
      m_TileIndex: 47
      m_TileSpriteIndex: 47
      m_TileMatrixIndex: 0
      m_TileColorIndex: 0
      m_TileObjectToInstantiateIndex: 65535
      dummyAlignment: 0
      m_AllTileFlags: 1073741825
  - first: {x: 1, y: -10, z: 0}
    second:
      serializedVersion: 2
      m_TileIndex: 48
      m_TileSpriteIndex: 48
      m_TileMatrixIndex: 0
      m_TileColorIndex: 0
      m_TileObjectToInstantiateIndex: 65535
      dummyAlignment: 0
      m_AllTileFlags: 1073741825
  - first: {x: 2, y: -10, z: 0}
    second:
      serializedVersion: 2
      m_TileIndex: 49
      m_TileSpriteIndex: 49
      m_TileMatrixIndex: 0
      m_TileColorIndex: 0
      m_TileObjectToInstantiateIndex: 65535
      dummyAlignment: 0
      m_AllTileFlags: 1073741825
  - first: {x: 3, y: -10, z: 0}
    second:
      serializedVersion: 2
      m_TileIndex: 50
      m_TileSpriteIndex: 50
      m_TileMatrixIndex: 0
      m_TileColorIndex: 0
      m_TileObjectToInstantiateIndex: 65535
      dummyAlignment: 0
      m_AllTileFlags: 1073741825
  - first: {x: 4, y: -10, z: 0}
    second:
      serializedVersion: 2
      m_TileIndex: 51
      m_TileSpriteIndex: 51
      m_TileMatrixIndex: 0
      m_TileColorIndex: 0
      m_TileObjectToInstantiateIndex: 65535
      dummyAlignment: 0
      m_AllTileFlags: 1073741825
  - first: {x: 5, y: -10, z: 0}
    second:
      serializedVersion: 2
      m_TileIndex: 52
      m_TileSpriteIndex: 52
      m_TileMatrixIndex: 0
      m_TileColorIndex: 0
      m_TileObjectToInstantiateIndex: 65535
      dummyAlignment: 0
      m_AllTileFlags: 1073741825
  - first: {x: 6, y: -10, z: 0}
    second:
      serializedVersion: 2
      m_TileIndex: 53
      m_TileSpriteIndex: 53
      m_TileMatrixIndex: 0
      m_TileColorIndex: 0
      m_TileObjectToInstantiateIndex: 65535
      dummyAlignment: 0
      m_AllTileFlags: 1073741825
  - first: {x: 7, y: -10, z: 0}
    second:
      serializedVersion: 2
      m_TileIndex: 54
      m_TileSpriteIndex: 54
      m_TileMatrixIndex: 0
      m_TileColorIndex: 0
      m_TileObjectToInstantiateIndex: 65535
      dummyAlignment: 0
      m_AllTileFlags: 1073741825
  - first: {x: 8, y: -10, z: 0}
    second:
      serializedVersion: 2
      m_TileIndex: 55
      m_TileSpriteIndex: 55
      m_TileMatrixIndex: 0
      m_TileColorIndex: 0
      m_TileObjectToInstantiateIndex: 65535
      dummyAlignment: 0
      m_AllTileFlags: 1073741825
  - first: {x: 9, y: -9, z: 0}
    second:
      serializedVersion: 2
      m_TileIndex: 43
      m_TileSpriteIndex: 43
      m_TileMatrixIndex: 0
      m_TileColorIndex: 0
      m_TileObjectToInstantiateIndex: 65535
      dummyAlignment: 0
      m_AllTileFlags: 1073741825
  - first: {x: 10, y: -9, z: 0}
    second:
      serializedVersion: 2
      m_TileIndex: 44
      m_TileSpriteIndex: 44
      m_TileMatrixIndex: 0
      m_TileColorIndex: 0
      m_TileObjectToInstantiateIndex: 65535
      dummyAlignment: 0
      m_AllTileFlags: 1073741825
  - first: {x: 11, y: -9, z: 0}
    second:
      serializedVersion: 2
      m_TileIndex: 45
      m_TileSpriteIndex: 45
      m_TileMatrixIndex: 0
      m_TileColorIndex: 0
      m_TileObjectToInstantiateIndex: 65535
      dummyAlignment: 0
      m_AllTileFlags: 1073741825
  - first: {x: 9, y: -8, z: 0}
    second:
      serializedVersion: 2
      m_TileIndex: 40
      m_TileSpriteIndex: 40
      m_TileMatrixIndex: 0
      m_TileColorIndex: 0
      m_TileObjectToInstantiateIndex: 65535
      dummyAlignment: 0
      m_AllTileFlags: 1073741825
  - first: {x: 10, y: -8, z: 0}
    second:
      serializedVersion: 2
      m_TileIndex: 41
      m_TileSpriteIndex: 41
      m_TileMatrixIndex: 0
      m_TileColorIndex: 0
      m_TileObjectToInstantiateIndex: 65535
      dummyAlignment: 0
      m_AllTileFlags: 1073741825
  - first: {x: 11, y: -8, z: 0}
    second:
      serializedVersion: 2
      m_TileIndex: 42
      m_TileSpriteIndex: 42
      m_TileMatrixIndex: 0
      m_TileColorIndex: 0
      m_TileObjectToInstantiateIndex: 65535
      dummyAlignment: 0
      m_AllTileFlags: 1073741825
  - first: {x: -1, y: -7, z: 0}
    second:
      serializedVersion: 2
      m_TileIndex: 30
      m_TileSpriteIndex: 30
      m_TileMatrixIndex: 0
      m_TileColorIndex: 0
      m_TileObjectToInstantiateIndex: 65535
      dummyAlignment: 0
      m_AllTileFlags: 1073741825
  - first: {x: 0, y: -7, z: 0}
    second:
      serializedVersion: 2
      m_TileIndex: 31
      m_TileSpriteIndex: 31
      m_TileMatrixIndex: 0
      m_TileColorIndex: 0
      m_TileObjectToInstantiateIndex: 65535
      dummyAlignment: 0
      m_AllTileFlags: 1073741825
  - first: {x: 1, y: -7, z: 0}
    second:
      serializedVersion: 2
      m_TileIndex: 32
      m_TileSpriteIndex: 32
      m_TileMatrixIndex: 0
      m_TileColorIndex: 0
      m_TileObjectToInstantiateIndex: 65535
      dummyAlignment: 0
      m_AllTileFlags: 1073741825
  - first: {x: 2, y: -7, z: 0}
    second:
      serializedVersion: 2
      m_TileIndex: 8
      m_TileSpriteIndex: 8
      m_TileMatrixIndex: 0
      m_TileColorIndex: 0
      m_TileObjectToInstantiateIndex: 65535
      dummyAlignment: 0
      m_AllTileFlags: 1073741825
  - first: {x: 3, y: -7, z: 0}
    second:
      serializedVersion: 2
      m_TileIndex: 7
      m_TileSpriteIndex: 7
      m_TileMatrixIndex: 0
      m_TileColorIndex: 0
      m_TileObjectToInstantiateIndex: 65535
      dummyAlignment: 0
      m_AllTileFlags: 1073741825
  - first: {x: 4, y: -7, z: 0}
    second:
      serializedVersion: 2
      m_TileIndex: 6
      m_TileSpriteIndex: 6
      m_TileMatrixIndex: 0
      m_TileColorIndex: 0
      m_TileObjectToInstantiateIndex: 65535
      dummyAlignment: 0
      m_AllTileFlags: 1073741825
  - first: {x: 5, y: -7, z: 0}
    second:
      serializedVersion: 2
      m_TileIndex: 33
      m_TileSpriteIndex: 33
      m_TileMatrixIndex: 0
      m_TileColorIndex: 0
      m_TileObjectToInstantiateIndex: 65535
      dummyAlignment: 0
      m_AllTileFlags: 1073741825
  - first: {x: 6, y: -7, z: 0}
    second:
      serializedVersion: 2
      m_TileIndex: 34
      m_TileSpriteIndex: 34
      m_TileMatrixIndex: 0
      m_TileColorIndex: 0
      m_TileObjectToInstantiateIndex: 65535
      dummyAlignment: 0
      m_AllTileFlags: 1073741825
  - first: {x: 7, y: -7, z: 0}
    second:
      serializedVersion: 2
      m_TileIndex: 35
      m_TileSpriteIndex: 35
      m_TileMatrixIndex: 0
      m_TileColorIndex: 0
      m_TileObjectToInstantiateIndex: 65535
      dummyAlignment: 0
      m_AllTileFlags: 1073741825
  - first: {x: 8, y: -7, z: 0}
    second:
      serializedVersion: 2
      m_TileIndex: 36
      m_TileSpriteIndex: 36
      m_TileMatrixIndex: 0
      m_TileColorIndex: 0
      m_TileObjectToInstantiateIndex: 65535
      dummyAlignment: 0
      m_AllTileFlags: 1073741825
  - first: {x: 9, y: -7, z: 0}
    second:
      serializedVersion: 2
      m_TileIndex: 37
      m_TileSpriteIndex: 37
      m_TileMatrixIndex: 0
      m_TileColorIndex: 0
      m_TileObjectToInstantiateIndex: 65535
      dummyAlignment: 0
      m_AllTileFlags: 1073741825
  - first: {x: 10, y: -7, z: 0}
    second:
      serializedVersion: 2
      m_TileIndex: 38
      m_TileSpriteIndex: 38
      m_TileMatrixIndex: 0
      m_TileColorIndex: 0
      m_TileObjectToInstantiateIndex: 65535
      dummyAlignment: 0
      m_AllTileFlags: 1073741825
  - first: {x: 11, y: -7, z: 0}
    second:
      serializedVersion: 2
      m_TileIndex: 39
      m_TileSpriteIndex: 39
      m_TileMatrixIndex: 0
      m_TileColorIndex: 0
      m_TileObjectToInstantiateIndex: 65535
      dummyAlignment: 0
      m_AllTileFlags: 1073741825
  - first: {x: -1, y: -6, z: 0}
    second:
      serializedVersion: 2
      m_TileIndex: 21
      m_TileSpriteIndex: 21
      m_TileMatrixIndex: 0
      m_TileColorIndex: 0
      m_TileObjectToInstantiateIndex: 65535
      dummyAlignment: 0
      m_AllTileFlags: 1073741825
  - first: {x: 0, y: -6, z: 0}
    second:
      serializedVersion: 2
      m_TileIndex: 0
      m_TileSpriteIndex: 0
      m_TileMatrixIndex: 0
      m_TileColorIndex: 0
      m_TileObjectToInstantiateIndex: 65535
      dummyAlignment: 0
      m_AllTileFlags: 1073741825
  - first: {x: 1, y: -6, z: 0}
    second:
      serializedVersion: 2
      m_TileIndex: 22
      m_TileSpriteIndex: 22
      m_TileMatrixIndex: 0
      m_TileColorIndex: 0
      m_TileObjectToInstantiateIndex: 65535
      dummyAlignment: 0
      m_AllTileFlags: 1073741825
  - first: {x: 2, y: -6, z: 0}
    second:
      serializedVersion: 2
      m_TileIndex: 9
      m_TileSpriteIndex: 9
      m_TileMatrixIndex: 0
      m_TileColorIndex: 0
      m_TileObjectToInstantiateIndex: 65535
      dummyAlignment: 0
      m_AllTileFlags: 1073741825
  - first: {x: 3, y: -6, z: 0}
    second:
      serializedVersion: 2
      m_TileIndex: 3
      m_TileSpriteIndex: 3
      m_TileMatrixIndex: 0
      m_TileColorIndex: 0
      m_TileObjectToInstantiateIndex: 65535
      dummyAlignment: 0
      m_AllTileFlags: 1073741825
  - first: {x: 4, y: -6, z: 0}
    second:
      serializedVersion: 2
      m_TileIndex: 5
      m_TileSpriteIndex: 5
      m_TileMatrixIndex: 0
      m_TileColorIndex: 0
      m_TileObjectToInstantiateIndex: 65535
      dummyAlignment: 0
      m_AllTileFlags: 1073741825
  - first: {x: 5, y: -6, z: 0}
    second:
      serializedVersion: 2
      m_TileIndex: 23
      m_TileSpriteIndex: 23
      m_TileMatrixIndex: 0
      m_TileColorIndex: 0
      m_TileObjectToInstantiateIndex: 65535
      dummyAlignment: 0
      m_AllTileFlags: 1073741825
  - first: {x: 6, y: -6, z: 0}
    second:
      serializedVersion: 2
      m_TileIndex: 24
      m_TileSpriteIndex: 24
      m_TileMatrixIndex: 0
      m_TileColorIndex: 0
      m_TileObjectToInstantiateIndex: 65535
      dummyAlignment: 0
      m_AllTileFlags: 1073741825
  - first: {x: 7, y: -6, z: 0}
    second:
      serializedVersion: 2
      m_TileIndex: 25
      m_TileSpriteIndex: 25
      m_TileMatrixIndex: 0
      m_TileColorIndex: 0
      m_TileObjectToInstantiateIndex: 65535
      dummyAlignment: 0
      m_AllTileFlags: 1073741825
  - first: {x: 8, y: -6, z: 0}
    second:
      serializedVersion: 2
      m_TileIndex: 26
      m_TileSpriteIndex: 26
      m_TileMatrixIndex: 0
      m_TileColorIndex: 0
      m_TileObjectToInstantiateIndex: 65535
      dummyAlignment: 0
      m_AllTileFlags: 1073741825
  - first: {x: 9, y: -6, z: 0}
    second:
      serializedVersion: 2
      m_TileIndex: 27
      m_TileSpriteIndex: 27
      m_TileMatrixIndex: 0
      m_TileColorIndex: 0
      m_TileObjectToInstantiateIndex: 65535
      dummyAlignment: 0
      m_AllTileFlags: 1073741825
  - first: {x: 10, y: -6, z: 0}
    second:
      serializedVersion: 2
      m_TileIndex: 28
      m_TileSpriteIndex: 28
      m_TileMatrixIndex: 0
      m_TileColorIndex: 0
      m_TileObjectToInstantiateIndex: 65535
      dummyAlignment: 0
      m_AllTileFlags: 1073741825
  - first: {x: 11, y: -6, z: 0}
    second:
      serializedVersion: 2
      m_TileIndex: 29
      m_TileSpriteIndex: 29
      m_TileMatrixIndex: 0
      m_TileColorIndex: 0
      m_TileObjectToInstantiateIndex: 65535
      dummyAlignment: 0
      m_AllTileFlags: 1073741825
  - first: {x: -1, y: -5, z: 0}
    second:
      serializedVersion: 2
      m_TileIndex: 11
      m_TileSpriteIndex: 11
      m_TileMatrixIndex: 0
      m_TileColorIndex: 0
      m_TileObjectToInstantiateIndex: 65535
      dummyAlignment: 0
      m_AllTileFlags: 1073741825
  - first: {x: 0, y: -5, z: 0}
    second:
      serializedVersion: 2
      m_TileIndex: 12
      m_TileSpriteIndex: 12
      m_TileMatrixIndex: 0
      m_TileColorIndex: 0
      m_TileObjectToInstantiateIndex: 65535
      dummyAlignment: 0
      m_AllTileFlags: 1073741825
  - first: {x: 1, y: -5, z: 0}
    second:
      serializedVersion: 2
      m_TileIndex: 13
      m_TileSpriteIndex: 13
      m_TileMatrixIndex: 0
      m_TileColorIndex: 0
      m_TileObjectToInstantiateIndex: 65535
      dummyAlignment: 0
      m_AllTileFlags: 1073741825
  - first: {x: 2, y: -5, z: 0}
    second:
      serializedVersion: 2
      m_TileIndex: 1
      m_TileSpriteIndex: 1
      m_TileMatrixIndex: 0
      m_TileColorIndex: 0
      m_TileObjectToInstantiateIndex: 65535
      dummyAlignment: 0
      m_AllTileFlags: 1073741825
  - first: {x: 3, y: -5, z: 0}
    second:
      serializedVersion: 2
      m_TileIndex: 2
      m_TileSpriteIndex: 2
      m_TileMatrixIndex: 0
      m_TileColorIndex: 0
      m_TileObjectToInstantiateIndex: 65535
      dummyAlignment: 0
      m_AllTileFlags: 1073741825
  - first: {x: 4, y: -5, z: 0}
    second:
      serializedVersion: 2
      m_TileIndex: 4
      m_TileSpriteIndex: 4
      m_TileMatrixIndex: 0
      m_TileColorIndex: 0
      m_TileObjectToInstantiateIndex: 65535
      dummyAlignment: 0
      m_AllTileFlags: 1073741825
  - first: {x: 5, y: -5, z: 0}
    second:
      serializedVersion: 2
      m_TileIndex: 14
      m_TileSpriteIndex: 14
      m_TileMatrixIndex: 0
      m_TileColorIndex: 0
      m_TileObjectToInstantiateIndex: 65535
      dummyAlignment: 0
      m_AllTileFlags: 1073741825
  - first: {x: 6, y: -5, z: 0}
    second:
      serializedVersion: 2
      m_TileIndex: 15
      m_TileSpriteIndex: 15
      m_TileMatrixIndex: 0
      m_TileColorIndex: 0
      m_TileObjectToInstantiateIndex: 65535
      dummyAlignment: 0
      m_AllTileFlags: 1073741825
  - first: {x: 7, y: -5, z: 0}
    second:
      serializedVersion: 2
      m_TileIndex: 16
      m_TileSpriteIndex: 16
      m_TileMatrixIndex: 0
      m_TileColorIndex: 0
      m_TileObjectToInstantiateIndex: 65535
      dummyAlignment: 0
      m_AllTileFlags: 1073741825
  - first: {x: 8, y: -5, z: 0}
    second:
      serializedVersion: 2
      m_TileIndex: 17
      m_TileSpriteIndex: 17
      m_TileMatrixIndex: 0
      m_TileColorIndex: 0
      m_TileObjectToInstantiateIndex: 65535
      dummyAlignment: 0
      m_AllTileFlags: 1073741825
  - first: {x: 9, y: -5, z: 0}
    second:
      serializedVersion: 2
      m_TileIndex: 18
      m_TileSpriteIndex: 18
      m_TileMatrixIndex: 0
      m_TileColorIndex: 0
      m_TileObjectToInstantiateIndex: 65535
      dummyAlignment: 0
      m_AllTileFlags: 1073741825
  - first: {x: 10, y: -5, z: 0}
    second:
      serializedVersion: 2
      m_TileIndex: 19
      m_TileSpriteIndex: 19
      m_TileMatrixIndex: 0
      m_TileColorIndex: 0
      m_TileObjectToInstantiateIndex: 65535
      dummyAlignment: 0
      m_AllTileFlags: 1073741825
  - first: {x: 11, y: -5, z: 0}
    second:
      serializedVersion: 2
      m_TileIndex: 20
      m_TileSpriteIndex: 20
      m_TileMatrixIndex: 0
      m_TileColorIndex: 0
      m_TileObjectToInstantiateIndex: 65535
      dummyAlignment: 0
      m_AllTileFlags: 1073741825
  - first: {x: 11, y: -4, z: 0}
    second:
      serializedVersion: 2
      m_TileIndex: 10
      m_TileSpriteIndex: 10
      m_TileMatrixIndex: 0
      m_TileColorIndex: 0
      m_TileObjectToInstantiateIndex: 65535
      dummyAlignment: 0
      m_AllTileFlags: 1073741825
  m_AnimatedTiles: {}
  m_TileAssetArray:
  - m_RefCount: 1
    m_Data: {fileID: 11400000, guid: cd7a399814bbbf54f89761a09c3a6b3a, type: 2}
  - m_RefCount: 1
    m_Data: {fileID: 11400000, guid: c6b40d42f0b85c245ac0472b79eeeebb, type: 2}
  - m_RefCount: 1
    m_Data: {fileID: 11400000, guid: 356238173bdfa3e4fb1e4f67818e2a19, type: 2}
  - m_RefCount: 1
    m_Data: {fileID: 11400000, guid: 2583adc4360c0164898485cde44b6657, type: 2}
  - m_RefCount: 1
    m_Data: {fileID: 11400000, guid: 0e8237cd89395dd40b2a0369e3ddd4c0, type: 2}
  - m_RefCount: 1
    m_Data: {fileID: 11400000, guid: 2a75eb93dab81064680edec95f73c6c1, type: 2}
  - m_RefCount: 1
    m_Data: {fileID: 11400000, guid: 035ad8d22e4cb5f40a7158edab786b39, type: 2}
  - m_RefCount: 1
    m_Data: {fileID: 11400000, guid: 7af83e65e32257948908cfb7c24960c9, type: 2}
  - m_RefCount: 1
    m_Data: {fileID: 11400000, guid: 65ed20204350b394cac7f5513df43021, type: 2}
  - m_RefCount: 1
    m_Data: {fileID: 11400000, guid: df2e8201d026781468381decdfd9edbb, type: 2}
  - m_RefCount: 1
    m_Data: {fileID: 11400000, guid: ef2a1131669db094b945c1e6275882e6, type: 2}
  - m_RefCount: 1
    m_Data: {fileID: 11400000, guid: 3ac9b2e857b197141866dc42833978c1, type: 2}
  - m_RefCount: 1
    m_Data: {fileID: 11400000, guid: e78c09e54c6f5dc48ab1ed7a982eb4af, type: 2}
  - m_RefCount: 1
    m_Data: {fileID: 11400000, guid: 4d5e7dd46d0601a40aa179183924ee78, type: 2}
  - m_RefCount: 1
    m_Data: {fileID: 11400000, guid: 8df7a0c908fcf25498a7473a17984698, type: 2}
  - m_RefCount: 1
    m_Data: {fileID: 11400000, guid: de07d019eac4e7c4a9c966127c7eb773, type: 2}
  - m_RefCount: 1
    m_Data: {fileID: 11400000, guid: 940c6c5eb69f96d48a19747a31bac461, type: 2}
  - m_RefCount: 1
    m_Data: {fileID: 11400000, guid: 61682005a5b93d84f9a5ce40f64e82c2, type: 2}
  - m_RefCount: 1
    m_Data: {fileID: 11400000, guid: 781b583e49c6bd844a9988b121e94f9c, type: 2}
  - m_RefCount: 1
    m_Data: {fileID: 11400000, guid: 0d5a7953385e288438d2a546320c96f8, type: 2}
  - m_RefCount: 1
    m_Data: {fileID: 11400000, guid: 38aa74547b509ef4aa8aad9e9d05be2b, type: 2}
  - m_RefCount: 1
    m_Data: {fileID: 11400000, guid: 0e1ae5e4e95bbbd44818ed1f2e69e956, type: 2}
  - m_RefCount: 1
    m_Data: {fileID: 11400000, guid: 809d386f10a1dc5418be8e7174430484, type: 2}
  - m_RefCount: 1
    m_Data: {fileID: 11400000, guid: 7d891cd7358e2094dab8b8a012ab9184, type: 2}
  - m_RefCount: 1
    m_Data: {fileID: 11400000, guid: b76cd4ff87388fb44992134a6a6edbcf, type: 2}
  - m_RefCount: 1
    m_Data: {fileID: 11400000, guid: eac083cf4714a904481af8ad747ca00f, type: 2}
  - m_RefCount: 1
    m_Data: {fileID: 11400000, guid: 6ea6c14d232155240876bfb78c24b520, type: 2}
  - m_RefCount: 1
    m_Data: {fileID: 11400000, guid: c38538913ef829942aeb3be564c4f44a, type: 2}
  - m_RefCount: 1
    m_Data: {fileID: 11400000, guid: 83e1e99a70a8ca947939fadbbd3d45ce, type: 2}
  - m_RefCount: 1
    m_Data: {fileID: 11400000, guid: b9e1a2e3a779dcf4b8bb09dd525425cf, type: 2}
  - m_RefCount: 1
    m_Data: {fileID: 11400000, guid: f4ac750ab287a1f4481f69f200af29c8, type: 2}
  - m_RefCount: 1
    m_Data: {fileID: 11400000, guid: d8e742a2c85f572419a20224ef9877eb, type: 2}
  - m_RefCount: 1
    m_Data: {fileID: 11400000, guid: f435ef8cdb9acdc4281c6910c5b96a1c, type: 2}
  - m_RefCount: 1
    m_Data: {fileID: 11400000, guid: fd3699be5aab4f9459226bc161aa6794, type: 2}
  - m_RefCount: 1
    m_Data: {fileID: 11400000, guid: b3f7486c091ccf54e96fcc6c731d3b72, type: 2}
  - m_RefCount: 1
    m_Data: {fileID: 11400000, guid: 45fb25a34adbf4e42809908fcced43d6, type: 2}
  - m_RefCount: 1
    m_Data: {fileID: 11400000, guid: 836a46400fe9c8a47bb0ba5e1605f30b, type: 2}
  - m_RefCount: 1
    m_Data: {fileID: 11400000, guid: a6cd23eec286c6b4092d17141dc953e3, type: 2}
  - m_RefCount: 1
    m_Data: {fileID: 11400000, guid: e614c76a23dec5d419adc4ff4ec05dae, type: 2}
  - m_RefCount: 1
    m_Data: {fileID: 11400000, guid: 7554348334476fc4fa4cad726c5d4441, type: 2}
  - m_RefCount: 1
    m_Data: {fileID: 11400000, guid: ecaa6a1f3350bb243b5e6bbb416d4b35, type: 2}
  - m_RefCount: 1
    m_Data: {fileID: 11400000, guid: a6671d51f2ace634fbb6c3061a421557, type: 2}
  - m_RefCount: 1
    m_Data: {fileID: 11400000, guid: 1f09677165191434c8f0d6677ff5147e, type: 2}
  - m_RefCount: 1
    m_Data: {fileID: 11400000, guid: 832ac766c49b11c498531c8dfd09d827, type: 2}
  - m_RefCount: 1
    m_Data: {fileID: 11400000, guid: a14e018dd0c173f4db999583134313f1, type: 2}
  - m_RefCount: 1
    m_Data: {fileID: 11400000, guid: bd38fb6051692d049bc5f8d63a3b69f2, type: 2}
  - m_RefCount: 1
    m_Data: {fileID: 11400000, guid: a1338fbb9a892ed408b761c8c5d3e3e4, type: 2}
  - m_RefCount: 1
    m_Data: {fileID: 11400000, guid: b74a2f83ee0cade4cacf41bd5cd297f1, type: 2}
  - m_RefCount: 1
    m_Data: {fileID: 11400000, guid: 8bd2f20fbfeff334aafc092f83576db0, type: 2}
  - m_RefCount: 1
    m_Data: {fileID: 11400000, guid: 3863bc80c5dc4b74e8b035bfd5155001, type: 2}
  - m_RefCount: 1
    m_Data: {fileID: 11400000, guid: 9651d185849297845b1c64079b10e52d, type: 2}
  - m_RefCount: 1
    m_Data: {fileID: 11400000, guid: 4cc5a21b101aa154cbf948df6b6b8f9b, type: 2}
  - m_RefCount: 1
    m_Data: {fileID: 11400000, guid: 2ccc5c9934fafab4aacbdeda94bfd31c, type: 2}
  - m_RefCount: 1
    m_Data: {fileID: 11400000, guid: ecaf9bc891a1f7a488821a66cf993d53, type: 2}
  - m_RefCount: 1
    m_Data: {fileID: 11400000, guid: c177ce14d228c724b9e7365fed11a53a, type: 2}
  - m_RefCount: 1
    m_Data: {fileID: 11400000, guid: 833d64800ec1a3b4bb7223e79ac7e457, type: 2}
  - m_RefCount: 1
    m_Data: {fileID: 11400000, guid: f8a88d422fabda348a9f25fbdc300327, type: 2}
  - m_RefCount: 1
    m_Data: {fileID: 11400000, guid: 3e67b812a38dbc242ba78814410c726a, type: 2}
  - m_RefCount: 1
    m_Data: {fileID: 11400000, guid: 99f7b439a3529824d82a1886720ea88c, type: 2}
  - m_RefCount: 1
    m_Data: {fileID: 11400000, guid: 5ea9b96286041354ea031e248913ccd5, type: 2}
  - m_RefCount: 1
    m_Data: {fileID: 11400000, guid: d11a8e2dfdb0f1c45a34acf4bace3e0f, type: 2}
  - m_RefCount: 1
    m_Data: {fileID: 11400000, guid: 582faf137157cc540af2d7f6f4b2043e, type: 2}
  - m_RefCount: 1
    m_Data: {fileID: 11400000, guid: abdd604259aa998458088c6652b78e25, type: 2}
  - m_RefCount: 1
    m_Data: {fileID: 11400000, guid: bd59cdc313c892c4995e297c39a7f41c, type: 2}
  - m_RefCount: 1
    m_Data: {fileID: 11400000, guid: c8dcbc54db65d2b428d9e991ddb9c913, type: 2}
  - m_RefCount: 1
    m_Data: {fileID: 11400000, guid: 6ff92ece0a742aa449b39902568daf6a, type: 2}
  m_TileSpriteArray:
  - m_RefCount: 1
    m_Data: {fileID: 8511941498467895906, guid: c3fed5899b78d9f4193fd80d208e1e96, type: 3}
  - m_RefCount: 1
    m_Data: {fileID: -7494106648621461862, guid: c3fed5899b78d9f4193fd80d208e1e96, type: 3}
  - m_RefCount: 1
    m_Data: {fileID: -1166844522321172827, guid: c3fed5899b78d9f4193fd80d208e1e96, type: 3}
  - m_RefCount: 1
    m_Data: {fileID: 4075576004778400724, guid: c3fed5899b78d9f4193fd80d208e1e96, type: 3}
  - m_RefCount: 1
    m_Data: {fileID: -2337796041394638852, guid: c3fed5899b78d9f4193fd80d208e1e96, type: 3}
  - m_RefCount: 1
    m_Data: {fileID: 2411795176034838000, guid: c3fed5899b78d9f4193fd80d208e1e96, type: 3}
  - m_RefCount: 1
    m_Data: {fileID: 9173456359599217151, guid: c3fed5899b78d9f4193fd80d208e1e96, type: 3}
  - m_RefCount: 1
    m_Data: {fileID: 6158769643538725623, guid: c3fed5899b78d9f4193fd80d208e1e96, type: 3}
  - m_RefCount: 1
    m_Data: {fileID: -8144232874795706680, guid: c3fed5899b78d9f4193fd80d208e1e96, type: 3}
  - m_RefCount: 1
    m_Data: {fileID: 4596826443012605067, guid: c3fed5899b78d9f4193fd80d208e1e96, type: 3}
  - m_RefCount: 1
    m_Data: {fileID: -2283052586193448194, guid: c3fed5899b78d9f4193fd80d208e1e96, type: 3}
  - m_RefCount: 1
    m_Data: {fileID: 6280338427971999693, guid: c3fed5899b78d9f4193fd80d208e1e96, type: 3}
  - m_RefCount: 1
    m_Data: {fileID: 1200374505527675911, guid: c3fed5899b78d9f4193fd80d208e1e96, type: 3}
  - m_RefCount: 1
    m_Data: {fileID: 8315901428889589683, guid: c3fed5899b78d9f4193fd80d208e1e96, type: 3}
  - m_RefCount: 1
    m_Data: {fileID: -2194238617236972529, guid: c3fed5899b78d9f4193fd80d208e1e96, type: 3}
  - m_RefCount: 1
    m_Data: {fileID: -860324858844477922, guid: c3fed5899b78d9f4193fd80d208e1e96, type: 3}
  - m_RefCount: 1
    m_Data: {fileID: -5270676608762058033, guid: c3fed5899b78d9f4193fd80d208e1e96, type: 3}
  - m_RefCount: 1
    m_Data: {fileID: 1141981346991693218, guid: c3fed5899b78d9f4193fd80d208e1e96, type: 3}
  - m_RefCount: 1
    m_Data: {fileID: 4204536313378385754, guid: c3fed5899b78d9f4193fd80d208e1e96, type: 3}
  - m_RefCount: 1
    m_Data: {fileID: 7919060643604297541, guid: c3fed5899b78d9f4193fd80d208e1e96, type: 3}
  - m_RefCount: 1
    m_Data: {fileID: -5301111988632358046, guid: c3fed5899b78d9f4193fd80d208e1e96, type: 3}
  - m_RefCount: 1
    m_Data: {fileID: -3370972733334551957, guid: c3fed5899b78d9f4193fd80d208e1e96, type: 3}
  - m_RefCount: 1
    m_Data: {fileID: 6402092735575239365, guid: c3fed5899b78d9f4193fd80d208e1e96, type: 3}
  - m_RefCount: 1
    m_Data: {fileID: -86792208848789382, guid: c3fed5899b78d9f4193fd80d208e1e96, type: 3}
  - m_RefCount: 1
    m_Data: {fileID: 7742142104684057720, guid: c3fed5899b78d9f4193fd80d208e1e96, type: 3}
  - m_RefCount: 1
    m_Data: {fileID: -3164114747371572134, guid: c3fed5899b78d9f4193fd80d208e1e96, type: 3}
  - m_RefCount: 1
    m_Data: {fileID: -4767365504189926035, guid: c3fed5899b78d9f4193fd80d208e1e96, type: 3}
  - m_RefCount: 1
    m_Data: {fileID: -2287018604316172352, guid: c3fed5899b78d9f4193fd80d208e1e96, type: 3}
  - m_RefCount: 1
    m_Data: {fileID: -4512813760466996047, guid: c3fed5899b78d9f4193fd80d208e1e96, type: 3}
  - m_RefCount: 1
    m_Data: {fileID: -4787557475376736130, guid: c3fed5899b78d9f4193fd80d208e1e96, type: 3}
  - m_RefCount: 1
    m_Data: {fileID: -6922010206444219608, guid: c3fed5899b78d9f4193fd80d208e1e96, type: 3}
  - m_RefCount: 1
    m_Data: {fileID: -8407825828113272028, guid: c3fed5899b78d9f4193fd80d208e1e96, type: 3}
  - m_RefCount: 1
    m_Data: {fileID: 8084123141180333078, guid: c3fed5899b78d9f4193fd80d208e1e96, type: 3}
  - m_RefCount: 1
    m_Data: {fileID: 8463943453179303408, guid: c3fed5899b78d9f4193fd80d208e1e96, type: 3}
  - m_RefCount: 1
    m_Data: {fileID: -5954169288640704311, guid: c3fed5899b78d9f4193fd80d208e1e96, type: 3}
  - m_RefCount: 1
    m_Data: {fileID: 5435640960597048326, guid: c3fed5899b78d9f4193fd80d208e1e96, type: 3}
  - m_RefCount: 1
    m_Data: {fileID: -8660746625831347465, guid: c3fed5899b78d9f4193fd80d208e1e96, type: 3}
  - m_RefCount: 1
    m_Data: {fileID: 3484122683161034666, guid: c3fed5899b78d9f4193fd80d208e1e96, type: 3}
  - m_RefCount: 1
    m_Data: {fileID: 6348775854790515859, guid: c3fed5899b78d9f4193fd80d208e1e96, type: 3}
  - m_RefCount: 1
    m_Data: {fileID: 4261682983329686121, guid: c3fed5899b78d9f4193fd80d208e1e96, type: 3}
  - m_RefCount: 1
    m_Data: {fileID: -2219077197227555543, guid: c3fed5899b78d9f4193fd80d208e1e96, type: 3}
  - m_RefCount: 1
    m_Data: {fileID: 4612124193346825159, guid: c3fed5899b78d9f4193fd80d208e1e96, type: 3}
  - m_RefCount: 1
    m_Data: {fileID: 5461303501783362541, guid: c3fed5899b78d9f4193fd80d208e1e96, type: 3}
  - m_RefCount: 1
    m_Data: {fileID: -5130317023355411320, guid: c3fed5899b78d9f4193fd80d208e1e96, type: 3}
  - m_RefCount: 1
    m_Data: {fileID: -8662941561141747559, guid: c3fed5899b78d9f4193fd80d208e1e96, type: 3}
  - m_RefCount: 1
    m_Data: {fileID: -7357290062171824989, guid: c3fed5899b78d9f4193fd80d208e1e96, type: 3}
  - m_RefCount: 1
    m_Data: {fileID: 1313460756146097360, guid: c3fed5899b78d9f4193fd80d208e1e96, type: 3}
  - m_RefCount: 1
    m_Data: {fileID: -3401220965286212287, guid: c3fed5899b78d9f4193fd80d208e1e96, type: 3}
  - m_RefCount: 1
    m_Data: {fileID: -3065198713219609010, guid: c3fed5899b78d9f4193fd80d208e1e96, type: 3}
  - m_RefCount: 1
    m_Data: {fileID: 208132757551309133, guid: c3fed5899b78d9f4193fd80d208e1e96, type: 3}
  - m_RefCount: 1
    m_Data: {fileID: -6669560876661948423, guid: c3fed5899b78d9f4193fd80d208e1e96, type: 3}
  - m_RefCount: 1
    m_Data: {fileID: 409110527828349059, guid: c3fed5899b78d9f4193fd80d208e1e96, type: 3}
  - m_RefCount: 1
    m_Data: {fileID: -5577029699016820757, guid: c3fed5899b78d9f4193fd80d208e1e96, type: 3}
  - m_RefCount: 1
    m_Data: {fileID: 6689255155560123585, guid: c3fed5899b78d9f4193fd80d208e1e96, type: 3}
  - m_RefCount: 1
    m_Data: {fileID: 3978895120430971694, guid: c3fed5899b78d9f4193fd80d208e1e96, type: 3}
  - m_RefCount: 1
    m_Data: {fileID: -9072193610720822824, guid: c3fed5899b78d9f4193fd80d208e1e96, type: 3}
  - m_RefCount: 1
    m_Data: {fileID: 5931243735437797264, guid: c3fed5899b78d9f4193fd80d208e1e96, type: 3}
  - m_RefCount: 1
    m_Data: {fileID: 1148911136633193944, guid: c3fed5899b78d9f4193fd80d208e1e96, type: 3}
  - m_RefCount: 1
    m_Data: {fileID: -6361407543971089500, guid: c3fed5899b78d9f4193fd80d208e1e96, type: 3}
  - m_RefCount: 1
    m_Data: {fileID: -4463805826906947070, guid: c3fed5899b78d9f4193fd80d208e1e96, type: 3}
  - m_RefCount: 1
    m_Data: {fileID: 9126501794000508660, guid: c3fed5899b78d9f4193fd80d208e1e96, type: 3}
  - m_RefCount: 1
    m_Data: {fileID: 2504056109234003283, guid: c3fed5899b78d9f4193fd80d208e1e96, type: 3}
  - m_RefCount: 1
    m_Data: {fileID: 8997417342969506988, guid: c3fed5899b78d9f4193fd80d208e1e96, type: 3}
  - m_RefCount: 1
    m_Data: {fileID: -7402943896241192817, guid: c3fed5899b78d9f4193fd80d208e1e96, type: 3}
  - m_RefCount: 1
    m_Data: {fileID: -4595750681089273097, guid: c3fed5899b78d9f4193fd80d208e1e96, type: 3}
  - m_RefCount: 1
    m_Data: {fileID: -4520126965016470911, guid: c3fed5899b78d9f4193fd80d208e1e96, type: 3}
  m_TileMatrixArray:
  - m_RefCount: 66
    m_Data:
      e00: 1
      e01: 0
      e02: 0
      e03: 0
      e10: 0
      e11: 1
      e12: 0
      e13: 0
      e20: 0
      e21: 0
      e22: 1
      e23: 0
      e30: 0
      e31: 0
      e32: 0
      e33: 1
  m_TileColorArray:
  - m_RefCount: 66
    m_Data: {r: 1, g: 1, b: 1, a: 1}
  m_TileObjectToInstantiateArray: []
  m_AnimationFrameRate: 1
  m_Color: {r: 1, g: 1, b: 1, a: 1}
  m_Origin: {x: -1, y: -11, z: 0}
  m_Size: {x: 13, y: 11, z: 1}
  m_TileAnchor: {x: 0.5, y: 0.5, z: 0}
  m_TileOrientation: 0
  m_TileOrientationMatrix:
    e00: 1
    e01: 0
    e02: 0
    e03: 0
    e10: 0
    e11: 1
    e12: 0
    e13: 0
    e20: 0
    e21: 0
    e22: 1
    e23: 0
    e30: 0
    e31: 0
    e32: 0
    e33: 1
--- !u!483693784 &3892346728527524762
TilemapRenderer:
  m_ObjectHideFlags: 0
  m_CorrespondingSourceObject: {fileID: 0}
  m_PrefabInstance: {fileID: 0}
  m_PrefabAsset: {fileID: 0}
  m_GameObject: {fileID: 7278842424424194691}
  m_Enabled: 1
  m_CastShadows: 0
  m_ReceiveShadows: 0
  m_DynamicOccludee: 0
  m_MotionVectors: 1
  m_LightProbeUsage: 0
  m_ReflectionProbeUsage: 0
  m_RayTracingMode: 0
  m_RayTraceProcedural: 0
  m_RenderingLayerMask: 1
  m_RendererPriority: 0
  m_Materials:
  - {fileID: 10754, guid: 0000000000000000f000000000000000, type: 0}
  m_StaticBatchInfo:
    firstSubMesh: 0
    subMeshCount: 0
  m_StaticBatchRoot: {fileID: 0}
  m_ProbeAnchor: {fileID: 0}
  m_LightProbeVolumeOverride: {fileID: 0}
  m_ScaleInLightmap: 1
  m_ReceiveGI: 1
  m_PreserveUVs: 0
  m_IgnoreNormalsForChartDetection: 0
  m_ImportantGI: 0
  m_StitchLightmapSeams: 1
  m_SelectedEditorRenderState: 0
  m_MinimumChartSize: 4
  m_AutoUVMaxDistance: 0.5
  m_AutoUVMaxAngle: 89
  m_LightmapParameters: {fileID: 0}
  m_SortingLayerID: 0
  m_SortingLayer: 0
  m_SortingOrder: 0
  m_ChunkSize: {x: 32, y: 32, z: 32}
  m_ChunkCullingBounds: {x: 0, y: 0, z: 0}
  m_MaxChunkCount: 16
  m_MaxFrameAge: 16
  m_SortOrder: 0
  m_Mode: 0
  m_DetectChunkCullingBounds: 0
  m_MaskInteraction: 0
--- !u!114 &2268532823116839884
MonoBehaviour:
  m_ObjectHideFlags: 0
  m_CorrespondingSourceObject: {fileID: 0}
  m_PrefabInstance: {fileID: 0}
  m_PrefabAsset: {fileID: 0}
  m_GameObject: {fileID: 0}
  m_Enabled: 1
  m_EditorHideFlags: 0
  m_Script: {fileID: 12395, guid: 0000000000000000e000000000000000, type: 0}
  m_Name: Palette Settings
  m_EditorClassIdentifier: 
  cellSizing: 0
  m_TransparencySortMode: 0
  m_TransparencySortAxis: {x: 0, y: 0, z: 1}
