%YAML 1.1
%TAG !u! tag:unity3d.com,2011:
--- !u!114 &11400000
MonoBehaviour:
  m_ObjectHideFlags: 0
  m_CorrespondingSourceObject: {fileID: 0}
  m_PrefabInstance: {fileID: 0}
  m_PrefabAsset: {fileID: 0}
  m_GameObject: {fileID: 0}
  m_Enabled: 1
  m_EditorHideFlags: 0
  m_Script: {fileID: 11500000, guid: 06275af8eadaacc488fcf8372c69d6ba, type: 3}
  m_Name: New Inventory Item Data
  m_EditorClassIdentifier: 
  id: InventoryItem_Carrote
  displayName: Carrotte
  icon: {fileID: 0}
  prefab: {fileID: 2851352755243734528, guid: dad3d1ee9b776f14c9f65e9d52370d7b, type: 3}
