Fixed typo

29 jobs for master in 25 minutes and 18 seconds (queued for 1 second)
latest
Status Job ID Name Coverage
  Prebuild
passed #115334085
clone test repo

00:01:03

passed #115334089
dep check

00:01:20

passed #115334084
docker
helper images

00:03:58

manual #115334086
allowed to fail manual
review-docs-deploy
passed #115334088
gitlab-org
tests definitions

00:02:34

 
  Test
passed #115334090
code_quality

00:01:14

passed #115334108
docs check links

00:00:45

passed #115334109
git 1.7.1

00:02:05

passed #115334092
docker
unit tests 0 5

00:05:54

passed #115334095
docker
unit tests 1 5

00:11:10

passed #115334098
docker
unit tests 2 5

00:09:16

passed #115334101
docker
unit tests 3 5

00:03:04

passed #115334102
docker
unit tests 4 5

00:04:22

passed #115334103
docker allowed to fail
unit tests with race 0 5

00:06:42

failed #115334104
docker allowed to fail
unit tests with race 1 5

00:11:56

failed #115334105
docker allowed to fail
unit tests with race 2 5

00:09:43

passed #115334106
docker allowed to fail
unit tests with race 3 5

00:03:21

failed #115334107
docker allowed to fail
unit tests with race 4 5

00:05:00

 
  Coverage
passed #115334111
race conditions detector

00:00:52

passed #115334110
test coverage report

00:00:48

55.4%
passed #115334113
test junit report

00:01:13

 
  Build
passed #115334116
gitlab-org
binaries darwin/386 darwin/amd64

00:03:50

passed #115334118
gitlab-org
binaries freebsd/386 freebsd/amd64 freebsd/arm

00:05:18

passed #115334120
gitlab-org
binaries linux/386 linux/amd64 linux/arm

00:04:47

passed #115334122
gitlab-org
binaries windows/386 windows/amd64

00:03:20

 
  Package
passed #115334123
gitlab-org
package-deb

00:01:46

passed #115334126
gitlab-org
package-rpm

00:02:13

 
  Release
passed #115334129
static QA

00:00:28

 
  Cleanup
manual #115334130
allowed to fail manual
review-docs-cleanup
 
Name Stage Failure
failed
unit tests with race 4 5 Test
coverage: 14.3% of statements
ok gitlab.com/gitlab-org/gitlab-runner/shells 1.052s
Makefile:134: recipe for target 'parallel_test_execute' failed
make: *** [parallel_test_execute] Error 1
Uploading artifacts...
.cover/*: found 8 matching files
.testoutput/*: found 8 matching files

Uploading artifacts to coordinator... ok
id=115334107 responseStatus=201 Created token=PDJPGQAL
ERROR: Job failed: exit code 1
failed
unit tests with race 2 5 Test
coverage: 3.7% of statements
ok gitlab.com/gitlab-org/gitlab-runner/executors/virtualbox 1.042s
Makefile:134: recipe for target 'parallel_test_execute' failed
make: *** [parallel_test_execute] Error 1
Uploading artifacts...
.cover/*: found 11 matching files
.testoutput/*: found 11 matching files

Uploading artifacts to coordinator... ok
id=115334105 responseStatus=201 Created token=TJ3V-vYh
ERROR: Job failed: exit code 1
failed
unit tests with race 1 5 Test
coverage: 49.7% of statements
ok gitlab.com/gitlab-org/gitlab-runner/executors/docker/machine 1.052s
Makefile:134: recipe for target 'parallel_test_execute' failed
make: *** [parallel_test_execute] Error 1
Uploading artifacts...
.cover/*: found 11 matching files
.testoutput/*: found 11 matching files

Uploading artifacts to coordinator... ok
id=115334104 responseStatus=201 Created token=zvAQ4vC6
ERROR: Job failed: exit code 1