#ip 5          # F = IP
addi 5 16 5    0: GOTO 17              F += 16             F = F+16
seti 1 9 1     1: B = 1
seti 1 5 4     2: E = 1
mulr 1 4 3     3: D = B*E
eqrr 3 2 3     4: D = D==C
addr 3 5 5     5: IF B*E==C GOTO 7     F += D              F = D+F
addi 5 1 5     6: GOTO 8               F += 1              F = F+1
addr 1 0 0     7: A += B               A = B+A
                  IF B*C==C THEN A += B
addi 4 1 4     8: E += 1               E = 1+E
gtrr 4 2 3     9: D = E>C
addr 5 3 5    10: IF E>C GOTO 12       F += D              F = F+D
seti 2 4 5    11: GOTO 3               F = 2
addi 1 1 1    12: B += 1               B = B+1
gtrr 1 2 3    13: D = B>C
addr 3 5 5    14: IF B>C GOTO 16       F += D              F = D+F
seti 1 9 5    15: GOTO 2               F = 1
mulr 5 5 5    16: HALT                 F = 256             F = F*F
addi 2 2 2    17: C += 2               C = C+2
mulr 2 2 2    18: C = C*C
mulr 5 2 2    19: C *= 19              C = F*C
muli 2 11 2   20: C = C*11
                  C = ((C+2)**2)*19*11 (C=0 => C=836)
addi 3 8 3    21: D = D+8
mulr 3 5 3    22: D *= 22              D = F*D
addi 3 16 3   23: D = D+16
                  D = (D+8)*22+16 (D=0 => D=192)
addr 2 3 2    24: C = C+D
                  C = 1028
addr 5 0 5    25: IF A==1 GOTO 27      F += A              F = F+A
seti 0 7 5    26: GOTO 1               F = 0               F = A
setr 5 3 3    27: D = 27               D = F
mulr 3 5 3    28: D = 756              D *= 28              D = D*F
addr 5 3 3    29: D = 785              D += 29              D = F+D
mulr 5 3 3    30: D = 23550            D *= 30              D = F*D
muli 3 14 3   31: D = 329700           D = D*14
mulr 3 5 3    32: D = 10550400         D *= 32              D = D*F
addr 2 3 2    33: C = 10551428         C = C+D
seti 0 1 0    34: A = 0
seti 0 6 5    35: GOTO 1               F = 0


Instruction 0 jumps to 17

Instructions 17-35 set up C to 1028 or 10551428
Then starts the program at 1

Instructions 1-16 sums up the divisors of C in A
