<?xml version="1.0" encoding="UTF-8" standalone="no"?>
<svg
   xmlns:dc="http://purl.org/dc/elements/1.1/"
   xmlns:cc="http://creativecommons.org/ns#"
   xmlns:rdf="http://www.w3.org/1999/02/22-rdf-syntax-ns#"
   xmlns:svg="http://www.w3.org/2000/svg"
   xmlns="http://www.w3.org/2000/svg"
   xmlns:sodipodi="http://sodipodi.sourceforge.net/DTD/sodipodi-0.dtd"
   xmlns:inkscape="http://www.inkscape.org/namespaces/inkscape"
   width="60"
   height="60"
   viewBox="0 0 15.874999 15.875001"
   version="1.1"
   id="svg8"
   inkscape:version="1.0.1 (3bc2e81, 2020-09-07)"
   sodipodi:docname="alien.svg"
   inkscape:export-filename="/home/genji/SCUOLA/2020-2021_zuccante/materiali/zuccante_src/java_game/move_aliens/img/alien.png"
   inkscape:export-xdpi="27"
   inkscape:export-ydpi="27">
  <defs
     id="defs2" />
  <sodipodi:namedview
     id="base"
     pagecolor="#ffffff"
     bordercolor="#666666"
     borderopacity="1.0"
     inkscape:pageopacity="0.0"
     inkscape:pageshadow="2"
     inkscape:zoom="2.8"
     inkscape:cx="6.4685719"
     inkscape:cy="52.397487"
     inkscape:document-units="px"
     inkscape:current-layer="layer1"
     inkscape:document-rotation="0"
     showgrid="false"
     units="px"
     inkscape:window-width="1478"
     inkscape:window-height="870"
     inkscape:window-x="122"
     inkscape:window-y="77"
     inkscape:window-maximized="0" />
  <metadata
     id="metadata5">
    <rdf:RDF>
      <cc:Work
         rdf:about="">
        <dc:format>image/svg+xml</dc:format>
        <dc:type
           rdf:resource="http://purl.org/dc/dcmitype/StillImage" />
        <dc:title></dc:title>
      </cc:Work>
    </rdf:RDF>
  </metadata>
  <g
     inkscape:label="Layer 1"
     inkscape:groupmode="layer"
     id="layer1">
    <path
       sodipodi:type="star"
       style="fill:#ff8080;stroke-width:0"
       id="path833"
       sodipodi:sides="5"
       sodipodi:cx="5.4882865"
       sodipodi:cy="5.5974007"
       sodipodi:r1="4.8652968"
       sodipodi:r2="2.3249681"
       sodipodi:arg1="-2.1228492"
       sodipodi:arg2="-1.4945307"
       inkscape:flatsided="false"
       inkscape:rounded="0"
       inkscape:randomized="0"
       d="M 2.9367485,1.4548451 5.6654298,3.2791908 8.6396224,1.8906237 7.7477754,5.0495077 9.9874572,7.4490421 6.7075841,7.5769941 5.117591,10.448555 3.982365,7.3687496 0.76001337,6.7439375 3.3382782,4.7125611 Z"
       inkscape:transform-center-x="0.26889988"
       inkscape:transform-center-y="-0.1662639"
       transform="matrix(1.7087021,-0.12146388,0.12520008,1.5638557,-1.9923345,0.13996188)" />
    <g
       id="g989"
       transform="matrix(0.02284974,0,0,0.0209174,1.124063,0.63561583)"
       style="fill:#ffff73;fill-opacity:1">
      <path
         d="M 64.601,236.822 C 64.601,394.256 192.786,612 306.001,612 412.582,612 547.4,394.256 547.4,236.822 547.4,79.388 439.322,0 306,0 172.678,0 64.601,79.388 64.601,236.822 Z m 304.12,116.415 c 29.475,-29.475 70.598,-40.195 108.552,-32.173 8.021,37.954 -2.698,79.077 -32.173,108.552 -29.475,29.475 -70.598,40.195 -108.552,32.173 -8.022,-37.955 2.698,-79.078 32.173,-108.552 z M 134.727,321.063 c 37.954,-8.021 79.077,2.698 108.552,32.173 29.475,29.475 40.195,70.598 32.173,108.552 -37.954,8.021 -79.077,-2.698 -108.552,-32.173 -29.475,-29.476 -40.194,-70.598 -32.173,-108.552 z"
         id="path987"
         style="fill:#ffff73;fill-opacity:1;stroke:#800080" />
    </g>
  </g>
</svg>
