<?xml version="1.0" encoding="UTF-8" standalone="no"?>
<svg
   xmlns:dc="http://purl.org/dc/elements/1.1/"
   xmlns:cc="http://creativecommons.org/ns#"
   xmlns:rdf="http://www.w3.org/1999/02/22-rdf-syntax-ns#"
   xmlns:svg="http://www.w3.org/2000/svg"
   xmlns="http://www.w3.org/2000/svg"
   xmlns:xlink="http://www.w3.org/1999/xlink"
   xmlns:sodipodi="http://sodipodi.sourceforge.net/DTD/sodipodi-0.dtd"
   xmlns:inkscape="http://www.inkscape.org/namespaces/inkscape"
   width="40"
   height="20"
   viewBox="0 0 40 20"
   version="1.1"
   id="svg8"
   inkscape:version="1.0.1 (3bc2e81, 2020-09-07)"
   sodipodi:docname="missile.svg"
   inkscape:export-filename="/home/genji/SCUOLA/2020-2021_zuccante/materiali/zuccante_src/java_game/move_sprite/img/missile.png"
   inkscape:export-xdpi="96"
   inkscape:export-ydpi="96">
  <defs
     id="defs2">
    <linearGradient
       inkscape:collect="always"
       id="linearGradient936">
      <stop
         style="stop-color:#ff1f00;stop-opacity:1"
         offset="0"
         id="stop932" />
      <stop
         style="stop-color:#ffafa4;stop-opacity:1"
         offset="1"
         id="stop934" />
    </linearGradient>
    <linearGradient
       inkscape:collect="always"
       id="linearGradient847">
      <stop
         style="stop-color:#ffff00;stop-opacity:1;"
         offset="0"
         id="stop843" />
      <stop
         style="stop-color:#ffffff;stop-opacity:1"
         offset="1"
         id="stop845" />
    </linearGradient>
    <linearGradient
       inkscape:collect="always"
       xlink:href="#linearGradient847"
       id="linearGradient849"
       x1="2.2336345"
       y1="3.1224203"
       x2="2.2442684"
       y2="0.84771854"
       gradientUnits="userSpaceOnUse"
       gradientTransform="matrix(7.4608947,0,0,7.0831445,3.2384553,0.40120269)" />
    <linearGradient
       inkscape:collect="always"
       xlink:href="#linearGradient936"
       id="linearGradient938"
       x1="4.5560694"
       y1="1.8084013"
       x2="4.5445609"
       y2="0.91457212"
       gradientUnits="userSpaceOnUse"
       gradientTransform="matrix(7.4608947,0,0,7.0831445,3.2384553,0.39432277)" />
  </defs>
  <sodipodi:namedview
     id="base"
     pagecolor="#ffffff"
     bordercolor="#666666"
     borderopacity="1.0"
     inkscape:pageopacity="0.0"
     inkscape:pageshadow="2"
     inkscape:zoom="7.919596"
     inkscape:cx="38.352522"
     inkscape:cy="17.579882"
     inkscape:document-units="px"
     inkscape:current-layer="layer1"
     inkscape:document-rotation="0"
     showgrid="false"
     units="px"
     inkscape:window-width="1427"
     inkscape:window-height="870"
     inkscape:window-x="279"
     inkscape:window-y="205"
     inkscape:window-maximized="0" />
  <metadata
     id="metadata5">
    <rdf:RDF>
      <cc:Work
         rdf:about="">
        <dc:format>image/svg+xml</dc:format>
        <dc:type
           rdf:resource="http://purl.org/dc/dcmitype/StillImage" />
        <dc:title></dc:title>
      </cc:Work>
    </rdf:RDF>
  </metadata>
  <g
     inkscape:label="Layer 1"
     inkscape:groupmode="layer"
     id="layer1">
    <rect
       style="fill:url(#linearGradient849);fill-opacity:1;stroke:#000000;stroke-width:1.92341;stroke-opacity:0"
       id="rect833"
       width="21.521818"
       height="6.5400801"
       x="8.965929"
       y="6.6199493" />
    <path
       id="path906"
       style="fill:url(#linearGradient938);fill-opacity:1;stroke:none;stroke-width:0.0525033;stroke-miterlimit:4;stroke-dasharray:0.0525033, 0.210013;stroke-dashoffset:0;stroke-opacity:1"
       d="m 30.487746,6.6130689 v 6.5469601 a 10.245527,5.0736799 0 0 0 8.890838,-3.2381582 10.245527,5.0736799 0 0 0 0,-0.002 10.245527,5.0736799 0 0 0 -8.890838,-3.306888 z" />
    <path
       style="fill:#76b8fc;fill-opacity:1;fill-rule:nonzero;stroke:#000000;stroke-width:0;stroke-linecap:butt;stroke-linejoin:miter;stroke-miterlimit:4;stroke-dasharray:none;stroke-opacity:1"
       d="m 12.980694,6.7596526 h 5.670814 L 15.188488,1.0652168 H 7.0165951 Z"
       id="path942" />
    <path
       style="fill:#76b8fc;fill-opacity:1;fill-rule:nonzero;stroke:#000000;stroke-width:0;stroke-linecap:butt;stroke-linejoin:miter;stroke-miterlimit:4;stroke-dasharray:none;stroke-opacity:1"
       d="m 12.754981,13.20623 h 5.670814 l -3.46302,5.694436 H 6.7908813 Z"
       id="path942-7" />
    <rect
       style="fill:#76b8fc;fill-opacity:1;fill-rule:nonzero;stroke:none;stroke-width:0;stroke-miterlimit:4;stroke-dasharray:none;stroke-dashoffset:0;stroke-opacity:1"
       id="rect959"
       width="9.3991585"
       height="0.58739185"
       x="9.0945845"
       y="9.9761705" />
    <path
       id="path906-6"
       style="fill:#fffc35;fill-opacity:1;stroke:none;stroke-width:0.0470495;stroke-miterlimit:4;stroke-dasharray:0.0470495, 0.188199;stroke-dashoffset:0;stroke-opacity:1"
       d="m 9.0402158,7.22486 v 5.257495 a 10.245527,4.0743871 0 0 1 -8.89083769,-2.6003822 10.245527,4.0743871 0 0 1 0,-0.0016 10.245527,4.0743871 0 0 1 8.89083769,-2.6555763 z" />
    <path
       id="path906-6-2"
       style="fill:#ffcd00;fill-opacity:1;stroke:none;stroke-width:0.037734;stroke-miterlimit:4;stroke-dasharray:0.037734, 0.150935;stroke-dashoffset:0;stroke-opacity:1"
       d="m 9.0402158,8.1738717 v 3.3816863 a 10.245527,2.6206959 0 0 1 -8.89083769,-1.6725972 10.245527,2.6206959 0 0 1 0,-9.79e-4 10.245527,2.6206959 0 0 1 8.89083769,-1.7081013 z" />
    <rect
       style="fill:#808080;fill-opacity:1;fill-rule:nonzero;stroke:none;stroke-width:0;stroke-miterlimit:4;stroke-dasharray:none;stroke-dashoffset:0;stroke-opacity:1"
       id="rect1036"
       width="0.81893367"
       height="6.5400801"
       x="8.965929"
       y="6.6199493" />
  </g>
</svg>
