138-01/12/2023-31/12/2023
94-01/11/2023-31/11/2023
60-01/10/2023-31/10/2023
60-01/09/2023-31/09/2023
90-01/07/2023-31/07/2023
70-01/06/2023-31/06/2023
71-01/05/2023-31/05/2023
62-01/04/2023-31/04/2023
60-01/03/2023-31/03/2023
76-01/02/2023-31/02/2023
75-01/01/2023-31/01/2023