# Blender v2.78 (sub 0) OBJ File: 'model.blend'
# www.blender.org
mtllib model.mtl
o Torus
v 4.403766 0.000000 0.000000
v 4.285767 0.440377 0.000000
v 3.963389 0.762755 0.000000
v 3.523013 0.880753 0.000000
v 3.082636 0.762755 0.000000
v 2.760258 0.440377 0.000000
v 2.642260 0.000000 0.000000
v 2.760258 -0.440377 0.000000
v 3.082636 -0.762755 0.000000
v 3.523013 -0.880753 0.000000
v 3.963389 -0.762755 0.000000
v 4.285767 -0.440377 0.000000
v 4.366091 0.000000 -0.574807
v 4.249102 0.440377 -0.559405
v 3.929482 0.762755 -0.517326
v 3.492873 0.880753 -0.459845
v 3.056263 0.762755 -0.402365
v 2.736644 0.440377 -0.360286
v 2.619655 0.000000 -0.344884
v 2.736644 -0.440377 -0.360286
v 3.056263 -0.762755 -0.402365
v 3.492873 -0.880753 -0.459845
v 3.929482 -0.762755 -0.517326
v 4.249102 -0.440377 -0.559405
v 4.253711 0.000000 -1.139778
v 4.139734 0.440377 -1.109238
v 3.828341 0.762755 -1.025800
v 3.402969 0.880753 -0.911822
v 2.977598 0.762755 -0.797845
v 2.666204 0.440377 -0.714407
v 2.552227 0.000000 -0.683867
v 2.666204 -0.440377 -0.714407
v 2.977598 -0.762755 -0.797845
v 3.402969 -0.880753 -0.911822
v 3.828341 -0.762755 -1.025800
v 4.139734 -0.440377 -1.109238
v 4.068550 0.000000 -1.685248
v 3.959533 0.440377 -1.640092
v 3.661695 0.762755 -1.516723
v 3.254840 0.880753 -1.348198
v 2.847985 0.762755 -1.179673
v 2.550146 0.440377 -1.056305
v 2.441130 0.000000 -1.011149
v 2.550146 -0.440377 -1.056305
v 2.847985 -0.762755 -1.179673
v 3.254840 -0.880753 -1.348198
v 3.661695 -0.762755 -1.516723
v 3.959533 -0.440377 -1.640092
v 3.813773 0.000000 -2.201883
v 3.711583 0.440377 -2.142884
v 3.432395 0.762755 -1.981695
v 3.051018 0.880753 -1.761507
v 2.669641 0.762755 -1.541318
v 2.390453 0.440377 -1.380129
v 2.288264 0.000000 -1.321130
v 2.390453 -0.440377 -1.380129
v 2.669641 -0.762755 -1.541318
v 3.051018 -0.880753 -1.761507
v 3.432395 -0.762755 -1.981695
v 3.711583 -0.440377 -2.142884
v 3.493743 0.000000 -2.680842
v 3.400128 0.440377 -2.609009
v 3.144368 0.762755 -2.412758
v 2.794994 0.880753 -2.144674
v 2.445620 0.762755 -1.876590
v 2.189860 0.440377 -1.680338
v 2.096246 0.000000 -1.608505
v 2.189860 -0.440377 -1.680338
v 2.445620 -0.762755 -1.876590
v 2.794994 -0.880753 -2.144674
v 3.144368 -0.762755 -2.412758
v 3.400128 -0.440377 -2.609009
v 3.113933 0.000000 -3.113933
v 3.030495 0.440377 -3.030495
v 2.802539 0.762755 -2.802539
v 2.491146 0.880753 -2.491146
v 2.179753 0.762755 -2.179753
v 1.951797 0.440377 -1.951797
v 1.868359 0.000000 -1.868359
v 1.951797 -0.440377 -1.951797
v 2.179753 -0.762755 -2.179753
v 2.491146 -0.880753 -2.491146
v 2.802539 -0.762755 -2.802539
v 3.030495 -0.440377 -3.030495
v 2.680843 0.000000 -3.493742
v 2.609010 0.440377 -3.400127
v 2.412759 0.762755 -3.144367
v 2.144675 0.880753 -2.794993
v 1.876590 0.762755 -2.445619
v 1.680339 0.440377 -2.189859
v 1.608506 0.000000 -2.096245
v 1.680339 -0.440377 -2.189859
v 1.876590 -0.762755 -2.445619
v 2.144675 -0.880753 -2.794993
v 2.412759 -0.762755 -3.144367
v 2.609010 -0.440377 -3.400127
v 2.201883 0.000000 -3.813772
v 2.142884 0.440377 -3.711583
v 1.981695 0.762755 -3.432395
v 1.761506 0.880753 -3.051018
v 1.541318 0.762755 -2.669641
v 1.380129 0.440377 -2.390453
v 1.321130 0.000000 -2.288264
v 1.380129 -0.440377 -2.390453
v 1.541318 -0.762755 -2.669641
v 1.761506 -0.880753 -3.051018
v 1.981695 -0.762755 -3.432395
v 2.142884 -0.440377 -3.711583
v 1.685249 0.000000 -4.068548
v 1.640093 0.440377 -3.959531
v 1.516724 0.762755 -3.661693
v 1.348199 0.880753 -3.254838
v 1.179674 0.762755 -2.847984
v 1.056305 0.440377 -2.550145
v 1.011149 0.000000 -2.441129
v 1.056305 -0.440377 -2.550145
v 1.179674 -0.762755 -2.847984
v 1.348199 -0.880753 -3.254838
v 1.516724 -0.762755 -3.661693
v 1.640093 -0.440377 -3.959531
v 1.139778 0.000000 -4.253711
v 1.109238 0.440377 -4.139733
v 1.025800 0.762755 -3.828340
v 0.911823 0.880753 -3.402968
v 0.797845 0.762755 -2.977597
v 0.714407 0.440377 -2.666204
v 0.683867 0.000000 -2.552226
v 0.714407 -0.440377 -2.666204
v 0.797845 -0.762755 -2.977597
v 0.911823 -0.880753 -3.402968
v 1.025800 -0.762755 -3.828340
v 1.109238 -0.440377 -4.139733
v 0.574806 0.000000 -4.366091
v 0.559404 0.440377 -4.249102
v 0.517326 0.762755 -3.929482
v 0.459845 0.880753 -3.492873
v 0.402364 0.762755 -3.056263
v 0.360286 0.440377 -2.736643
v 0.344884 0.000000 -2.619654
v 0.360286 -0.440377 -2.736643
v 0.402364 -0.762755 -3.056263
v 0.459845 -0.880753 -3.492873
v 0.517326 -0.762755 -3.929482
v 0.559404 -0.440377 -4.249102
v 0.000000 0.000000 -4.403766
v 0.000000 0.440377 -4.285767
v 0.000000 0.762755 -3.963389
v 0.000000 0.880753 -3.523012
v 0.000000 0.762755 -3.082636
v 0.000000 0.440377 -2.760258
v 0.000000 0.000000 -2.642259
v 0.000000 -0.440377 -2.760258
v 0.000000 -0.762755 -3.082636
v 0.000000 -0.880753 -3.523012
v 0.000000 -0.762755 -3.963389
v 0.000000 -0.440377 -4.285767
v -0.574808 0.000000 -4.366090
v -0.559406 0.440377 -4.249102
v -0.517327 0.762755 -3.929482
v -0.459846 0.880753 -3.492872
v -0.402365 0.762755 -3.056263
v -0.360286 0.440377 -2.736643
v -0.344885 0.000000 -2.619654
v -0.360286 -0.440377 -2.736643
v -0.402365 -0.762755 -3.056263
v -0.459846 -0.880753 -3.492872
v -0.517327 -0.762755 -3.929482
v -0.559406 -0.440377 -4.249102
v -1.139778 0.000000 -4.253711
v -1.109238 0.440377 -4.139733
v -1.025800 0.762755 -3.828340
v -0.911822 0.880753 -3.402969
v -0.797845 0.762755 -2.977598
v -0.714407 0.440377 -2.666204
v -0.683867 0.000000 -2.552227
v -0.714407 -0.440377 -2.666204
v -0.797845 -0.762755 -2.977598
v -0.911822 -0.880753 -3.402969
v -1.025800 -0.762755 -3.828340
v -1.109238 -0.440377 -4.139733
v -1.685249 0.000000 -4.068548
v -1.640093 0.440377 -3.959532
v -1.516724 0.762755 -3.661694
v -1.348199 0.880753 -3.254839
v -1.179674 0.762755 -2.847984
v -1.056305 0.440377 -2.550146
v -1.011149 0.000000 -2.441129
v -1.056305 -0.440377 -2.550146
v -1.179674 -0.762755 -2.847984
v -1.348199 -0.880753 -3.254839
v -1.516724 -0.762755 -3.661694
v -1.640093 -0.440377 -3.959532
v -2.201882 0.000000 -3.813773
v -2.142884 0.440377 -3.711583
v -1.981694 0.762755 -3.432396
v -1.761506 0.880753 -3.051019
v -1.541318 0.762755 -2.669641
v -1.380129 0.440377 -2.390454
v -1.321129 0.000000 -2.288264
v -1.380129 -0.440377 -2.390454
v -1.541318 -0.762755 -2.669641
v -1.761506 -0.880753 -3.051019
v -1.981694 -0.762755 -3.432396
v -2.142884 -0.440377 -3.711583
v -2.680843 0.000000 -3.493742
v -2.609010 0.440377 -3.400127
v -2.412759 0.762755 -3.144368
v -2.144675 0.880753 -2.794994
v -1.876590 0.762755 -2.445619
v -1.680339 0.440377 -2.189860
v -1.608506 0.000000 -2.096245
v -1.680339 -0.440377 -2.189860
v -1.876590 -0.762755 -2.445619
v -2.144675 -0.880753 -2.794994
v -2.412759 -0.762755 -3.144368
v -2.609010 -0.440377 -3.400127
v -3.113933 0.000000 -3.113931
v -3.030496 0.440377 -3.030494
v -2.802540 0.762755 -2.802538
v -2.491147 0.880753 -2.491145
v -2.179753 0.762755 -2.179752
v -1.951797 0.440377 -1.951796
v -1.868360 0.000000 -1.868359
v -1.951797 -0.440377 -1.951796
v -2.179753 -0.762755 -2.179752
v -2.491147 -0.880753 -2.491145
v -2.802540 -0.762755 -2.802538
v -3.030496 -0.440377 -3.030494
v -3.493742 0.000000 -2.680843
v -3.400128 0.440377 -2.609010
v -3.144368 0.762755 -2.412758
v -2.794994 0.880753 -2.144674
v -2.445620 0.762755 -1.876590
v -2.189860 0.440377 -1.680338
v -2.096245 0.000000 -1.608506
v -2.189860 -0.440377 -1.680338
v -2.445620 -0.762755 -1.876590
v -2.794994 -0.880753 -2.144674
v -3.144368 -0.762755 -2.412758
v -3.400128 -0.440377 -2.609010
v -3.813772 0.000000 -2.201884
v -3.711583 0.440377 -2.142884
v -3.432395 0.762755 -1.981696
v -3.051018 0.880753 -1.761507
v -2.669641 0.762755 -1.541319
v -2.390453 0.440377 -1.380130
v -2.288264 0.000000 -1.321131
v -2.390453 -0.440377 -1.380130
v -2.669641 -0.762755 -1.541319
v -3.051018 -0.880753 -1.761507
v -3.432395 -0.762755 -1.981696
v -3.711583 -0.440377 -2.142884
v -4.068549 0.000000 -1.685248
v -3.959532 0.440377 -1.640092
v -3.661694 0.762755 -1.516723
v -3.254839 0.880753 -1.348199
v -2.847984 0.762755 -1.179674
v -2.550146 0.440377 -1.056305
v -2.441129 0.000000 -1.011149
v -2.550146 -0.440377 -1.056305
v -2.847984 -0.762755 -1.179674
v -3.254839 -0.880753 -1.348199
v -3.661694 -0.762755 -1.516723
v -3.959532 -0.440377 -1.640092
v -4.253711 0.000000 -1.139778
v -4.139734 0.440377 -1.109238
v -3.828341 0.762755 -1.025800
v -3.402969 0.880753 -0.911822
v -2.977598 0.762755 -0.797844
v -2.666204 0.440377 -0.714407
v -2.552227 0.000000 -0.683867
v -2.666204 -0.440377 -0.714407
v -2.977598 -0.762755 -0.797844
v -3.402969 -0.880753 -0.911822
v -3.828341 -0.762755 -1.025800
v -4.139734 -0.440377 -1.109238
v -4.366091 0.000000 -0.574807
v -4.249102 0.440377 -0.559405
v -3.929482 0.762755 -0.517326
v -3.492873 0.880753 -0.459846
v -3.056263 0.762755 -0.402365
v -2.736644 0.440377 -0.360286
v -2.619655 0.000000 -0.344884
v -2.736644 -0.440377 -0.360286
v -3.056263 -0.762755 -0.402365
v -3.492873 -0.880753 -0.459846
v -3.929482 -0.762755 -0.517326
v -4.249102 -0.440377 -0.559405
v -4.403766 0.000000 -0.000000
v -4.285767 0.440377 -0.000000
v -3.963389 0.762755 -0.000000
v -3.523013 0.880753 -0.000000
v -3.082636 0.762755 -0.000000
v -2.760258 0.440377 -0.000000
v -2.642260 0.000000 -0.000000
v -2.760258 -0.440377 -0.000000
v -3.082636 -0.762755 -0.000000
v -3.523013 -0.880753 -0.000000
v -3.963389 -0.762755 -0.000000
v -4.285767 -0.440377 -0.000000
v -4.366091 0.000000 0.574808
v -4.249102 0.440377 0.559406
v -3.929482 0.762755 0.517327
v -3.492873 0.880753 0.459846
v -3.056263 0.762755 0.402365
v -2.736644 0.440377 0.360287
v -2.619655 0.000000 0.344885
v -2.736644 -0.440377 0.360287
v -3.056263 -0.762755 0.402365
v -3.492873 -0.880753 0.459846
v -3.929482 -0.762755 0.517327
v -4.249102 -0.440377 0.559406
v -4.253711 0.000000 1.139778
v -4.139734 0.440377 1.109238
v -3.828341 0.762755 1.025800
v -3.402969 0.880753 0.911822
v -2.977598 0.762755 0.797845
v -2.666204 0.440377 0.714407
v -2.552227 0.000000 0.683867
v -2.666204 -0.440377 0.714407
v -2.977598 -0.762755 0.797845
v -3.402969 -0.880753 0.911822
v -3.828341 -0.762755 1.025800
v -4.139734 -0.440377 1.109238
v -4.068550 0.000000 1.685247
v -3.959534 0.440377 1.640091
v -3.661695 0.762755 1.516722
v -3.254840 0.880753 1.348197
v -2.847985 0.762755 1.179673
v -2.550146 0.440377 1.056304
v -2.441130 0.000000 1.011148
v -2.550146 -0.440377 1.056304
v -2.847985 -0.762755 1.179673
v -3.254840 -0.880753 1.348197
v -3.661695 -0.762755 1.516722
v -3.959534 -0.440377 1.640091
v -3.813774 0.000000 2.201882
v -3.711584 0.440377 2.142883
v -3.432396 0.762755 1.981694
v -3.051019 0.880753 1.761506
v -2.669642 0.762755 1.541318
v -2.390454 0.440377 1.380129
v -2.288264 0.000000 1.321129
v -2.390454 -0.440377 1.380129
v -2.669642 -0.762755 1.541318
v -3.051019 -0.880753 1.761506
v -3.432396 -0.762755 1.981694
v -3.711584 -0.440377 2.142883
v -3.493742 0.000000 2.680843
v -3.400128 0.440377 2.609010
v -3.144368 0.762755 2.412759
v -2.794994 0.880753 2.144675
v -2.445620 0.762755 1.876590
v -2.189860 0.440377 1.680339
v -2.096245 0.000000 1.608506
v -2.189860 -0.440377 1.680339
v -2.445620 -0.762755 1.876590
v -2.794994 -0.880753 2.144675
v -3.144368 -0.762755 2.412759
v -3.400128 -0.440377 2.609010
v -3.113933 0.000000 3.113932
v -3.030496 0.440377 3.030495
v -2.802540 0.762755 2.802539
v -2.491147 0.880753 2.491146
v -2.179753 0.762755 2.179753
v -1.951797 0.440377 1.951797
v -1.868360 0.000000 1.868359
v -1.951797 -0.440377 1.951797
v -2.179753 -0.762755 2.179753
v -2.491147 -0.880753 2.491146
v -2.802540 -0.762755 2.802539
v -3.030496 -0.440377 3.030495
v -2.680845 0.000000 3.493741
v -2.609012 0.440377 3.400126
v -2.412760 0.762755 3.144367
v -2.144676 0.880753 2.794993
v -1.876591 0.762755 2.445619
v -1.680340 0.440377 2.189859
v -1.608507 0.000000 2.096245
v -1.680340 -0.440377 2.189859
v -1.876591 -0.762755 2.445619
v -2.144676 -0.880753 2.794993
v -2.412760 -0.762755 3.144367
v -2.609012 -0.440377 3.400126
v -2.201882 0.000000 3.813774
v -2.142884 0.440377 3.711584
v -1.981694 0.762755 3.432396
v -1.761506 0.880753 3.051019
v -1.541318 0.762755 2.669642
v -1.380129 0.440377 2.390454
v -1.321129 0.000000 2.288264
v -1.380129 -0.440377 2.390454
v -1.541318 -0.762755 2.669642
v -1.761506 -0.880753 3.051019
v -1.981694 -0.762755 3.432396
v -2.142884 -0.440377 3.711584
v -1.685249 0.000000 4.068549
v -1.640093 0.440377 3.959532
v -1.516724 0.762755 3.661695
v -1.348199 0.880753 3.254839
v -1.179674 0.762755 2.847984
v -1.056305 0.440377 2.550146
v -1.011149 0.000000 2.441130
v -1.056305 -0.440377 2.550146
v -1.179674 -0.762755 2.847984
v -1.348199 -0.880753 3.254839
v -1.516724 -0.762755 3.661695
v -1.640093 -0.440377 3.959532
v -1.139780 0.000000 4.253711
v -1.109239 0.440377 4.139733
v -1.025802 0.762755 3.828340
v -0.911824 0.880753 3.402969
v -0.797846 0.762755 2.977598
v -0.714408 0.440377 2.666205
v -0.683868 0.000000 2.552227
v -0.714408 -0.440377 2.666205
v -0.797846 -0.762755 2.977598
v -0.911824 -0.880753 3.402969
v -1.025802 -0.762755 3.828340
v -1.109239 -0.440377 4.139733
v -0.574810 0.000000 4.366091
v -0.559408 0.440377 4.249102
v -0.517329 0.762755 3.929482
v -0.459848 0.880753 3.492872
v -0.402367 0.762755 3.056263
v -0.360288 0.440377 2.736643
v -0.344886 0.000000 2.619654
v -0.360288 -0.440377 2.736643
v -0.402367 -0.762755 3.056263
v -0.459848 -0.880753 3.492872
v -0.517329 -0.762755 3.929482
v -0.559408 -0.440377 4.249102
v 0.000000 0.000000 4.403767
v 0.000000 0.440377 4.285768
v 0.000000 0.762755 3.963390
v 0.000000 0.880753 3.523013
v 0.000000 0.762755 3.082637
v 0.000000 0.440377 2.760258
v 0.000000 0.000000 2.642260
v 0.000000 -0.440377 2.760258
v 0.000000 -0.762755 3.082637
v 0.000000 -0.880753 3.523013
v 0.000000 -0.762755 3.963390
v 0.000000 -0.440377 4.285768
v 0.574806 0.000000 4.366091
v 0.559404 0.440377 4.249103
v 0.517326 0.762755 3.929482
v 0.459845 0.880753 3.492873
v 0.402364 0.762755 3.056264
v 0.360286 0.440377 2.736644
v 0.344884 0.000000 2.619655
v 0.360286 -0.440377 2.736644
v 0.402364 -0.762755 3.056264
v 0.459845 -0.880753 3.492873
v 0.517326 -0.762755 3.929482
v 0.559404 -0.440377 4.249103
v 1.139776 0.000000 4.253712
v 1.109236 0.440377 4.139734
v 1.025799 0.762755 3.828341
v 0.911821 0.880753 3.402969
v 0.797844 0.762755 2.977598
v 0.714406 0.440377 2.666205
v 0.683866 0.000000 2.552227
v 0.714406 -0.440377 2.666205
v 0.797844 -0.762755 2.977598
v 0.911821 -0.880753 3.402969
v 1.025799 -0.762755 3.828341
v 1.109236 -0.440377 4.139734
v 1.685249 0.000000 4.068549
v 1.640093 0.440377 3.959532
v 1.516724 0.762755 3.661694
v 1.348199 0.880753 3.254839
v 1.179674 0.762755 2.847984
v 1.056305 0.440377 2.550146
v 1.011149 0.000000 2.441129
v 1.056305 -0.440377 2.550146
v 1.179674 -0.762755 2.847984
v 1.348199 -0.880753 3.254839
v 1.516724 -0.762755 3.661694
v 1.640093 -0.440377 3.959532
v 2.201883 0.000000 3.813773
v 2.142884 0.440377 3.711584
v 1.981695 0.762755 3.432396
v 1.761506 0.880753 3.051019
v 1.541318 0.762755 2.669641
v 1.380129 0.440377 2.390454
v 1.321130 0.000000 2.288264
v 1.380129 -0.440377 2.390454
v 1.541318 -0.762755 2.669641
v 1.761506 -0.880753 3.051019
v 1.981695 -0.762755 3.432396
v 2.142884 -0.440377 3.711584
v 2.680842 0.000000 3.493743
v 2.609009 0.440377 3.400129
v 2.412758 0.762755 3.144369
v 2.144674 0.880753 2.794995
v 1.876590 0.762755 2.445620
v 1.680338 0.440377 2.189861
v 1.608505 0.000000 2.096246
v 1.680338 -0.440377 2.189861
v 1.876590 -0.762755 2.445620
v 2.144674 -0.880753 2.794995
v 2.412758 -0.762755 3.144369
v 2.609009 -0.440377 3.400129
v 3.113931 0.000000 3.113935
v 3.030493 0.440377 3.030497
v 2.802537 0.762755 2.802541
v 2.491145 0.880753 2.491148
v 2.179752 0.762755 2.179754
v 1.951796 0.440377 1.951798
v 1.868359 0.000000 1.868361
v 1.951796 -0.440377 1.951798
v 2.179752 -0.762755 2.179754
v 2.491145 -0.880753 2.491148
v 2.802537 -0.762755 2.802541
v 3.030493 -0.440377 3.030497
v 3.493743 0.000000 2.680842
v 3.400128 0.440377 2.609010
v 3.144368 0.762755 2.412758
v 2.794994 0.880753 2.144674
v 2.445620 0.762755 1.876590
v 2.189860 0.440377 1.680339
v 2.096246 0.000000 1.608506
v 2.189860 -0.440377 1.680339
v 2.445620 -0.762755 1.876590
v 2.794994 -0.880753 2.144674
v 3.144368 -0.762755 2.412758
v 3.400128 -0.440377 2.609010
v 3.813773 0.000000 2.201884
v 3.711583 0.440377 2.142884
v 3.432395 0.762755 1.981695
v 3.051018 0.880753 1.761507
v 2.669641 0.762755 1.541318
v 2.390453 0.440377 1.380129
v 2.288264 0.000000 1.321130
v 2.390453 -0.440377 1.380129
v 2.669641 -0.762755 1.541318
v 3.051018 -0.880753 1.761507
v 3.432395 -0.762755 1.981695
v 3.711583 -0.440377 2.142884
v 4.068549 0.000000 1.685250
v 3.959532 0.440377 1.640094
v 3.661694 0.762755 1.516725
v 3.254839 0.880753 1.348200
v 2.847984 0.762755 1.179675
v 2.550145 0.440377 1.056306
v 2.441129 0.000000 1.011150
v 2.550145 -0.440377 1.056306
v 2.847984 -0.762755 1.179675
v 3.254839 -0.880753 1.348200
v 3.661694 -0.762755 1.516725
v 3.959532 -0.440377 1.640094
v 4.253712 0.000000 1.139777
v 4.139734 0.440377 1.109237
v 3.828341 0.762755 1.025800
v 3.402969 0.880753 0.911822
v 2.977598 0.762755 0.797844
v 2.666205 0.440377 0.714407
v 2.552227 0.000000 0.683867
v 2.666205 -0.440377 0.714407
v 2.977598 -0.762755 0.797844
v 3.402969 -0.880753 0.911822
v 3.828341 -0.762755 1.025800
v 4.139734 -0.440377 1.109237
v 4.366091 0.000000 0.574807
v 4.249102 0.440377 0.559405
v 3.929482 0.762755 0.517326
v 3.492873 0.880753 0.459845
v 3.056263 0.762755 0.402365
v 2.736644 0.440377 0.360286
v 2.619655 0.000000 0.344884
v 2.736644 -0.440377 0.360286
v 3.056263 -0.762755 0.402365
v 3.492873 -0.880753 0.459845
v 3.929482 -0.762755 0.517326
v 4.249102 -0.440377 0.559405
vt 0.2000 0.8322
vt 0.2468 0.8683
vt 0.2000 0.9374
vt 0.1446 0.8945
vt 0.1492 1.0124
vt 0.0845 0.9621
vt 0.0971 1.0892
vt 0.0228 1.0315
vt 0.0448 1.1666
vt -0.0392 1.1013
vt -0.0083 1.2455
vt -0.1024 1.1728
vt -0.1691 1.2468
vt -0.0660 1.3301
vt 0.2979 0.8980
vt 0.2606 0.9727
vt 0.2200 1.0537
vt 0.1784 1.1369
vt 0.1367 1.2205
vt 0.0944 1.3062
vt 0.0495 1.3973
vt 0.3525 0.9208
vt 0.3253 0.9997
vt 0.2957 1.0854
vt 0.2654 1.1734
vt 0.2351 1.2619
vt 0.2045 1.3523
vt 0.1722 1.4483
vt 0.4097 0.9363
vt 0.3930 1.0181
vt 0.3749 1.1069
vt 0.3564 1.1981
vt 0.3380 1.2898
vt 0.3196 1.3835
vt 0.3002 1.4827
vt 0.4683 0.9441
vt 0.4625 1.0275
vt 0.4563 1.1177
vt 0.4499 1.2107
vt 0.4437 1.3040
vt 0.4377 1.3992
vt 0.4315 1.5001
vt 0.5275 0.9442
vt 0.5326 1.0275
vt 0.5384 1.1183
vt 0.5442 1.2110
vt 0.5502 1.3042
vt 0.5568 1.3993
vt 0.5638 1.5001
vt 0.5863 0.9365
vt 0.6023 1.0185
vt 0.6197 1.1076
vt 0.6376 1.1989
vt 0.6559 1.2905
vt 0.6748 1.3839
vt 0.6949 1.4828
vt 0.6435 0.9213
vt 0.6701 1.0005
vt 0.6990 1.0864
vt 0.7287 1.1745
vt 0.7589 1.2631
vt 0.7896 1.3531
vt 0.8226 1.4485
vt 0.6982 0.8987
vt 0.7349 0.9737
vt 0.7747 1.0551
vt 0.8157 1.1384
vt 0.8571 1.2219
vt 0.8995 1.3074
vt 0.9447 1.3977
vt 0.7495 0.8692
vt 0.7956 0.9387
vt 0.8457 1.0141
vt 0.8972 1.0914
vt 0.9492 1.1689
vt 1.0025 1.2478
vt 1.0591 1.3313
vt 0.7964 0.8332
vt 0.8512 0.8961
vt 0.9107 0.9643
vt 0.9719 1.0341
vt 1.0335 1.1041
vt 1.0967 1.1752
vt 1.1636 1.2505
vt 0.8382 0.7914
vt 0.9008 0.8466
vt 0.9687 0.9064
vt 1.0383 0.9676
vt 1.1085 1.0289
vt 1.1804 1.0911
vt 1.2566 1.1568
vt 0.8742 0.7446
vt 0.9434 0.7911
vt 1.0185 0.8415
vt 1.0955 0.8931
vt 1.1731 0.9446
vt 1.2524 0.9968
vt 1.3363 1.0520
vt 0.9038 0.6935
vt 0.9784 0.7305
vt 1.0594 0.7707
vt 1.1424 0.8117
vt 1.2260 0.8527
vt 1.3113 0.8941
vt 1.4015 0.9378
vt 0.9264 0.6390
vt 1.0051 0.6659
vt 1.0907 0.6951
vt 1.1783 0.7250
vt 1.2665 0.7548
vt 1.3565 0.7847
vt 1.4512 0.8164
vt 0.9417 0.5820
vt 1.0232 0.5984
vt 1.1118 0.6162
vt 1.2026 0.6343
vt 1.2940 0.6524
vt 1.3875 0.6705
vt 1.4849 0.6902
vt 0.9494 0.5235
vt 1.0323 0.5291
vt 1.1224 0.5352
vt 1.2148 0.5413
vt 1.3076 0.5472
vt 1.4022 0.5528
vt 1.5040 0.5595
vt 0.9494 0.4646
vt 1.0323 0.4593
vt 1.1223 0.4535
vt 1.2147 0.4474
vt 1.3075 0.4410
vt 1.4023 0.4340
vt 1.5032 0.4265
vt 0.9416 0.4062
vt 1.0231 0.3901
vt 1.1115 0.3726
vt 1.2022 0.3544
vt 1.2934 0.3358
vt 1.3863 0.3164
vt 1.4848 0.2956
vt 0.9263 0.3494
vt 1.0049 0.3228
vt 1.0902 0.2938
vt 1.1777 0.2639
vt 1.2655 0.2336
vt 1.3549 0.2021
vt 1.4496 0.1687
vt 0.9037 0.2951
vt 0.9781 0.2585
vt 1.0589 0.2186
vt 1.1416 0.1775
vt 1.2245 0.1360
vt 1.3090 0.0932
vt 1.3983 0.0478
vt 0.8742 0.2443
vt 0.9431 0.1982
vt 1.0179 0.1481
vt 1.0945 0.0967
vt 1.1712 0.0447
vt 1.2492 -0.0086
vt 1.3317 -0.0652
vt 0.8383 0.1978
vt 0.9006 0.1431
vt 0.9681 0.0837
vt 1.0373 0.0228
vt 1.1066 -0.0387
vt 1.1768 -0.1016
vt 1.2512 -0.1683
vt 0.7966 0.1564
vt 0.8512 0.0941
vt 0.9104 0.0264
vt 0.9711 -0.0430
vt 1.0317 -0.1128
vt 1.0931 -0.1843
vt 1.1580 -0.2600
vt 0.7499 0.1208
vt 0.7959 0.0519
vt 0.8458 -0.0229
vt 0.8969 -0.0995
vt 0.9479 -0.1766
vt 0.9994 -0.2554
vt 1.0539 -0.3388
vt 0.6989 0.0916
vt 0.7356 0.0173
vt 0.7754 -0.0634
vt 0.8160 -0.1459
vt 0.8566 -0.2289
vt 0.8975 -0.3136
vt 0.9407 -0.4033
vt 0.6446 0.0693
vt 0.6713 -0.0092
vt 0.7003 -0.0943
vt 0.7298 -0.1814
vt 0.7593 -0.2688
vt 0.7889 -0.3581
vt 0.8201 -0.4525
vt 0.5878 0.0539
vt 0.6042 -0.0272
vt 0.6218 -0.1153
vt 0.6399 -0.2054
vt 0.6577 -0.2960
vt 0.6755 -0.3882
vt 0.6943 -0.4858
vt 0.5296 0.0463
vt 0.5352 -0.0363
vt 0.5413 -0.1259
vt 0.5476 -0.2176
vt 0.5536 -0.3097
vt 0.5593 -0.4035
vt 0.5654 -0.5026
vt 0.4708 0.0464
vt 0.4657 -0.0363
vt 0.4602 -0.1260
vt 0.4545 -0.2178
vt 0.4485 -0.3099
vt 0.4421 -0.4036
vt 0.4353 -0.5027
vt 0.4125 0.0540
vt 0.3967 -0.0274
vt 0.3797 -0.1156
vt 0.3621 -0.2059
vt 0.3443 -0.2965
vt 0.3258 -0.3886
vt 0.3064 -0.4860
vt 0.3557 0.0691
vt 0.3295 -0.0096
vt 0.3011 -0.0950
vt 0.2720 -0.1822
vt 0.2427 -0.2698
vt 0.2125 -0.3588
vt 0.1806 -0.4529
vt 0.3013 0.0914
vt 0.2651 0.0167
vt 0.2259 -0.0642
vt 0.1858 -0.1471
vt 0.1453 -0.2301
vt 0.1038 -0.3145
vt 0.0601 -0.4038
vt 0.2502 0.1206
vt 0.2047 0.0511
vt 0.1553 -0.0241
vt 0.1047 -0.1010
vt 0.0538 -0.1782
vt 0.0017 -0.2566
vt -0.0533 -0.3396
vt 0.2033 0.1560
vt 0.1491 0.0931
vt 0.0904 0.0249
vt 0.0303 -0.0449
vt -0.0302 -0.1148
vt -0.0921 -0.1858
vt -0.1575 -0.2611
vt 0.1612 0.1971
vt 0.0995 0.1419
vt 0.0324 0.0819
vt -0.0363 0.0205
vt -0.1054 -0.0410
vt -0.1761 -0.1034
vt -0.2507 -0.1696
vt 0.1251 0.2435
vt 0.0567 0.1968
vt -0.0176 0.1461
vt -0.0938 0.0941
vt -0.1704 0.0421
vt -0.2487 -0.0107
vt -0.3314 -0.0667
vt 0.0953 0.2942
vt 0.0214 0.2568
vt -0.0589 0.2162
vt -0.1413 0.1746
vt -0.2241 0.1330
vt -0.3086 0.0908
vt -0.3981 0.0461
vt 0.0725 0.3484
vt -0.0058 0.3210
vt -0.0907 0.2912
vt -0.1778 0.2607
vt -0.2654 0.2303
vt -0.3549 0.1995
vt -0.4495 0.1668
vt 0.0570 0.4051
vt -0.0243 0.3882
vt -0.1124 0.3698
vt -0.2029 0.3509
vt -0.2937 0.3321
vt -0.3865 0.3133
vt -0.4847 0.2933
vt 0.0490 0.4633
vt -0.0338 0.4572
vt -0.1237 0.4505
vt -0.2159 0.4437
vt -0.3085 0.4369
vt -0.4030 0.4304
vt -0.5030 0.4234
vt 0.0486 0.5222
vt -0.0343 0.5270
vt -0.1243 0.5321
vt -0.2165 0.5374
vt -0.3093 0.5427
vt -0.4039 0.5487
vt -0.5040 0.5549
vt 0.0560 0.5806
vt -0.0256 0.5962
vt -0.1142 0.6130
vt -0.2051 0.6303
vt -0.2963 0.6479
vt -0.3893 0.6661
vt -0.4878 0.6854
vt 0.0710 0.6376
vt -0.0079 0.6637
vt -0.0936 0.6920
vt -0.1815 0.7211
vt -0.2697 0.7504
vt -0.3595 0.7807
vt -0.4546 0.8127
vt 0.0933 0.6921
vt 0.0185 0.7284
vt -0.0628 0.7677
vt -0.1462 0.8080
vt -0.2298 0.8486
vt -0.3150 0.8904
vt -0.4051 0.9346
vt 0.1226 0.7433
vt 0.0531 0.7891
vt -0.0224 0.8387
vt -0.0999 0.8896
vt -0.1775 0.9409
vt -0.2565 0.9933
vt -0.3400 1.0488
vt 0.1584 0.7903
vt 0.0954 0.8448
vt 0.0270 0.9039
vt -0.0432 0.9645
vt -0.1137 1.0255
vt -0.1853 1.0879
vt -0.2608 1.1535
vt 0.3664 0.6438
vt 0.3873 0.6597
vt 0.3751 0.6784
vt 0.3520 0.6608
vt 0.3606 0.7004
vt 0.3347 0.6807
vt 0.3423 0.7277
vt 0.3130 0.7054
vt 0.3182 0.7632
vt 0.2845 0.7373
vt 0.2866 0.8096
vt 0.2472 0.7792
vt 0.4100 0.6726
vt 0.4004 0.6928
vt 0.3889 0.7166
vt 0.3742 0.7461
vt 0.3550 0.7844
vt 0.3297 0.8346
vt 0.4343 0.6826
vt 0.4274 0.7039
vt 0.4190 0.7289
vt 0.4084 0.7601
vt 0.3943 0.8006
vt 0.3758 0.8537
vt 0.4597 0.6893
vt 0.4556 0.7113
vt 0.4506 0.7372
vt 0.4441 0.7696
vt 0.4354 0.8116
vt 0.4240 0.8666
vt 0.4857 0.6926
vt 0.4846 0.7150
vt 0.4829 0.7414
vt 0.4807 0.7743
vt 0.4776 0.8171
vt 0.4734 0.8732
vt 0.5120 0.6926
vt 0.5137 0.7149
vt 0.5156 0.7413
vt 0.5176 0.7742
vt 0.5201 0.8170
vt 0.5233 0.8732
vt 0.5381 0.6891
vt 0.5427 0.7110
vt 0.5479 0.7369
vt 0.5542 0.7693
vt 0.5623 0.8115
vt 0.5728 0.8667
vt 0.5634 0.6823
vt 0.5709 0.7034
vt 0.5794 0.7284
vt 0.5899 0.7597
vt 0.6034 0.8004
vt 0.6210 0.8539
vt 0.5877 0.6722
vt 0.5978 0.6922
vt 0.6096 0.7159
vt 0.6240 0.7455
vt 0.6427 0.7841
vt 0.6671 0.8348
vt 0.6105 0.6591
vt 0.6231 0.6776
vt 0.6378 0.6995
vt 0.6560 0.7270
vt 0.6795 0.7629
vt 0.7103 0.8099
vt 0.6313 0.6431
vt 0.6462 0.6598
vt 0.6636 0.6797
vt 0.6852 0.7045
vt 0.7132 0.7370
vt 0.7499 0.7796
vt 0.6499 0.6247
vt 0.6668 0.6393
vt 0.6867 0.6566
vt 0.7113 0.6784
vt 0.7432 0.7069
vt 0.7851 0.7443
vt 0.6659 0.6039
vt 0.6846 0.6162
vt 0.7065 0.6308
vt 0.7337 0.6492
vt 0.7690 0.6733
vt 0.8155 0.7048
vt 0.6791 0.5813
vt 0.6991 0.5910
vt 0.7227 0.6027
vt 0.7520 0.6173
vt 0.7902 0.6365
vt 0.8404 0.6618
vt 0.6891 0.5572
vt 0.7103 0.5642
vt 0.7353 0.5727
vt 0.7658 0.5831
vt 0.8064 0.5974
vt 0.8594 0.6159
vt 0.6959 0.5320
vt 0.7177 0.5362
vt 0.7433 0.5413
vt 0.7761 0.5478
vt 0.8176 0.5565
vt 0.8724 0.5678
vt 0.6994 0.5062
vt 0.7215 0.5074
vt 0.7477 0.5091
vt 0.7806 0.5114
vt 0.8231 0.5145
vt 0.8788 0.5186
vt 0.6994 0.4801
vt 0.7216 0.4785
vt 0.7477 0.4767
vt 0.7804 0.4747
vt 0.8230 0.4722
vt 0.8788 0.4689
vt 0.6961 0.4543
vt 0.7178 0.4498
vt 0.7434 0.4446
vt 0.7755 0.4384
vt 0.8173 0.4303
vt 0.8723 0.4198
vt 0.6894 0.4292
vt 0.7103 0.4219
vt 0.7350 0.4134
vt 0.7658 0.4030
vt 0.8063 0.3896
vt 0.8593 0.3719
vt 0.6794 0.4053
vt 0.6992 0.3953
vt 0.7227 0.3835
vt 0.7514 0.3694
vt 0.7900 0.3507
vt 0.8403 0.3262
vt 0.6664 0.3829
vt 0.6846 0.3704
vt 0.7061 0.3559
vt 0.7338 0.3373
vt 0.7690 0.3141
vt 0.8155 0.2833
vt 0.6506 0.3624
vt 0.6670 0.3476
vt 0.6865 0.3303
vt 0.7111 0.3086
vt 0.7431 0.2807
vt 0.7852 0.2441
vt 0.6321 0.3442
vt 0.6464 0.3274
vt 0.6635 0.3076
vt 0.6850 0.2829
vt 0.7131 0.2511
vt 0.7500 0.2093
vt 0.6115 0.3286
vt 0.6234 0.3100
vt 0.6377 0.2881
vt 0.6558 0.2609
vt 0.6795 0.2256
vt 0.7106 0.1794
vt 0.5889 0.3159
vt 0.5983 0.2958
vt 0.6096 0.2722
vt 0.6240 0.2428
vt 0.6429 0.2047
vt 0.6675 0.1550
vt 0.5648 0.3063
vt 0.5714 0.2851
vt 0.5796 0.2602
vt 0.5900 0.2291
vt 0.6038 0.1886
vt 0.6215 0.1366
vt 0.5396 0.3000
vt 0.5434 0.2780
vt 0.5482 0.2522
vt 0.5544 0.2200
vt 0.5628 0.1784
vt 0.5739 0.1225
vt 0.5136 0.2970
vt 0.5145 0.2747
vt 0.5158 0.2483
vt 0.5179 0.2155
vt 0.5209 0.1729
vt 0.5247 0.1166
vt 0.4872 0.2976
vt 0.4852 0.2751
vt 0.4832 0.2487
vt 0.4810 0.2157
vt 0.4785 0.1730
vt 0.4751 0.1169
vt 0.4608 0.3018
vt 0.4561 0.2793
vt 0.4508 0.2532
vt 0.4445 0.2207
vt 0.4364 0.1786
vt 0.4259 0.1234
vt 0.4348 0.3082
vt 0.4275 0.2868
vt 0.4191 0.2616
vt 0.4088 0.2302
vt 0.3954 0.1895
vt 0.3779 0.1363
vt 0.4102 0.3178
vt 0.4004 0.2977
vt 0.3889 0.2739
vt 0.3746 0.2442
vt 0.3562 0.2057
vt 0.3320 0.1552
vt 0.3873 0.3305
vt 0.3749 0.3119
vt 0.3605 0.2898
vt 0.3427 0.2624
vt 0.3195 0.2268
vt 0.2890 0.1800
vt 0.3663 0.3460
vt 0.3517 0.3292
vt 0.3345 0.3092
vt 0.3134 0.2846
vt 0.2859 0.2524
vt 0.2497 0.2103
vt 0.3478 0.3641
vt 0.3312 0.3495
vt 0.3118 0.3322
vt 0.2870 0.3101
vt 0.2551 0.2814
vt 0.2132 0.2438
vt 0.3318 0.3845
vt 0.3134 0.3723
vt 0.2917 0.3576
vt 0.2646 0.3391
vt 0.2293 0.3149
vt 0.1831 0.2832
vt 0.3186 0.4068
vt 0.2988 0.3971
vt 0.2754 0.3855
vt 0.2461 0.3707
vt 0.2081 0.3514
vt 0.1582 0.3260
vt 0.3086 0.4307
vt 0.2876 0.4237
vt 0.2629 0.4153
vt 0.2320 0.4045
vt 0.1918 0.3903
vt 0.1391 0.3717
vt 0.3019 0.4557
vt 0.2801 0.4516
vt 0.2545 0.4465
vt 0.2224 0.4399
vt 0.1808 0.4311
vt 0.1261 0.4195
vt 0.2984 0.4814
vt 0.2763 0.4802
vt 0.2502 0.4785
vt 0.2176 0.4762
vt 0.1751 0.4729
vt 0.1194 0.4686
vt 0.2985 0.5074
vt 0.2764 0.5091
vt 0.2502 0.5108
vt 0.2176 0.5128
vt 0.1750 0.5152
vt 0.1192 0.5182
vt 0.3019 0.5331
vt 0.2802 0.5377
vt 0.2545 0.5429
vt 0.2224 0.5492
vt 0.1805 0.5571
vt 0.1255 0.5674
vt 0.3087 0.5582
vt 0.2878 0.5657
vt 0.2630 0.5742
vt 0.2319 0.5846
vt 0.1914 0.5979
vt 0.1382 0.6154
vt 0.3187 0.5823
vt 0.2989 0.5924
vt 0.2754 0.6041
vt 0.2460 0.6185
vt 0.2076 0.6371
vt 0.1571 0.6613
vt 0.3319 0.6048
vt 0.3135 0.6174
vt 0.2918 0.6321
vt 0.2644 0.6503
vt 0.2287 0.6737
vt 0.1818 0.7044
vt 0.3479 0.6254
vt 0.3313 0.6404
vt 0.3116 0.6578
vt 0.2869 0.6794
vt 0.2545 0.7074
vt 0.2120 0.7440
vn -1.0000 0.0000 0.0000
vn -0.9914 0.0000 0.1305
vn -0.8559 -0.5047 0.1127
vn -0.8633 -0.5047 0.0000
vn -0.4876 -0.8707 0.0642
vn -0.4918 -0.8707 0.0000
vn 0.0107 -0.9999 -0.0014
vn 0.0108 -0.9999 0.0000
vn 0.5036 -0.8614 -0.0663
vn 0.5080 -0.8614 0.0000
vn 0.8612 -0.4954 -0.1134
vn 0.8686 -0.4954 0.0000
vn 1.0000 0.0000 0.0000
vn 0.9914 0.0000 -0.1305
vn -0.9659 0.0000 0.2588
vn -0.8339 -0.5047 0.2234
vn -0.4751 -0.8707 0.1273
vn 0.0104 -0.9999 -0.0028
vn 0.4907 -0.8614 -0.1315
vn 0.8390 -0.4954 -0.2248
vn 0.9659 0.0000 -0.2588
vn -0.9239 0.0000 0.3827
vn -0.7975 -0.5047 0.3304
vn -0.4544 -0.8707 0.1882
vn 0.0099 -0.9999 -0.0041
vn 0.4693 -0.8614 -0.1944
vn 0.8025 -0.4954 -0.3324
vn 0.9239 0.0000 -0.3827
vn -0.8660 0.0000 0.5000
vn -0.7476 -0.5047 0.4316
vn -0.4259 -0.8707 0.2459
vn 0.0093 -0.9999 -0.0054
vn 0.4399 -0.8614 -0.2540
vn 0.7523 -0.4954 -0.4343
vn 0.8660 0.0000 -0.5000
vn -0.7933 0.0000 0.6088
vn -0.6849 -0.5047 0.5255
vn -0.3902 -0.8707 0.2994
vn 0.0085 -0.9999 -0.0066
vn 0.4030 -0.8614 -0.3092
vn 0.6891 -0.4954 -0.5288
vn 0.7933 0.0000 -0.6088
vn -0.7071 0.0000 0.7071
vn -0.6104 -0.5047 0.6104
vn -0.3478 -0.8707 0.3478
vn 0.0076 -0.9999 -0.0076
vn 0.3592 -0.8614 -0.3592
vn 0.6142 -0.4954 -0.6142
vn 0.7071 0.0000 -0.7071
vn -0.6088 0.0000 0.7933
vn -0.5255 -0.5047 0.6849
vn -0.2994 -0.8707 0.3902
vn 0.0066 -0.9999 -0.0085
vn 0.3092 -0.8614 -0.4030
vn 0.5288 -0.4954 -0.6891
vn 0.6088 0.0000 -0.7933
vn -0.5000 0.0000 0.8660
vn -0.4316 -0.5047 0.7476
vn -0.2459 -0.8707 0.4259
vn 0.0054 -0.9999 -0.0093
vn 0.2540 -0.8614 -0.4399
vn 0.4343 -0.4954 -0.7523
vn 0.5000 0.0000 -0.8660
vn -0.3827 0.0000 0.9239
vn -0.3304 -0.5047 0.7975
vn -0.1882 -0.8707 0.4544
vn 0.0041 -0.9999 -0.0099
vn 0.1944 -0.8614 -0.4693
vn 0.3324 -0.4954 -0.8025
vn 0.3827 0.0000 -0.9239
vn -0.2588 0.0000 0.9659
vn -0.2234 -0.5047 0.8339
vn -0.1273 -0.8707 0.4751
vn 0.0028 -0.9999 -0.0104
vn 0.1315 -0.8614 -0.4907
vn 0.2248 -0.4954 -0.8390
vn 0.2588 0.0000 -0.9659
vn -0.1305 0.0000 0.9914
vn -0.1127 -0.5047 0.8559
vn -0.0642 -0.8707 0.4876
vn 0.0014 -0.9999 -0.0107
vn 0.0663 -0.8614 -0.5036
vn 0.1134 -0.4954 -0.8612
vn 0.1305 0.0000 -0.9914
vn 0.0000 0.0000 1.0000
vn 0.0000 -0.5047 0.8633
vn 0.0000 -0.8707 0.4918
vn 0.0000 -0.9999 -0.0108
vn 0.0000 -0.8614 -0.5080
vn 0.0000 -0.4954 -0.8686
vn 0.0000 0.0000 -1.0000
vn 0.1305 0.0000 0.9914
vn 0.1127 -0.5047 0.8559
vn 0.0642 -0.8707 0.4876
vn -0.0014 -0.9999 -0.0107
vn -0.0663 -0.8614 -0.5036
vn -0.1134 -0.4954 -0.8612
vn -0.1305 0.0000 -0.9914
vn 0.2588 0.0000 0.9659
vn 0.2234 -0.5047 0.8339
vn 0.1273 -0.8707 0.4751
vn -0.0028 -0.9999 -0.0104
vn -0.1315 -0.8614 -0.4907
vn -0.2248 -0.4954 -0.8390
vn -0.2588 0.0000 -0.9659
vn 0.3827 0.0000 0.9239
vn 0.3304 -0.5047 0.7975
vn 0.1882 -0.8707 0.4544
vn -0.0041 -0.9999 -0.0099
vn -0.1944 -0.8614 -0.4693
vn -0.3324 -0.4954 -0.8025
vn -0.3827 0.0000 -0.9239
vn 0.5000 0.0000 0.8660
vn 0.4316 -0.5047 0.7476
vn 0.2459 -0.8707 0.4259
vn -0.0054 -0.9999 -0.0093
vn -0.2540 -0.8614 -0.4399
vn -0.4343 -0.4954 -0.7523
vn -0.5000 0.0000 -0.8660
vn 0.6088 0.0000 0.7933
vn 0.5255 -0.5047 0.6849
vn 0.2994 -0.8707 0.3902
vn -0.0066 -0.9999 -0.0085
vn -0.3092 -0.8614 -0.4030
vn -0.5288 -0.4954 -0.6891
vn -0.6088 0.0000 -0.7933
vn 0.7071 0.0000 0.7071
vn 0.6104 -0.5047 0.6104
vn 0.3478 -0.8707 0.3478
vn -0.0076 -0.9999 -0.0076
vn -0.3592 -0.8614 -0.3592
vn -0.6142 -0.4954 -0.6142
vn -0.7071 0.0000 -0.7071
vn 0.7933 0.0000 0.6088
vn 0.6849 -0.5047 0.5255
vn 0.3902 -0.8707 0.2994
vn -0.0085 -0.9999 -0.0066
vn -0.4030 -0.8614 -0.3092
vn -0.6891 -0.4954 -0.5288
vn -0.7933 0.0000 -0.6088
vn 0.8660 0.0000 0.5000
vn 0.7476 -0.5047 0.4316
vn 0.4259 -0.8707 0.2459
vn -0.0093 -0.9999 -0.0054
vn -0.4399 -0.8614 -0.2540
vn -0.7523 -0.4954 -0.4343
vn -0.8660 0.0000 -0.5000
vn 0.9239 0.0000 0.3827
vn 0.7975 -0.5047 0.3304
vn 0.4544 -0.8707 0.1882
vn -0.0099 -0.9999 -0.0041
vn -0.4693 -0.8614 -0.1944
vn -0.8025 -0.4954 -0.3324
vn -0.9239 0.0000 -0.3827
vn 0.9659 0.0000 0.2588
vn 0.8339 -0.5047 0.2234
vn 0.4751 -0.8707 0.1273
vn -0.0104 -0.9999 -0.0028
vn -0.4907 -0.8614 -0.1315
vn -0.8390 -0.4954 -0.2248
vn -0.9659 0.0000 -0.2588
vn 0.9914 0.0000 0.1305
vn 0.8559 -0.5047 0.1127
vn 0.4876 -0.8707 0.0642
vn -0.0107 -0.9999 -0.0014
vn -0.5036 -0.8614 -0.0663
vn -0.8612 -0.4954 -0.1134
vn -0.9914 0.0000 -0.1305
vn 0.8633 -0.5047 0.0000
vn 0.4918 -0.8707 0.0000
vn -0.0108 -0.9999 0.0000
vn -0.5080 -0.8614 0.0000
vn -0.8686 -0.4954 0.0000
vn 0.8559 -0.5047 -0.1127
vn 0.4876 -0.8707 -0.0642
vn -0.0107 -0.9999 0.0014
vn -0.5036 -0.8614 0.0663
vn -0.8612 -0.4954 0.1134
vn 0.8339 -0.5047 -0.2234
vn 0.4751 -0.8707 -0.1273
vn -0.0104 -0.9999 0.0028
vn -0.4907 -0.8614 0.1315
vn -0.8390 -0.4954 0.2248
vn 0.7975 -0.5047 -0.3304
vn 0.4544 -0.8707 -0.1882
vn -0.0099 -0.9999 0.0041
vn -0.4693 -0.8614 0.1944
vn -0.8025 -0.4954 0.3324
vn 0.7476 -0.5047 -0.4316
vn 0.4259 -0.8707 -0.2459
vn -0.0093 -0.9999 0.0054
vn -0.4399 -0.8614 0.2540
vn -0.7523 -0.4954 0.4343
vn 0.6849 -0.5047 -0.5255
vn 0.3902 -0.8707 -0.2994
vn -0.0085 -0.9999 0.0066
vn -0.4030 -0.8614 0.3092
vn -0.6891 -0.4954 0.5288
vn 0.6104 -0.5047 -0.6104
vn 0.3478 -0.8707 -0.3478
vn -0.0076 -0.9999 0.0076
vn -0.3592 -0.8614 0.3592
vn -0.6142 -0.4954 0.6142
vn 0.5255 -0.5047 -0.6849
vn 0.2994 -0.8707 -0.3902
vn -0.0066 -0.9999 0.0085
vn -0.3092 -0.8614 0.4030
vn -0.5288 -0.4954 0.6891
vn 0.4316 -0.5047 -0.7476
vn 0.2459 -0.8707 -0.4259
vn -0.0054 -0.9999 0.0093
vn -0.2540 -0.8614 0.4399
vn -0.4343 -0.4954 0.7523
vn 0.3304 -0.5047 -0.7975
vn 0.1882 -0.8707 -0.4544
vn -0.0041 -0.9999 0.0099
vn -0.1944 -0.8614 0.4693
vn -0.3324 -0.4954 0.8025
vn 0.2234 -0.5047 -0.8339
vn 0.1273 -0.8707 -0.4751
vn -0.0028 -0.9999 0.0104
vn -0.1315 -0.8614 0.4907
vn -0.2248 -0.4954 0.8390
vn 0.1127 -0.5047 -0.8559
vn 0.0642 -0.8707 -0.4876
vn -0.0014 -0.9999 0.0107
vn -0.0663 -0.8614 0.5036
vn -0.1134 -0.4954 0.8612
vn 0.0000 -0.5047 -0.8633
vn 0.0000 -0.8707 -0.4918
vn 0.0000 -0.9999 0.0108
vn 0.0000 -0.8614 0.5080
vn 0.0000 -0.4954 0.8686
vn -0.1127 -0.5047 -0.8559
vn -0.0642 -0.8707 -0.4876
vn 0.0014 -0.9999 0.0107
vn 0.0663 -0.8614 0.5036
vn 0.1134 -0.4954 0.8612
vn -0.2234 -0.5047 -0.8339
vn -0.1273 -0.8707 -0.4751
vn 0.0028 -0.9999 0.0104
vn 0.1315 -0.8614 0.4907
vn 0.2248 -0.4954 0.8390
vn -0.3304 -0.5047 -0.7975
vn -0.1882 -0.8707 -0.4544
vn 0.0041 -0.9999 0.0099
vn 0.1944 -0.8614 0.4693
vn 0.3324 -0.4954 0.8025
vn -0.4316 -0.5047 -0.7476
vn -0.2459 -0.8707 -0.4259
vn 0.0054 -0.9999 0.0093
vn 0.2540 -0.8614 0.4399
vn 0.4343 -0.4954 0.7523
vn -0.5255 -0.5047 -0.6849
vn -0.2994 -0.8707 -0.3902
vn 0.0066 -0.9999 0.0085
vn 0.3092 -0.8614 0.4030
vn 0.5288 -0.4954 0.6891
vn -0.6104 -0.5047 -0.6104
vn -0.3478 -0.8707 -0.3478
vn 0.0076 -0.9999 0.0076
vn 0.3592 -0.8614 0.3592
vn 0.6142 -0.4954 0.6142
vn -0.6849 -0.5047 -0.5255
vn -0.3902 -0.8707 -0.2994
vn 0.0085 -0.9999 0.0066
vn 0.4030 -0.8614 0.3092
vn 0.6891 -0.4954 0.5288
vn -0.7476 -0.5047 -0.4316
vn -0.4259 -0.8707 -0.2459
vn 0.0093 -0.9999 0.0054
vn 0.4399 -0.8614 0.2540
vn 0.7523 -0.4954 0.4343
vn -0.7975 -0.5047 -0.3304
vn -0.4544 -0.8707 -0.1882
vn 0.0099 -0.9999 0.0041
vn 0.4693 -0.8614 0.1944
vn 0.8025 -0.4954 0.3324
vn -0.8339 -0.5047 -0.2234
vn -0.4751 -0.8707 -0.1273
vn 0.0104 -0.9999 0.0028
vn 0.4907 -0.8614 0.1315
vn 0.8390 -0.4954 0.2248
vn -0.8559 -0.5047 -0.1127
vn -0.4876 -0.8707 -0.0642
vn 0.0107 -0.9999 0.0014
vn 0.5036 -0.8614 0.0663
vn 0.8612 -0.4954 0.1134
vn 0.8612 0.4954 -0.1134
vn 0.8686 0.4954 0.0000
vn 0.5036 0.8614 -0.0663
vn 0.5080 0.8614 0.0000
vn 0.0107 0.9999 -0.0014
vn 0.0108 0.9999 0.0000
vn -0.4876 0.8707 0.0642
vn -0.4918 0.8707 0.0000
vn -0.8559 0.5047 0.1127
vn -0.8633 0.5047 0.0000
vn 0.8390 0.4954 -0.2248
vn 0.4907 0.8614 -0.1315
vn 0.0104 0.9999 -0.0028
vn -0.4751 0.8707 0.1273
vn -0.8339 0.5047 0.2234
vn 0.8025 0.4954 -0.3324
vn 0.4693 0.8614 -0.1944
vn 0.0099 0.9999 -0.0041
vn -0.4544 0.8707 0.1882
vn -0.7975 0.5047 0.3304
vn 0.7523 0.4954 -0.4343
vn 0.4399 0.8614 -0.2540
vn 0.0093 0.9999 -0.0054
vn -0.4259 0.8707 0.2459
vn -0.7476 0.5047 0.4316
vn 0.6891 0.4954 -0.5288
vn 0.4030 0.8614 -0.3092
vn 0.0085 0.9999 -0.0066
vn -0.3902 0.8707 0.2994
vn -0.6849 0.5047 0.5255
vn 0.6142 0.4954 -0.6142
vn 0.3592 0.8614 -0.3592
vn 0.0076 0.9999 -0.0076
vn -0.3478 0.8707 0.3478
vn -0.6104 0.5047 0.6104
vn 0.5288 0.4954 -0.6891
vn 0.3092 0.8614 -0.4030
vn 0.0066 0.9999 -0.0085
vn -0.2994 0.8707 0.3902
vn -0.5255 0.5047 0.6849
vn 0.4343 0.4954 -0.7523
vn 0.2540 0.8614 -0.4399
vn 0.0054 0.9999 -0.0093
vn -0.2459 0.8707 0.4259
vn -0.4316 0.5047 0.7476
vn 0.3324 0.4954 -0.8025
vn 0.1944 0.8614 -0.4693
vn 0.0041 0.9999 -0.0099
vn -0.1882 0.8707 0.4544
vn -0.3304 0.5047 0.7975
vn 0.2248 0.4954 -0.8390
vn 0.1315 0.8614 -0.4907
vn 0.0028 0.9999 -0.0104
vn -0.1273 0.8707 0.4751
vn -0.2234 0.5047 0.8339
vn 0.1134 0.4954 -0.8612
vn 0.0663 0.8614 -0.5036
vn 0.0014 0.9999 -0.0107
vn -0.0642 0.8707 0.4876
vn -0.1127 0.5047 0.8559
vn 0.0000 0.4954 -0.8686
vn 0.0000 0.8614 -0.5080
vn 0.0000 0.9999 -0.0108
vn 0.0000 0.8707 0.4918
vn 0.0000 0.5047 0.8633
vn -0.1134 0.4954 -0.8612
vn -0.0663 0.8614 -0.5036
vn -0.0014 0.9999 -0.0107
vn 0.0642 0.8707 0.4876
vn 0.1127 0.5047 0.8559
vn -0.2248 0.4954 -0.8390
vn -0.1315 0.8614 -0.4907
vn -0.0028 0.9999 -0.0104
vn 0.1273 0.8707 0.4751
vn 0.2234 0.5047 0.8339
vn -0.3324 0.4954 -0.8025
vn -0.1944 0.8614 -0.4693
vn -0.0041 0.9999 -0.0099
vn 0.1882 0.8707 0.4544
vn 0.3304 0.5047 0.7975
vn -0.4343 0.4954 -0.7523
vn -0.2540 0.8614 -0.4399
vn -0.0054 0.9999 -0.0093
vn 0.2459 0.8707 0.4259
vn 0.4316 0.5047 0.7476
vn -0.5288 0.4954 -0.6891
vn -0.3092 0.8614 -0.4030
vn -0.0066 0.9999 -0.0085
vn 0.2994 0.8707 0.3902
vn 0.5255 0.5047 0.6849
vn -0.6142 0.4954 -0.6142
vn -0.3592 0.8614 -0.3592
vn -0.0076 0.9999 -0.0076
vn 0.3478 0.8707 0.3478
vn 0.6104 0.5047 0.6104
vn -0.6891 0.4954 -0.5288
vn -0.4030 0.8614 -0.3092
vn -0.0085 0.9999 -0.0066
vn 0.3902 0.8707 0.2994
vn 0.6849 0.5047 0.5255
vn -0.7523 0.4954 -0.4343
vn -0.4399 0.8614 -0.2540
vn -0.0093 0.9999 -0.0054
vn 0.4259 0.8707 0.2459
vn 0.7476 0.5047 0.4316
vn -0.8025 0.4954 -0.3324
vn -0.4693 0.8614 -0.1944
vn -0.0099 0.9999 -0.0041
vn 0.4544 0.8707 0.1882
vn 0.7975 0.5047 0.3304
vn -0.8390 0.4954 -0.2248
vn -0.4907 0.8614 -0.1315
vn -0.0104 0.9999 -0.0028
vn 0.4751 0.8707 0.1273
vn 0.8339 0.5047 0.2234
vn -0.8612 0.4954 -0.1134
vn -0.5036 0.8614 -0.0663
vn -0.0107 0.9999 -0.0014
vn 0.4876 0.8707 0.0642
vn 0.8559 0.5047 0.1127
vn -0.8686 0.4954 0.0000
vn -0.5080 0.8614 0.0000
vn -0.0108 0.9999 0.0000
vn 0.4918 0.8707 0.0000
vn 0.8633 0.5047 0.0000
vn -0.8612 0.4954 0.1134
vn -0.5036 0.8614 0.0663
vn -0.0107 0.9999 0.0014
vn 0.4876 0.8707 -0.0642
vn 0.8559 0.5047 -0.1127
vn -0.8390 0.4954 0.2248
vn -0.4907 0.8614 0.1315
vn -0.0104 0.9999 0.0028
vn 0.4751 0.8707 -0.1273
vn 0.8339 0.5047 -0.2234
vn -0.8025 0.4954 0.3324
vn -0.4693 0.8614 0.1944
vn -0.0099 0.9999 0.0041
vn 0.4544 0.8707 -0.1882
vn 0.7975 0.5047 -0.3303
vn -0.7523 0.4954 0.4343
vn -0.4399 0.8614 0.2540
vn -0.0093 0.9999 0.0054
vn 0.4259 0.8707 -0.2459
vn 0.7476 0.5047 -0.4316
vn -0.6891 0.4954 0.5288
vn -0.4030 0.8614 0.3092
vn -0.0085 0.9999 0.0066
vn 0.3902 0.8707 -0.2994
vn 0.6849 0.5047 -0.5255
vn -0.6142 0.4954 0.6142
vn -0.3592 0.8614 0.3592
vn -0.0076 0.9999 0.0076
vn 0.3478 0.8707 -0.3478
vn 0.6104 0.5047 -0.6104
vn -0.5288 0.4954 0.6891
vn -0.3092 0.8614 0.4030
vn -0.0066 0.9999 0.0085
vn 0.2994 0.8707 -0.3902
vn 0.5255 0.5047 -0.6849
vn -0.4343 0.4954 0.7523
vn -0.2540 0.8614 0.4399
vn -0.0054 0.9999 0.0093
vn 0.2459 0.8707 -0.4259
vn 0.4316 0.5047 -0.7476
vn -0.3324 0.4954 0.8025
vn -0.1944 0.8614 0.4693
vn -0.0041 0.9999 0.0099
vn 0.1882 0.8707 -0.4544
vn 0.3304 0.5047 -0.7975
vn -0.2248 0.4954 0.8390
vn -0.1315 0.8614 0.4907
vn -0.0028 0.9999 0.0104
vn 0.1273 0.8707 -0.4751
vn 0.2234 0.5047 -0.8339
vn -0.1134 0.4954 0.8612
vn -0.0663 0.8614 0.5036
vn -0.0014 0.9999 0.0107
vn 0.0642 0.8707 -0.4876
vn 0.1127 0.5047 -0.8559
vn 0.0000 0.4954 0.8686
vn 0.0000 0.8614 0.5080
vn 0.0000 0.9999 0.0108
vn 0.0000 0.8707 -0.4918
vn 0.0000 0.5047 -0.8633
vn 0.1134 0.4954 0.8612
vn 0.0663 0.8614 0.5036
vn 0.0014 0.9999 0.0107
vn -0.0642 0.8707 -0.4876
vn -0.1127 0.5047 -0.8559
vn 0.2248 0.4954 0.8390
vn 0.1315 0.8614 0.4907
vn 0.0028 0.9999 0.0104
vn -0.1273 0.8707 -0.4751
vn -0.2234 0.5047 -0.8339
vn 0.3324 0.4954 0.8025
vn 0.1944 0.8614 0.4693
vn 0.0041 0.9999 0.0099
vn -0.1882 0.8707 -0.4544
vn -0.3304 0.5047 -0.7975
vn 0.4343 0.4954 0.7523
vn 0.2540 0.8614 0.4399
vn 0.0054 0.9999 0.0093
vn -0.2459 0.8707 -0.4259
vn -0.4316 0.5047 -0.7476
vn 0.5288 0.4954 0.6891
vn 0.3092 0.8614 0.4030
vn 0.0066 0.9999 0.0085
vn -0.2994 0.8707 -0.3902
vn -0.5255 0.5047 -0.6849
vn 0.6142 0.4954 0.6142
vn 0.3592 0.8614 0.3592
vn 0.0076 0.9999 0.0076
vn -0.3478 0.8707 -0.3478
vn -0.6104 0.5047 -0.6104
vn 0.6891 0.4954 0.5288
vn 0.4030 0.8614 0.3092
vn 0.0085 0.9999 0.0066
vn -0.3902 0.8707 -0.2994
vn -0.6849 0.5047 -0.5255
vn 0.7523 0.4954 0.4343
vn 0.4399 0.8614 0.2540
vn 0.0093 0.9999 0.0054
vn -0.4259 0.8707 -0.2459
vn -0.7476 0.5047 -0.4316
vn 0.8025 0.4954 0.3324
vn 0.4693 0.8614 0.1944
vn 0.0099 0.9999 0.0041
vn -0.4544 0.8707 -0.1882
vn -0.7975 0.5047 -0.3304
vn 0.8390 0.4954 0.2248
vn 0.4907 0.8614 0.1315
vn 0.0104 0.9999 0.0028
vn -0.4751 0.8707 -0.1273
vn -0.8339 0.5047 -0.2234
vn 0.8612 0.4954 0.1134
vn 0.5036 0.8614 0.0663
vn 0.0107 0.9999 0.0014
vn -0.4876 0.8707 -0.0642
vn -0.8559 0.5047 -0.1127
usemtl Material.001
s 1
f 7/1/1 19/2/2 20/3/3 8/4/4
f 8/4/4 20/3/3 21/5/5 9/6/6
f 9/6/6 21/5/5 22/7/7 10/8/8
f 10/8/8 22/7/7 23/9/9 11/10/10
f 11/10/10 23/9/9 24/11/11 12/12/12
f 1/13/13 12/12/12 24/11/11 13/14/14
f 19/2/2 31/15/15 32/16/16 20/3/3
f 20/3/3 32/16/16 33/17/17 21/5/5
f 21/5/5 33/17/17 34/18/18 22/7/7
f 22/7/7 34/18/18 35/19/19 23/9/9
f 23/9/9 35/19/19 36/20/20 24/11/11
f 24/11/11 36/20/20 25/21/21 13/14/14
f 31/15/15 43/22/22 44/23/23 32/16/16
f 32/16/16 44/23/23 45/24/24 33/17/17
f 33/17/17 45/24/24 46/25/25 34/18/18
f 34/18/18 46/25/25 47/26/26 35/19/19
f 35/19/19 47/26/26 48/27/27 36/20/20
f 36/20/20 48/27/27 37/28/28 25/21/21
f 43/22/22 55/29/29 56/30/30 44/23/23
f 44/23/23 56/30/30 57/31/31 45/24/24
f 45/24/24 57/31/31 58/32/32 46/25/25
f 46/25/25 58/32/32 59/33/33 47/26/26
f 47/26/26 59/33/33 60/34/34 48/27/27
f 48/27/27 60/34/34 49/35/35 37/28/28
f 55/29/29 67/36/36 68/37/37 56/30/30
f 56/30/30 68/37/37 69/38/38 57/31/31
f 57/31/31 69/38/38 70/39/39 58/32/32
f 58/32/32 70/39/39 71/40/40 59/33/33
f 59/33/33 71/40/40 72/41/41 60/34/34
f 60/34/34 72/41/41 61/42/42 49/35/35
f 67/36/36 79/43/43 80/44/44 68/37/37
f 68/37/37 80/44/44 81/45/45 69/38/38
f 69/38/38 81/45/45 82/46/46 70/39/39
f 70/39/39 82/46/46 83/47/47 71/40/40
f 71/40/40 83/47/47 84/48/48 72/41/41
f 72/41/41 84/48/48 73/49/49 61/42/42
f 79/43/43 91/50/50 92/51/51 80/44/44
f 80/44/44 92/51/51 93/52/52 81/45/45
f 81/45/45 93/52/52 94/53/53 82/46/46
f 82/46/46 94/53/53 95/54/54 83/47/47
f 83/47/47 95/54/54 96/55/55 84/48/48
f 84/48/48 96/55/55 85/56/56 73/49/49
f 91/50/50 103/57/57 104/58/58 92/51/51
f 92/51/51 104/58/58 105/59/59 93/52/52
f 93/52/52 105/59/59 106/60/60 94/53/53
f 94/53/53 106/60/60 107/61/61 95/54/54
f 95/54/54 107/61/61 108/62/62 96/55/55
f 96/55/55 108/62/62 97/63/63 85/56/56
f 103/57/57 115/64/64 116/65/65 104/58/58
f 104/58/58 116/65/65 117/66/66 105/59/59
f 105/59/59 117/66/66 118/67/67 106/60/60
f 106/60/60 118/67/67 119/68/68 107/61/61
f 107/61/61 119/68/68 120/69/69 108/62/62
f 108/62/62 120/69/69 109/70/70 97/63/63
f 115/64/64 127/71/71 128/72/72 116/65/65
f 116/65/65 128/72/72 129/73/73 117/66/66
f 117/66/66 129/73/73 130/74/74 118/67/67
f 118/67/67 130/74/74 131/75/75 119/68/68
f 119/68/68 131/75/75 132/76/76 120/69/69
f 120/69/69 132/76/76 121/77/77 109/70/70
f 127/71/71 139/78/78 140/79/79 128/72/72
f 128/72/72 140/79/79 141/80/80 129/73/73
f 129/73/73 141/80/80 142/81/81 130/74/74
f 130/74/74 142/81/81 143/82/82 131/75/75
f 131/75/75 143/82/82 144/83/83 132/76/76
f 132/76/76 144/83/83 133/84/84 121/77/77
f 139/78/78 151/85/85 152/86/86 140/79/79
f 140/79/79 152/86/86 153/87/87 141/80/80
f 141/80/80 153/87/87 154/88/88 142/81/81
f 142/81/81 154/88/88 155/89/89 143/82/82
f 143/82/82 155/89/89 156/90/90 144/83/83
f 144/83/83 156/90/90 145/91/91 133/84/84
f 151/85/85 163/92/92 164/93/93 152/86/86
f 152/86/86 164/93/93 165/94/94 153/87/87
f 153/87/87 165/94/94 166/95/95 154/88/88
f 154/88/88 166/95/95 167/96/96 155/89/89
f 155/89/89 167/96/96 168/97/97 156/90/90
f 156/90/90 168/97/97 157/98/98 145/91/91
f 163/92/92 175/99/99 176/100/100 164/93/93
f 164/93/93 176/100/100 177/101/101 165/94/94
f 165/94/94 177/101/101 178/102/102 166/95/95
f 166/95/95 178/102/102 179/103/103 167/96/96
f 167/96/96 179/103/103 180/104/104 168/97/97
f 168/97/97 180/104/104 169/105/105 157/98/98
f 175/99/99 187/106/106 188/107/107 176/100/100
f 176/100/100 188/107/107 189/108/108 177/101/101
f 177/101/101 189/108/108 190/109/109 178/102/102
f 178/102/102 190/109/109 191/110/110 179/103/103
f 179/103/103 191/110/110 192/111/111 180/104/104
f 180/104/104 192/111/111 181/112/112 169/105/105
f 187/106/106 199/113/113 200/114/114 188/107/107
f 188/107/107 200/114/114 201/115/115 189/108/108
f 189/108/108 201/115/115 202/116/116 190/109/109
f 190/109/109 202/116/116 203/117/117 191/110/110
f 191/110/110 203/117/117 204/118/118 192/111/111
f 192/111/111 204/118/118 193/119/119 181/112/112
f 199/113/113 211/120/120 212/121/121 200/114/114
f 200/114/114 212/121/121 213/122/122 201/115/115
f 201/115/115 213/122/122 214/123/123 202/116/116
f 202/116/116 214/123/123 215/124/124 203/117/117
f 203/117/117 215/124/124 216/125/125 204/118/118
f 204/118/118 216/125/125 205/126/126 193/119/119
f 211/120/120 223/127/127 224/128/128 212/121/121
f 212/121/121 224/128/128 225/129/129 213/122/122
f 213/122/122 225/129/129 226/130/130 214/123/123
f 214/123/123 226/130/130 227/131/131 215/124/124
f 215/124/124 227/131/131 228/132/132 216/125/125
f 216/125/125 228/132/132 217/133/133 205/126/126
f 223/127/127 235/134/134 236/135/135 224/128/128
f 224/128/128 236/135/135 237/136/136 225/129/129
f 225/129/129 237/136/136 238/137/137 226/130/130
f 226/130/130 238/137/137 239/138/138 227/131/131
f 227/131/131 239/138/138 240/139/139 228/132/132
f 228/132/132 240/139/139 229/140/140 217/133/133
f 235/134/134 247/141/141 248/142/142 236/135/135
f 236/135/135 248/142/142 249/143/143 237/136/136
f 237/136/136 249/143/143 250/144/144 238/137/137
f 238/137/137 250/144/144 251/145/145 239/138/138
f 239/138/138 251/145/145 252/146/146 240/139/139
f 240/139/139 252/146/146 241/147/147 229/140/140
f 247/141/141 259/148/148 260/149/149 248/142/142
f 248/142/142 260/149/149 261/150/150 249/143/143
f 249/143/143 261/150/150 262/151/151 250/144/144
f 250/144/144 262/151/151 263/152/152 251/145/145
f 251/145/145 263/152/152 264/153/153 252/146/146
f 252/146/146 264/153/153 253/154/154 241/147/147
f 259/148/148 271/155/155 272/156/156 260/149/149
f 260/149/149 272/156/156 273/157/157 261/150/150
f 261/150/150 273/157/157 274/158/158 262/151/151
f 262/151/151 274/158/158 275/159/159 263/152/152
f 263/152/152 275/159/159 276/160/160 264/153/153
f 264/153/153 276/160/160 265/161/161 253/154/154
f 271/155/155 283/162/162 284/163/163 272/156/156
f 272/156/156 284/163/163 285/164/164 273/157/157
f 273/157/157 285/164/164 286/165/165 274/158/158
f 274/158/158 286/165/165 287/166/166 275/159/159
f 275/159/159 287/166/166 288/167/167 276/160/160
f 276/160/160 288/167/167 277/168/168 265/161/161
f 283/162/162 295/169/13 296/170/169 284/163/163
f 284/163/163 296/170/169 297/171/170 285/164/164
f 285/164/164 297/171/170 298/172/171 286/165/165
f 286/165/165 298/172/171 299/173/172 287/166/166
f 287/166/166 299/173/172 300/174/173 288/167/167
f 288/167/167 300/174/173 289/175/1 277/168/168
f 295/169/13 307/176/14 308/177/174 296/170/169
f 296/170/169 308/177/174 309/178/175 297/171/170
f 297/171/170 309/178/175 310/179/176 298/172/171
f 298/172/171 310/179/176 311/180/177 299/173/172
f 299/173/172 311/180/177 312/181/178 300/174/173
f 300/174/173 312/181/178 301/182/2 289/175/1
f 307/176/14 319/183/21 320/184/179 308/177/174
f 308/177/174 320/184/179 321/185/180 309/178/175
f 309/178/175 321/185/180 322/186/181 310/179/176
f 310/179/176 322/186/181 323/187/182 311/180/177
f 311/180/177 323/187/182 324/188/183 312/181/178
f 312/181/178 324/188/183 313/189/15 301/182/2
f 319/183/21 331/190/28 332/191/184 320/184/179
f 320/184/179 332/191/184 333/192/185 321/185/180
f 321/185/180 333/192/185 334/193/186 322/186/181
f 322/186/181 334/193/186 335/194/187 323/187/182
f 323/187/182 335/194/187 336/195/188 324/188/183
f 324/188/183 336/195/188 325/196/22 313/189/15
f 331/190/28 343/197/35 344/198/189 332/191/184
f 332/191/184 344/198/189 345/199/190 333/192/185
f 333/192/185 345/199/190 346/200/191 334/193/186
f 334/193/186 346/200/191 347/201/192 335/194/187
f 335/194/187 347/201/192 348/202/193 336/195/188
f 336/195/188 348/202/193 337/203/29 325/196/22
f 343/197/35 355/204/42 356/205/194 344/198/189
f 344/198/189 356/205/194 357/206/195 345/199/190
f 345/199/190 357/206/195 358/207/196 346/200/191
f 346/200/191 358/207/196 359/208/197 347/201/192
f 347/201/192 359/208/197 360/209/198 348/202/193
f 348/202/193 360/209/198 349/210/36 337/203/29
f 355/204/42 367/211/49 368/212/199 356/205/194
f 356/205/194 368/212/199 369/213/200 357/206/195
f 357/206/195 369/213/200 370/214/201 358/207/196
f 358/207/196 370/214/201 371/215/202 359/208/197
f 359/208/197 371/215/202 372/216/203 360/209/198
f 360/209/198 372/216/203 361/217/43 349/210/36
f 367/211/49 379/218/56 380/219/204 368/212/199
f 368/212/199 380/219/204 381/220/205 369/213/200
f 369/213/200 381/220/205 382/221/206 370/214/201
f 370/214/201 382/221/206 383/222/207 371/215/202
f 371/215/202 383/222/207 384/223/208 372/216/203
f 372/216/203 384/223/208 373/224/50 361/217/43
f 379/218/56 391/225/63 392/226/209 380/219/204
f 380/219/204 392/226/209 393/227/210 381/220/205
f 381/220/205 393/227/210 394/228/211 382/221/206
f 382/221/206 394/228/211 395/229/212 383/222/207
f 383/222/207 395/229/212 396/230/213 384/223/208
f 384/223/208 396/230/213 385/231/57 373/224/50
f 391/225/63 403/232/70 404/233/214 392/226/209
f 392/226/209 404/233/214 405/234/215 393/227/210
f 393/227/210 405/234/215 406/235/216 394/228/211
f 394/228/211 406/235/216 407/236/217 395/229/212
f 395/229/212 407/236/217 408/237/218 396/230/213
f 396/230/213 408/237/218 397/238/64 385/231/57
f 403/232/70 415/239/77 416/240/219 404/233/214
f 404/233/214 416/240/219 417/241/220 405/234/215
f 405/234/215 417/241/220 418/242/221 406/235/216
f 406/235/216 418/242/221 419/243/222 407/236/217
f 407/236/217 419/243/222 420/244/223 408/237/218
f 408/237/218 420/244/223 409/245/71 397/238/64
f 415/239/77 427/246/84 428/247/224 416/240/219
f 416/240/219 428/247/224 429/248/225 417/241/220
f 417/241/220 429/248/225 430/249/226 418/242/221
f 418/242/221 430/249/226 431/250/227 419/243/222
f 419/243/222 431/250/227 432/251/228 420/244/223
f 420/244/223 432/251/228 421/252/78 409/245/71
f 427/246/84 439/253/91 440/254/229 428/247/224
f 428/247/224 440/254/229 441/255/230 429/248/225
f 429/248/225 441/255/230 442/256/231 430/249/226
f 430/249/226 442/256/231 443/257/232 431/250/227
f 431/250/227 443/257/232 444/258/233 432/251/228
f 432/251/228 444/258/233 433/259/85 421/252/78
f 439/253/91 451/260/98 452/261/234 440/254/229
f 440/254/229 452/261/234 453/262/235 441/255/230
f 441/255/230 453/262/235 454/263/236 442/256/231
f 442/256/231 454/263/236 455/264/237 443/257/232
f 443/257/232 455/264/237 456/265/238 444/258/233
f 444/258/233 456/265/238 445/266/92 433/259/85
f 451/260/98 463/267/105 464/268/239 452/261/234
f 452/261/234 464/268/239 465/269/240 453/262/235
f 453/262/235 465/269/240 466/270/241 454/263/236
f 454/263/236 466/270/241 467/271/242 455/264/237
f 455/264/237 467/271/242 468/272/243 456/265/238
f 456/265/238 468/272/243 457/273/99 445/266/92
f 463/267/105 475/274/112 476/275/244 464/268/239
f 464/268/239 476/275/244 477/276/245 465/269/240
f 465/269/240 477/276/245 478/277/246 466/270/241
f 466/270/241 478/277/246 479/278/247 467/271/242
f 467/271/242 479/278/247 480/279/248 468/272/243
f 468/272/243 480/279/248 469/280/106 457/273/99
f 475/274/112 487/281/119 488/282/249 476/275/244
f 476/275/244 488/282/249 489/283/250 477/276/245
f 477/276/245 489/283/250 490/284/251 478/277/246
f 478/277/246 490/284/251 491/285/252 479/278/247
f 479/278/247 491/285/252 492/286/253 480/279/248
f 480/279/248 492/286/253 481/287/113 469/280/106
f 487/281/119 499/288/126 500/289/254 488/282/249
f 488/282/249 500/289/254 501/290/255 489/283/250
f 489/283/250 501/290/255 502/291/256 490/284/251
f 490/284/251 502/291/256 503/292/257 491/285/252
f 491/285/252 503/292/257 504/293/258 492/286/253
f 492/286/253 504/293/258 493/294/120 481/287/113
f 499/288/126 511/295/133 512/296/259 500/289/254
f 500/289/254 512/296/259 513/297/260 501/290/255
f 501/290/255 513/297/260 514/298/261 502/291/256
f 502/291/256 514/298/261 515/299/262 503/292/257
f 503/292/257 515/299/262 516/300/263 504/293/258
f 504/293/258 516/300/263 505/301/127 493/294/120
f 511/295/133 523/302/140 524/303/264 512/296/259
f 512/296/259 524/303/264 525/304/265 513/297/260
f 513/297/260 525/304/265 526/305/266 514/298/261
f 514/298/261 526/305/266 527/306/267 515/299/262
f 515/299/262 527/306/267 528/307/268 516/300/263
f 516/300/263 528/307/268 517/308/134 505/301/127
f 523/302/140 535/309/147 536/310/269 524/303/264
f 524/303/264 536/310/269 537/311/270 525/304/265
f 525/304/265 537/311/270 538/312/271 526/305/266
f 526/305/266 538/312/271 539/313/272 527/306/267
f 527/306/267 539/313/272 540/314/273 528/307/268
f 528/307/268 540/314/273 529/315/141 517/308/134
f 535/309/147 547/316/154 548/317/274 536/310/269
f 536/310/269 548/317/274 549/318/275 537/311/270
f 537/311/270 549/318/275 550/319/276 538/312/271
f 538/312/271 550/319/276 551/320/277 539/313/272
f 539/313/272 551/320/277 552/321/278 540/314/273
f 540/314/273 552/321/278 541/322/148 529/315/141
f 547/316/154 559/323/161 560/324/279 548/317/274
f 548/317/274 560/324/279 561/325/280 549/318/275
f 549/318/275 561/325/280 562/326/281 550/319/276
f 550/319/276 562/326/281 563/327/282 551/320/277
f 551/320/277 563/327/282 564/328/283 552/321/278
f 552/321/278 564/328/283 553/329/155 541/322/148
f 559/323/161 571/330/168 572/331/284 560/324/279
f 560/324/279 572/331/284 573/332/285 561/325/280
f 561/325/280 573/332/285 574/333/286 562/326/281
f 562/326/281 574/333/286 575/334/287 563/327/282
f 563/327/282 575/334/287 576/335/288 564/328/283
f 564/328/283 576/335/288 565/336/162 553/329/155
f 571/330/168 7/1/1 8/4/4 572/331/284
f 572/331/284 8/4/4 9/6/6 573/332/285
f 573/332/285 9/6/6 10/8/8 574/333/286
f 574/333/286 10/8/8 11/10/10 575/334/287
f 575/334/287 11/10/10 12/12/12 576/335/288
f 576/335/288 12/12/12 1/13/13 565/336/162
usemtl Material.002
f 1/337/13 13/338/14 14/339/289 2/340/290
f 2/340/290 14/339/289 15/341/291 3/342/292
f 3/342/292 15/341/291 16/343/293 4/344/294
f 4/344/294 16/343/293 17/345/295 5/346/296
f 5/346/296 17/345/295 18/347/297 6/348/298
f 6/348/298 18/347/297 19/2/2 7/1/1
f 13/338/14 25/349/21 26/350/299 14/339/289
f 14/339/289 26/350/299 27/351/300 15/341/291
f 15/341/291 27/351/300 28/352/301 16/343/293
f 16/343/293 28/352/301 29/353/302 17/345/295
f 17/345/295 29/353/302 30/354/303 18/347/297
f 18/347/297 30/354/303 31/15/15 19/2/2
f 25/349/21 37/355/28 38/356/304 26/350/299
f 26/350/299 38/356/304 39/357/305 27/351/300
f 27/351/300 39/357/305 40/358/306 28/352/301
f 28/352/301 40/358/306 41/359/307 29/353/302
f 29/353/302 41/359/307 42/360/308 30/354/303
f 30/354/303 42/360/308 43/22/22 31/15/15
f 37/355/28 49/361/35 50/362/309 38/356/304
f 38/356/304 50/362/309 51/363/310 39/357/305
f 39/357/305 51/363/310 52/364/311 40/358/306
f 40/358/306 52/364/311 53/365/312 41/359/307
f 41/359/307 53/365/312 54/366/313 42/360/308
f 42/360/308 54/366/313 55/29/29 43/22/22
f 49/361/35 61/367/42 62/368/314 50/362/309
f 50/362/309 62/368/314 63/369/315 51/363/310
f 51/363/310 63/369/315 64/370/316 52/364/311
f 52/364/311 64/370/316 65/371/317 53/365/312
f 53/365/312 65/371/317 66/372/318 54/366/313
f 54/366/313 66/372/318 67/36/36 55/29/29
f 61/367/42 73/373/49 74/374/319 62/368/314
f 62/368/314 74/374/319 75/375/320 63/369/315
f 63/369/315 75/375/320 76/376/321 64/370/316
f 64/370/316 76/376/321 77/377/322 65/371/317
f 65/371/317 77/377/322 78/378/323 66/372/318
f 66/372/318 78/378/323 79/43/43 67/36/36
f 73/373/49 85/379/56 86/380/324 74/374/319
f 74/374/319 86/380/324 87/381/325 75/375/320
f 75/375/320 87/381/325 88/382/326 76/376/321
f 76/376/321 88/382/326 89/383/327 77/377/322
f 77/377/322 89/383/327 90/384/328 78/378/323
f 78/378/323 90/384/328 91/50/50 79/43/43
f 85/379/56 97/385/63 98/386/329 86/380/324
f 86/380/324 98/386/329 99/387/330 87/381/325
f 87/381/325 99/387/330 100/388/331 88/382/326
f 88/382/326 100/388/331 101/389/332 89/383/327
f 89/383/327 101/389/332 102/390/333 90/384/328
f 90/384/328 102/390/333 103/57/57 91/50/50
f 97/385/63 109/391/70 110/392/334 98/386/329
f 98/386/329 110/392/334 111/393/335 99/387/330
f 99/387/330 111/393/335 112/394/336 100/388/331
f 100/388/331 112/394/336 113/395/337 101/389/332
f 101/389/332 113/395/337 114/396/338 102/390/333
f 102/390/333 114/396/338 115/64/64 103/57/57
f 109/391/70 121/397/77 122/398/339 110/392/334
f 110/392/334 122/398/339 123/399/340 111/393/335
f 111/393/335 123/399/340 124/400/341 112/394/336
f 112/394/336 124/400/341 125/401/342 113/395/337
f 113/395/337 125/401/342 126/402/343 114/396/338
f 114/396/338 126/402/343 127/71/71 115/64/64
f 121/397/77 133/403/84 134/404/344 122/398/339
f 122/398/339 134/404/344 135/405/345 123/399/340
f 123/399/340 135/405/345 136/406/346 124/400/341
f 124/400/341 136/406/346 137/407/347 125/401/342
f 125/401/342 137/407/347 138/408/348 126/402/343
f 126/402/343 138/408/348 139/78/78 127/71/71
f 133/403/84 145/409/91 146/410/349 134/404/344
f 134/404/344 146/410/349 147/411/350 135/405/345
f 135/405/345 147/411/350 148/412/351 136/406/346
f 136/406/346 148/412/351 149/413/352 137/407/347
f 137/407/347 149/413/352 150/414/353 138/408/348
f 138/408/348 150/414/353 151/85/85 139/78/78
f 145/409/91 157/415/98 158/416/354 146/410/349
f 146/410/349 158/416/354 159/417/355 147/411/350
f 147/411/350 159/417/355 160/418/356 148/412/351
f 148/412/351 160/418/356 161/419/357 149/413/352
f 149/413/352 161/419/357 162/420/358 150/414/353
f 150/414/353 162/420/358 163/92/92 151/85/85
f 157/415/98 169/421/105 170/422/359 158/416/354
f 158/416/354 170/422/359 171/423/360 159/417/355
f 159/417/355 171/423/360 172/424/361 160/418/356
f 160/418/356 172/424/361 173/425/362 161/419/357
f 161/419/357 173/425/362 174/426/363 162/420/358
f 162/420/358 174/426/363 175/99/99 163/92/92
f 169/421/105 181/427/112 182/428/364 170/422/359
f 170/422/359 182/428/364 183/429/365 171/423/360
f 171/423/360 183/429/365 184/430/366 172/424/361
f 172/424/361 184/430/366 185/431/367 173/425/362
f 173/425/362 185/431/367 186/432/368 174/426/363
f 174/426/363 186/432/368 187/106/106 175/99/99
f 181/427/112 193/433/119 194/434/369 182/428/364
f 182/428/364 194/434/369 195/435/370 183/429/365
f 183/429/365 195/435/370 196/436/371 184/430/366
f 184/430/366 196/436/371 197/437/372 185/431/367
f 185/431/367 197/437/372 198/438/373 186/432/368
f 186/432/368 198/438/373 199/113/113 187/106/106
f 193/433/119 205/439/126 206/440/374 194/434/369
f 194/434/369 206/440/374 207/441/375 195/435/370
f 195/435/370 207/441/375 208/442/376 196/436/371
f 196/436/371 208/442/376 209/443/377 197/437/372
f 197/437/372 209/443/377 210/444/378 198/438/373
f 198/438/373 210/444/378 211/120/120 199/113/113
f 205/439/126 217/445/133 218/446/379 206/440/374
f 206/440/374 218/446/379 219/447/380 207/441/375
f 207/441/375 219/447/380 220/448/381 208/442/376
f 208/442/376 220/448/381 221/449/382 209/443/377
f 209/443/377 221/449/382 222/450/383 210/444/378
f 210/444/378 222/450/383 223/127/127 211/120/120
f 217/445/133 229/451/140 230/452/384 218/446/379
f 218/446/379 230/452/384 231/453/385 219/447/380
f 219/447/380 231/453/385 232/454/386 220/448/381
f 220/448/381 232/454/386 233/455/387 221/449/382
f 221/449/382 233/455/387 234/456/388 222/450/383
f 222/450/383 234/456/388 235/134/134 223/127/127
f 229/451/140 241/457/147 242/458/389 230/452/384
f 230/452/384 242/458/389 243/459/390 231/453/385
f 231/453/385 243/459/390 244/460/391 232/454/386
f 232/454/386 244/460/391 245/461/392 233/455/387
f 233/455/387 245/461/392 246/462/393 234/456/388
f 234/456/388 246/462/393 247/141/141 235/134/134
f 241/457/147 253/463/154 254/464/394 242/458/389
f 242/458/389 254/464/394 255/465/395 243/459/390
f 243/459/390 255/465/395 256/466/396 244/460/391
f 244/460/391 256/466/396 257/467/397 245/461/392
f 245/461/392 257/467/397 258/468/398 246/462/393
f 246/462/393 258/468/398 259/148/148 247/141/141
f 253/463/154 265/469/161 266/470/399 254/464/394
f 254/464/394 266/470/399 267/471/400 255/465/395
f 255/465/395 267/471/400 268/472/401 256/466/396
f 256/466/396 268/472/401 269/473/402 257/467/397
f 257/467/397 269/473/402 270/474/403 258/468/398
f 258/468/398 270/474/403 271/155/155 259/148/148
f 265/469/161 277/475/168 278/476/404 266/470/399
f 266/470/399 278/476/404 279/477/405 267/471/400
f 267/471/400 279/477/405 280/478/406 268/472/401
f 268/472/401 280/478/406 281/479/407 269/473/402
f 269/473/402 281/479/407 282/480/408 270/474/403
f 270/474/403 282/480/408 283/162/162 271/155/155
f 277/475/168 289/481/1 290/482/409 278/476/404
f 278/476/404 290/482/409 291/483/410 279/477/405
f 279/477/405 291/483/410 292/484/411 280/478/406
f 280/478/406 292/484/411 293/485/412 281/479/407
f 281/479/407 293/485/412 294/486/413 282/480/408
f 282/480/408 294/486/413 295/169/13 283/162/162
f 289/481/1 301/487/2 302/488/414 290/482/409
f 290/482/409 302/488/414 303/489/415 291/483/410
f 291/483/410 303/489/415 304/490/416 292/484/411
f 292/484/411 304/490/416 305/491/417 293/485/412
f 293/485/412 305/491/417 306/492/418 294/486/413
f 294/486/413 306/492/418 307/176/14 295/169/13
f 301/487/2 313/493/15 314/494/419 302/488/414
f 302/488/414 314/494/419 315/495/420 303/489/415
f 303/489/415 315/495/420 316/496/421 304/490/416
f 304/490/416 316/496/421 317/497/422 305/491/417
f 305/491/417 317/497/422 318/498/423 306/492/418
f 306/492/418 318/498/423 319/183/21 307/176/14
f 313/493/15 325/499/22 326/500/424 314/494/419
f 314/494/419 326/500/424 327/501/425 315/495/420
f 315/495/420 327/501/425 328/502/426 316/496/421
f 316/496/421 328/502/426 329/503/427 317/497/422
f 317/497/422 329/503/427 330/504/428 318/498/423
f 318/498/423 330/504/428 331/190/28 319/183/21
f 325/499/22 337/505/29 338/506/429 326/500/424
f 326/500/424 338/506/429 339/507/430 327/501/425
f 327/501/425 339/507/430 340/508/431 328/502/426
f 328/502/426 340/508/431 341/509/432 329/503/427
f 329/503/427 341/509/432 342/510/433 330/504/428
f 330/504/428 342/510/433 343/197/35 331/190/28
f 337/505/29 349/511/36 350/512/434 338/506/429
f 338/506/429 350/512/434 351/513/435 339/507/430
f 339/507/430 351/513/435 352/514/436 340/508/431
f 340/508/431 352/514/436 353/515/437 341/509/432
f 341/509/432 353/515/437 354/516/438 342/510/433
f 342/510/433 354/516/438 355/204/42 343/197/35
f 349/511/36 361/517/43 362/518/439 350/512/434
f 350/512/434 362/518/439 363/519/440 351/513/435
f 351/513/435 363/519/440 364/520/441 352/514/436
f 352/514/436 364/520/441 365/521/442 353/515/437
f 353/515/437 365/521/442 366/522/443 354/516/438
f 354/516/438 366/522/443 367/211/49 355/204/42
f 361/517/43 373/523/50 374/524/444 362/518/439
f 362/518/439 374/524/444 375/525/445 363/519/440
f 363/519/440 375/525/445 376/526/446 364/520/441
f 364/520/441 376/526/446 377/527/447 365/521/442
f 365/521/442 377/527/447 378/528/448 366/522/443
f 366/522/443 378/528/448 379/218/56 367/211/49
f 373/523/50 385/529/57 386/530/449 374/524/444
f 374/524/444 386/530/449 387/531/450 375/525/445
f 375/525/445 387/531/450 388/532/451 376/526/446
f 376/526/446 388/532/451 389/533/452 377/527/447
f 377/527/447 389/533/452 390/534/453 378/528/448
f 378/528/448 390/534/453 391/225/63 379/218/56
f 385/529/57 397/535/64 398/536/454 386/530/449
f 386/530/449 398/536/454 399/537/455 387/531/450
f 387/531/450 399/537/455 400/538/456 388/532/451
f 388/532/451 400/538/456 401/539/457 389/533/452
f 389/533/452 401/539/457 402/540/458 390/534/453
f 390/534/453 402/540/458 403/232/70 391/225/63
f 397/535/64 409/541/71 410/542/459 398/536/454
f 398/536/454 410/542/459 411/543/460 399/537/455
f 399/537/455 411/543/460 412/544/461 400/538/456
f 400/538/456 412/544/461 413/545/462 401/539/457
f 401/539/457 413/545/462 414/546/463 402/540/458
f 402/540/458 414/546/463 415/239/77 403/232/70
f 409/541/71 421/547/78 422/548/464 410/542/459
f 410/542/459 422/548/464 423/549/465 411/543/460
f 411/543/460 423/549/465 424/550/466 412/544/461
f 412/544/461 424/550/466 425/551/467 413/545/462
f 413/545/462 425/551/467 426/552/468 414/546/463
f 414/546/463 426/552/468 427/246/84 415/239/77
f 421/547/78 433/553/85 434/554/469 422/548/464
f 422/548/464 434/554/469 435/555/470 423/549/465
f 423/549/465 435/555/470 436/556/471 424/550/466
f 424/550/466 436/556/471 437/557/472 425/551/467
f 425/551/467 437/557/472 438/558/473 426/552/468
f 426/552/468 438/558/473 439/253/91 427/246/84
f 433/553/85 445/559/92 446/560/474 434/554/469
f 434/554/469 446/560/474 447/561/475 435/555/470
f 435/555/470 447/561/475 448/562/476 436/556/471
f 436/556/471 448/562/476 449/563/477 437/557/472
f 437/557/472 449/563/477 450/564/478 438/558/473
f 438/558/473 450/564/478 451/260/98 439/253/91
f 445/559/92 457/565/99 458/566/479 446/560/474
f 446/560/474 458/566/479 459/567/480 447/561/475
f 447/561/475 459/567/480 460/568/481 448/562/476
f 448/562/476 460/568/481 461/569/482 449/563/477
f 449/563/477 461/569/482 462/570/483 450/564/478
f 450/564/478 462/570/483 463/267/105 451/260/98
f 457/565/99 469/571/106 470/572/484 458/566/479
f 458/566/479 470/572/484 471/573/485 459/567/480
f 459/567/480 471/573/485 472/574/486 460/568/481
f 460/568/481 472/574/486 473/575/487 461/569/482
f 461/569/482 473/575/487 474/576/488 462/570/483
f 462/570/483 474/576/488 475/274/112 463/267/105
f 469/571/106 481/577/113 482/578/489 470/572/484
f 470/572/484 482/578/489 483/579/490 471/573/485
f 471/573/485 483/579/490 484/580/491 472/574/486
f 472/574/486 484/580/491 485/581/492 473/575/487
f 473/575/487 485/581/492 486/582/493 474/576/488
f 474/576/488 486/582/493 487/281/119 475/274/112
f 481/577/113 493/583/120 494/584/494 482/578/489
f 482/578/489 494/584/494 495/585/495 483/579/490
f 483/579/490 495/585/495 496/586/496 484/580/491
f 484/580/491 496/586/496 497/587/497 485/581/492
f 485/581/492 497/587/497 498/588/498 486/582/493
f 486/582/493 498/588/498 499/288/126 487/281/119
f 493/583/120 505/589/127 506/590/499 494/584/494
f 494/584/494 506/590/499 507/591/500 495/585/495
f 495/585/495 507/591/500 508/592/501 496/586/496
f 496/586/496 508/592/501 509/593/502 497/587/497
f 497/587/497 509/593/502 510/594/503 498/588/498
f 498/588/498 510/594/503 511/295/133 499/288/126
f 505/589/127 517/595/134 518/596/504 506/590/499
f 506/590/499 518/596/504 519/597/505 507/591/500
f 507/591/500 519/597/505 520/598/506 508/592/501
f 508/592/501 520/598/506 521/599/507 509/593/502
f 509/593/502 521/599/507 522/600/508 510/594/503
f 510/594/503 522/600/508 523/302/140 511/295/133
f 517/595/134 529/601/141 530/602/509 518/596/504
f 518/596/504 530/602/509 531/603/510 519/597/505
f 519/597/505 531/603/510 532/604/511 520/598/506
f 520/598/506 532/604/511 533/605/512 521/599/507
f 521/599/507 533/605/512 534/606/513 522/600/508
f 522/600/508 534/606/513 535/309/147 523/302/140
f 529/601/141 541/607/148 542/608/514 530/602/509
f 530/602/509 542/608/514 543/609/515 531/603/510
f 531/603/510 543/609/515 544/610/516 532/604/511
f 532/604/511 544/610/516 545/611/517 533/605/512
f 533/605/512 545/611/517 546/612/518 534/606/513
f 534/606/513 546/612/518 547/316/154 535/309/147
f 541/607/148 553/613/155 554/614/519 542/608/514
f 542/608/514 554/614/519 555/615/520 543/609/515
f 543/609/515 555/615/520 556/616/521 544/610/516
f 544/610/516 556/616/521 557/617/522 545/611/517
f 545/611/517 557/617/522 558/618/523 546/612/518
f 546/612/518 558/618/523 559/323/161 547/316/154
f 553/613/155 565/619/162 566/620/524 554/614/519
f 554/614/519 566/620/524 567/621/525 555/615/520
f 555/615/520 567/621/525 568/622/526 556/616/521
f 556/616/521 568/622/526 569/623/527 557/617/522
f 557/617/522 569/623/527 570/624/528 558/618/523
f 558/618/523 570/624/528 571/330/168 559/323/161
f 565/619/162 1/337/13 2/340/290 566/620/524
f 566/620/524 2/340/290 3/342/292 567/621/525
f 567/621/525 3/342/292 4/344/294 568/622/526
f 568/622/526 4/344/294 5/346/296 569/623/527
f 569/623/527 5/346/296 6/348/298 570/624/528
f 570/624/528 6/348/298 7/1/1 571/330/168
