<?xml version="1.0" encoding="UTF-8" standalone="no"?>
<svg
   xmlns:dc="http://purl.org/dc/elements/1.1/"
   xmlns:cc="http://creativecommons.org/ns#"
   xmlns:rdf="http://www.w3.org/1999/02/22-rdf-syntax-ns#"
   xmlns:svg="http://www.w3.org/2000/svg"
   xmlns="http://www.w3.org/2000/svg"
   xmlns:sodipodi="http://sodipodi.sourceforge.net/DTD/sodipodi-0.dtd"
   xmlns:inkscape="http://www.inkscape.org/namespaces/inkscape"
   width="512"
   height="512"
   viewBox="0 0 512 512"
   version="1.1"
   id="svg4575"
   inkscape:version="0.92.4 (5da689c313, 2019-01-14)"
   sodipodi:docname="unimpressed.svg"
   enable-background="new"
   inkscape:export-filename="/tmp/tp.png"
   inkscape:export-xdpi="96"
   inkscape:export-ydpi="96">
  <defs
     id="defs4569">
    <inkscape:path-effect
       effect="taper_stroke"
       id="path-effect918"
       is_visible="true"
       stroke_width="1.5875"
       attach_start="0.32154044"
       end_offset="0.2"
       smoothing="0.5"
       jointype="extrapolated"
       miter_limit="100" />
    <inkscape:path-effect
       effect="taper_stroke"
       id="path-effect911"
       is_visible="true"
       stroke_width="1.5875"
       attach_start="0.36889518"
       end_offset="0.012910933"
       smoothing="0.5"
       jointype="extrapolated"
       miter_limit="100" />
    <inkscape:path-effect
       effect="taper_stroke"
       id="path-effect907"
       is_visible="true"
       stroke_width="1.5875"
       attach_start="0.43765327"
       end_offset="0"
       smoothing="0.5"
       jointype="extrapolated"
       miter_limit="100" />
    <inkscape:path-effect
       effect="taper_stroke"
       id="path-effect895"
       is_visible="true"
       stroke_width="1.5875"
       attach_start="0.2"
       end_offset="0.022049241"
       smoothing="0.5"
       jointype="extrapolated"
       miter_limit="100" />
    <inkscape:path-effect
       effect="taper_stroke"
       id="path-effect889"
       is_visible="true"
       stroke_width="1.5875"
       attach_start="0.33160615"
       end_offset="0.43219757"
       smoothing="0.5"
       jointype="round"
       miter_limit="100" />
    <inkscape:path-effect
       effect="taper_stroke"
       id="path-effect839"
       is_visible="true"
       stroke_width="1.5875"
       attach_start="0.3572778"
       end_offset="0.3372101"
       smoothing="0.5"
       jointype="extrapolated"
       miter_limit="100" />
  </defs>
  <sodipodi:namedview
     id="base"
     pagecolor="#ffffff"
     bordercolor="#666666"
     borderopacity="1.0"
     inkscape:pageopacity="0.0"
     inkscape:pageshadow="2"
     inkscape:zoom="2.661318"
     inkscape:cx="146.91953"
     inkscape:cy="181.14618"
     inkscape:document-units="px"
     inkscape:current-layer="layer3"
     showgrid="false"
     units="px"
     inkscape:pagecheckerboard="true"
     inkscape:window-width="2408"
     inkscape:window-height="1411"
     inkscape:window-x="30"
     inkscape:window-y="0"
     inkscape:window-maximized="1"
     inkscape:document-rotation="0"
     borderlayer="true"
     inkscape:snap-global="false"
     scale-x="1"
     inkscape:object-paths="false"
     showguides="true"
     inkscape:snap-page="false" />
  <metadata
     id="metadata4572">
    <rdf:RDF>
      <cc:Work
         rdf:about="">
        <dc:format>image/svg+xml</dc:format>
        <dc:type
           rdf:resource="http://purl.org/dc/dcmitype/StillImage" />
        <dc:title />
      </cc:Work>
    </rdf:RDF>
  </metadata>
  <g
     inkscape:groupmode="layer"
     id="layer18"
     inkscape:label="test" />
  <g
     inkscape:groupmode="layer"
     id="layer2"
     inkscape:label="dragon"
     style="display:inline">
    <g
       inkscape:groupmode="layer"
       id="layer10"
       inkscape:label="horn b"
       sodipodi:insensitive="true">
      <path
         style="fill:#3a3c3f;fill-opacity:1;stroke:#292929;stroke-width:6.00008011;stroke-linecap:round;stroke-linejoin:round"
         d="M 176.81674,139.85942 C 205.07923,97.30919 267.6955,20.12578 327.18926,11.3543 c -49.09273,47.622365 -75.39069,90.54563 -93.68741,138.811"
         id="path923"
         inkscape:connector-curvature="0"
         sodipodi:nodetypes="ccc" />
      <path
         style="fill:#3250b0;fill-opacity:1;stroke:#1d2848;stroke-width:6.00008011;stroke-linecap:round;stroke-linejoin:round"
         d="m 149.99811,199.04533 c -2.26729,-8.53617 -1.28818,-13.23169 3.40243,-20.83854 10.54618,-17.10294 23.3008,-39.12647 26.70841,-44.56192 19.79608,-2.09989 53.25498,1.80114 60.60115,8.17624 0.0514,7.30088 -18.09495,47.12965 -18.09495,47.12965"
         id="path920"
         inkscape:connector-curvature="0"
         sodipodi:nodetypes="csccc" />
    </g>
    <g
       style="display:inline"
       inkscape:groupmode="layer"
       id="layer11"
       inkscape:label="head base"
       sodipodi:insensitive="true">
      <path
         sodipodi:nodetypes="csssssc"
         inkscape:connector-curvature="0"
         id="path916"
         d="m 189.379,164.69957 c -27.0935,3.01544 -56.63784,33.74148 -60.13635,58.87942 -1.75228,12.59073 -6.96423,15.55191 -5.14578,28.34968 4.90584,34.526 -7.9855,49.63049 -15.40431,69.66276 -5.38676,14.54533 -9.634901,26.57146 -7.64115,34.25275 2.39364,9.22191 191.76916,3.48666 206.04483,-80.05031 C 321.3719,192.2569 286.8278,178.0936 286.8278,178.0936"
         style="fill:#3250b0;fill-opacity:1;stroke:none;stroke-width:6.00008011;stroke-linecap:round;stroke-linejoin:round" />
      <path
         sodipodi:nodetypes="cccscscccscsscccc"
         inkscape:connector-curvature="0"
         d="m 187.05078,164.625 c -4.4271,-0.005 -14.463,0.63147 -23.91406,5.82031 -16.33298,8.96441 -28.7486,23.40125 -33.72461,38.56836 -0.56058,1.70866 -4.52026,12.57664 -6.00586,24.88672 -1.7232,14.27886 -1.06966,30.72419 -1.14063,32.94727 -0.69913,21.90151 -11.45862,41.33123 -16.93164,52.63086 -4.25689,8.78878 -8.758227,35.46253 -8.558187,37.10864 0.19699,1.62113 2.600733,2.05451 2.600733,2.05451 0,0 0.932674,-0.70372 2.068364,-1.59375 1.11754,-0.87581 5.04916,-26.14245 9.29144,-34.96198 5.30762,-11.03433 16.78193,-31.75664 17.52539,-55.04688 0.099,-3.1024 -0.57833,-18.49997 1.10156,-32.41992 1.38375,-11.46615 4.98209,-21.39374 5.75,-23.73437 4.47857,-13.65088 15.67072,-26.81353 30.91016,-35.17774 10.92171,-5.99241 23.35547,-11.00781 23.35547,-11.00781 0,0 -0.85243,-0.0725 -2.32813,-0.0742 z"
         style="fill:#1d2848;fill-opacity:1;fill-rule:nonzero;stroke:none;stroke-width:1.58749998;stroke-linecap:round;stroke-linejoin:round"
         id="path914" />
    </g>
    <g
       inkscape:groupmode="layer"
       id="layer4"
       inkscape:label="neck"
       style="opacity:1"
       sodipodi:insensitive="true">
      <path
         sodipodi:nodetypes="csscsc"
         inkscape:connector-curvature="0"
         id="path909"
         d="m 420.21692,533.32081 c 3.03051,-86.40545 3.60826,-158.62925 -7.18138,-225.5834 -8.57114,-53.18714 -27.39745,-129.18078 -99.31891,-153.6996 -57.61231,-19.64067 -94.68658,6.51049 -103.41564,32.64578 -16.53028,56.96319 -15.59306,140.37689 15.34291,170.8283 30.93598,30.45143 53.99242,156.85156 52.98225,170.48881"
         style="fill:#3250b0;fill-opacity:1;stroke:none;stroke-width:6.00008011;stroke-linecap:round;stroke-linejoin:round" />
      <path
         id="path901"
         d="m 324.449,159.77632 c 17.84773,8.23548 35.69414,19.8805 49.58878,38.31347 23.08939,30.63096 33.89453,80.62203 45.45884,151.48325 C 404.5212,246.13694 356.22702,196.83972 318.91725,182.7269"
         style="fill:#292f75;fill-opacity:1;stroke:none;stroke-width:6.00008011;stroke-linecap:round;stroke-linejoin:round"
         inkscape:connector-curvature="0" />
      <path
         id="path899"
         d="m 312.74805,156.87695 c 70.22956,23.94203 88.7946,98.39629 97.32617,151.33789 10.59994,65.7771 10.18584,137.15703 7.26029,221.67001 -0.0578,1.66486 2.88282,3.43554 2.88282,3.43554 0,0 3.05556,-1.56107 3.11328,-3.22851 2.92838,-84.59548 3.36814,-156.42979 -7.33256,-222.83211 -8.61072,-53.43268 -27.69915,-130.96495 -101.3125,-156.06055"
         style="fill:#1d2848;fill-opacity:1;fill-rule:nonzero;stroke:none;stroke-width:1.58749998;stroke-linecap:round;stroke-linejoin:round"
         inkscape:connector-curvature="0" />
      <path
         style="fill:#c4d9f5;fill-opacity:1;stroke:#1d2848;stroke-width:6.00008011;stroke-linecap:round;stroke-linejoin:round"
         d="m 329.38758,530.37167 c 0.46636,-23.34401 16.90226,-131.44507 -1.06926,-183.52177 -76.53412,5.02343 -129.87285,32.60548 -105.71024,64.24709 20.51499,26.86495 13.05387,95.29045 8.67558,117.01812"
         id="path903"
         inkscape:connector-curvature="0"
         sodipodi:nodetypes="ccsc" />
    </g>
    <g
       inkscape:label="neck 1"
       id="layer13"
       inkscape:groupmode="layer"
       sodipodi:insensitive="true">
      <path
         id="path892"
         d="m 318.91725,182.7269 c -6.72968,-2.54557 -10.73974,-9.4739 -17.15021,-11.73648 -18.70325,-6.60132 -37.58854,-6.14861 -44.52459,1.42512 -8.27685,9.0378 -13.70572,22.91565 -28.31384,30.03365 -11.54722,5.62653 -35.28537,1.938 -37.10476,-19.68356 -1.9987,-23.7524 38.41626,-55.18273 91.39467,-38.07214 12.34957,3.98858 26.79046,8.41978 41.23048,15.08283"
         style="opacity:1;fill:#292f75;fill-opacity:1;stroke:none;stroke-width:6.00008011;stroke-linecap:round;stroke-linejoin:round"
         inkscape:connector-curvature="0" />
      <path
         id="path896"
         d="m 314.68555,151.19922 c -13.92191,-4.74613 -26.72943,-6.8889 -38.29883,-7.01758 -19.28233,-0.21447 -35.12714,5.16472 -46.96094,13.41016 -7.73313,5.35452 -12.89702,12.33721 -15.84961,18.63476 -2.84463,6.0673 -3.27539,10.45703 -3.27539,10.45703 0,0 1.91227,-3.97014 5.82227,-8.89062 4.21067,-5.29886 9.62585,-10.29348 16.73242,-15.2793 17.13919,-11.94207 44.29885,-17.77101 79.89258,-5.63672"
         style="opacity:1;fill:#1d2848;fill-opacity:1;fill-rule:nonzero;stroke:none;stroke-width:1.58749998;stroke-linecap:round;stroke-linejoin:round"
         inkscape:connector-curvature="0" />
      <path
         sodipodi:nodetypes="scscccccs"
         inkscape:connector-curvature="0"
         d="m 251.56055,136.81641 c -7.87079,0.15016 -15.23557,1.32442 -21.95899,3.27539 -8.32763,2.39802 -15.1048,6.63951 -19.94726,10.91992 -4.66476,4.12333 -6.86524,7.5918 -6.86524,7.5918 0,0 3.31336,-2.42441 8.5625,-5.12305 5.75189,-2.95712 11.98803,-5.30574 19.92188,-7.62695 14.17047,-4.11193 41.16834,-2.4138 59.74535,5.80541 l 2.42748,-5.48831 c -11.05532,-4.89132 -31.76614,-9.54728 -41.88572,-9.35421 z"
         style="opacity:1;fill:#1d2848;fill-opacity:1;fill-rule:nonzero;stroke:none;stroke-width:1.58749998;stroke-linecap:round;stroke-linejoin:round"
         id="path905" />
    </g>
    <g
       inkscape:groupmode="layer"
       id="layer7"
       inkscape:label="jaw">
      <path
         sodipodi:nodetypes="cssscscc"
         inkscape:connector-curvature="0"
         id="path893"
         d="m 360.85683,277.88385 c 9.24887,23.46208 -1.168,54.11736 -19.66258,67.81999 -19.60192,14.52304 -47.27974,19.90819 -59.57139,31.79338 -12.66891,12.24999 -8.40673,21.28103 -38.05408,37.33808 -29.64733,16.05701 -94.71082,26.40157 -128.55852,-17.13177 0.18272,-42.25414 110.94263,-1.16587 151.89989,-46.85461 15.94894,-17.7914 47.55243,-28.04671 59.74986,-33.0878 2.32174,-31.92637 16.06039,-51.08882 34.19682,-39.87727 z"
         style="fill:#c4d9f5;fill-opacity:1;stroke:none;stroke-width:6.00008011;stroke-linecap:round;stroke-linejoin:round" />
      <path
         style="fill:#1d2848;fill-opacity:1;fill-rule:nonzero;stroke:none;stroke-width:1.58749998;stroke-linecap:round;stroke-linejoin:round"
         d="m 367.1311,292.41342 c -0.61001,-8.47658 -6.27427,-14.52957 -6.27427,-14.52957 0,0 -0.21657,8.08621 0.29001,14.96496 1.40709,19.33976 -7.84359,40.14975 -21.73854,50.44451 -19.20175,14.22656 -46.93301,19.53721 -59.87083,32.04719 -13.41622,12.97258 -8.25391,21.07263 -37.39742,36.8568 -28.01662,15.17384 -89.31785,25.26429 -122.56532,-13.64122 -1.09168,-1.27742 -4.56447,-0.85256 -4.56447,-0.85256 0,0 -1.25442,3.27905 0.003,4.75059 35.58437,41.64012 100.01354,31.2513 129.98419,15.01918 30.13493,-16.32113 26.76503,-26.26868 38.71073,-37.81938 11.64549,-11.26038 39.26986,-16.72002 59.27196,-31.53956 15.69637,-11.62943 25.69754,-34.44304 24.15089,-55.70094 z"
         id="path891"
         inkscape:connector-curvature="0"
         sodipodi:nodetypes="csssc" />
    </g>
    <g
       inkscape:groupmode="layer"
       id="layer1"
       inkscape:label="ear"
       sodipodi:insensitive="true">
      <path
         id="path897"
         style="fill:#1d2848;fill-opacity:1;stroke:none;stroke-width:6.00008011;stroke-linecap:round;stroke-linejoin:round"
         d="m 346.03542,247.09524 a 8.1222219,5.7400856 56.946203 0 1 -0.38104,9.93851 8.1222219,5.7400856 56.946203 0 1 -9.24117,-3.67692 8.1222219,5.7400856 56.946203 0 1 0.38102,-9.9385 8.1222219,5.7400856 56.946203 0 1 9.24119,3.67691"
         inkscape:connector-curvature="0" />
    </g>
    <g
       inkscape:groupmode="layer"
       id="layer6"
       inkscape:label="horn f"
       style="display:inline;opacity:1"
       sodipodi:insensitive="true">
      <path
         style="fill:#3a3c3f;fill-opacity:1;stroke:#292929;stroke-width:6.00008011;stroke-linecap:round;stroke-linejoin:round"
         d="M 270.26809,162.27679 C 294.86953,124.31611 377.76647,44.333694 434.1178,28.71452 400.13126,64.383688 343.58515,145.88961 331.21799,174.60299"
         id="path883"
         inkscape:connector-curvature="0"
         sodipodi:nodetypes="ccc" />
      <path
         style="fill:#3250b0;fill-opacity:1;stroke:none;stroke-width:6.00008011;stroke-linecap:round;stroke-linejoin:round"
         d="m 256.15745,180.01405 c 3.34461,-5.62092 24.68157,-34.33615 24.68157,-34.33615 21.02372,-2.95678 45.98829,10.9467 55.64161,20.04734 -3.60243,7.09862 -12.35921,28.14943 -12.35921,28.14943"
         id="path885"
         inkscape:connector-curvature="0"
         sodipodi:nodetypes="cccc" />
      <path
         inkscape:connector-curvature="0"
         d="m 286.74872,142.27026 c -2.12879,0.005 -4.24404,0.1444 -6.32812,0.4375 a 3.0000409,3.0000409 0 0 0 -1.99024,1.18165 c -18.69992,25.16631 -10.71864,14.47818 -16.88086,23.05273 -4.09795,5.68644 -5.39258,13.07227 -5.39258,13.07227 0,0 6.30907,-4.05005 10.26563,-9.57032 5.93532,-8.25883 -0.59744,0.47547 16.05273,-21.93554 18.50054,-1.97424 40.45174,9.60659 50.32227,17.96289 -2.15783,4.5215 -5.21332,11.53569 -7.65234,17.25586 l -0.004,0.01 c -1.85674,4.40165 -1.05384,9.91756 -1.02148,10.13281 0.002,0.005 0.002,0.004 0.002,0.004 0,0 -9.5e-4,0.001 0.004,0 0.17695,-0.12756 4.689,-3.40967 6.54296,-7.80469 2.8183,-6.60948 6.49738,-15.06707 8.48633,-18.98633 a 3.0000409,3.0000409 0 0 0 -0.61719,-3.54101 c -9.27084,-8.74007 -31.21075,-21.3169 -51.78906,-21.27149 z"
         style="fill:#1d2848;fill-opacity:1;fill-rule:nonzero;stroke:none;stroke-width:1.58749998;stroke-linecap:round;stroke-linejoin:round"
         id="path887" />
    </g>
    <g
       inkscape:groupmode="layer"
       id="layer9"
       inkscape:label="eye b"
       style="display:inline">
      <path
         sodipodi:nodetypes="csscc"
         inkscape:connector-curvature="0"
         id="path881"
         d="m 183.15037,231.10025 c -0.72205,19.85448 -11.19463,37.23321 -24.25156,42.08236 -9.93487,3.68967 -34.02312,-6.96411 -39.07818,-28.83274 -2.91349,-12.60401 11.18497,-38.56595 21.33433,-42.82198 22.16081,5.74617 28.34223,6.14049 41.99541,29.57236 z"
         style="fill:#ffffff;fill-opacity:1;stroke:none;stroke-width:6.00008011;stroke-linecap:round;stroke-linejoin:round" />
      <path
         style="fill:#f01d0a;fill-opacity:1;stroke:none;stroke-width:6.00008011;stroke-linecap:round;stroke-linejoin:round"
         d="m 150.28707,214.55152 c -8.20981,7.77662 -9.10973,25.79154 -4.77693,33.40827 4.3328,7.61674 17.17482,10.12639 23.33168,3.16114 6.15685,-6.96523 8.9492,-22.54092 4.02902,-31.20561 -4.92019,-8.66469 -15.90884,-11.68653 -22.58377,-5.3638 z"
         id="path877"
         inkscape:connector-curvature="0"
         sodipodi:nodetypes="sssss" />
      <path
         style="fill:#1d2848;fill-opacity:1;stroke:none;stroke-width:6.00008011;stroke-linecap:round;stroke-linejoin:round"
         d="m 192.71764,232.24822 c -2.91543,3.48057 -9.56576,5.00418 -14.46607,4.35415 -5.32464,-15.76109 -13.56884,-28.24522 -42.08532,-32.03266 -3.62418,-2.70818 -5.12526,-6.42719 -6.86647,-8.08702 15.83629,0.9495 41.36485,1.54861 55.26305,32.41869 2.17435,2.22704 5.50651,3.40971 8.15481,3.34684 z"
         id="path859"
         inkscape:connector-curvature="0"
         sodipodi:nodetypes="cccccc" />
      <path
         style="fill:none;fill-opacity:1;stroke:#1d2848;stroke-width:6.00008011;stroke-linecap:round;stroke-linejoin:round"
         d="m 181.62936,231.0072 c -0.72205,19.85448 -8.90529,35.84701 -21.96222,40.69616 -9.93487,3.68967 -33.46208,-3.53818 -38.51714,-25.4068 -2.91349,-12.60401 9.8556,-40.51264 20.00496,-44.76867"
         id="path873"
         inkscape:connector-curvature="0"
         sodipodi:nodetypes="cssc" />
      <path
         style="fill:#000000;fill-opacity:1;stroke:none;stroke-width:6.00008011;stroke-linecap:round;stroke-linejoin:round"
         d="m 154.72062,222.26293 c -4.03844,5.92336 -4.10267,16.45109 -1.35822,21.24063 2.13525,3.72637 9.30367,4.0848 11.73944,0.90222 3.03028,-3.95939 5.14109,-15.80217 2.18356,-20.92743 -2.88468,-4.99905 -9.20006,-6.15059 -12.56478,-1.21542 z"
         id="path875"
         inkscape:connector-curvature="0"
         sodipodi:nodetypes="sssss" />
      <path
         id="path879"
         style="fill:#ffffff;fill-opacity:1;stroke:none;stroke-width:6.00008011;stroke-linecap:round;stroke-linejoin:round"
         d="m 158.07776,227.73464 a 4.3745499,8.2441006 18.554526 0 1 -6.7705,6.42357 4.3745499,8.2441006 18.554526 0 1 -1.52383,-9.2076 4.3745499,8.2441006 18.554526 0 1 6.77049,-6.42358 4.3745499,8.2441006 18.554526 0 1 1.52384,9.20761"
         inkscape:connector-curvature="0" />
    </g>
    <g
       inkscape:groupmode="layer"
       id="layer8"
       inkscape:label="eye f"
       style="display:inline;opacity:1">
      <path
         sodipodi:nodetypes="csc"
         inkscape:connector-curvature="0"
         id="path855"
         d="m 213.69382,245.64552 c -0.63391,17.31778 17.17126,34.96738 36.6429,33.92941 29.91931,-1.5949 44.05896,-25.94723 49.9374,-53.52178 0,0 -16.61819,-5.39243 -40.73662,-5.74957 -24.11844,-0.35714 -37.53271,12.26588 -45.84368,25.34194 z"
         style="fill:#ffffff;fill-opacity:1;stroke:none;stroke-width:6.00008011;stroke-linecap:round;stroke-linejoin:round" />
      <path
         style="fill:#f01d0a;fill-opacity:1;stroke:none;stroke-width:6.00008011;stroke-linecap:round;stroke-linejoin:round"
         d="m 240.33428,222.99978 c -3.95033,7.28966 -2.94003,18.58474 -0.0747,24.78266 5.22935,11.31134 24.14556,11.09368 31.18448,1.39135 4.52734,-6.24042 6.88658,-22.24345 2.88897,-27.84193 -3.9976,-5.59849 -28.17233,-5.04878 -33.99878,1.66792 z"
         id="path853"
         inkscape:connector-curvature="0"
         sodipodi:nodetypes="cssccc" />
      <path
         style="fill:#000000;fill-opacity:1;stroke:none;stroke-width:6.00008011;stroke-linecap:round;stroke-linejoin:round"
         d="m 248.87014,226.03981 c -4.05636,7.04492 -3.73403,17.2683 1.0026,20.57704 4.73663,3.30874 9.57245,2.93989 12.91961,-0.0336 4.24063,-3.76741 5.80389,-16.84431 2.53295,-21.55631 -3.27094,-4.712 -13.51896,-3.27702 -16.45516,1.013 z"
         id="path851"
         inkscape:connector-curvature="0"
         sodipodi:nodetypes="cssccc" />
      <path
         id="path857"
         style="fill:#ffffff;fill-opacity:1;stroke:none;stroke-width:6.00008011;stroke-linecap:round;stroke-linejoin:round"
         d="m 250.35462,233.0824 a 4.6251221,6.4468465 12.243629 0 1 -5.8871,5.31936 4.6251221,6.4468465 12.243629 0 1 -3.15274,-7.28104 4.6251221,6.4468465 12.243629 0 1 5.8871,-5.31937 4.6251221,6.4468465 12.243629 0 1 3.15274,7.28105"
         inkscape:connector-curvature="0" />
      <path
         style="fill:#1d2848;fill-opacity:1;stroke:none;stroke-width:6.00008011;stroke-linecap:round;stroke-linejoin:round"
         d="m 203.70816,244.70604 c 1.59084,3.79324 5.27461,7.76957 13.0087,6.33762 7.13041,-17.36579 21.38498,-29.35531 48.10883,-28.87055 28.75804,0.52165 34.59413,6.07593 40.54683,8.0229 3.01423,-1.43525 4.76065,-2.753 6.91976,-4.23381 -9.70166,-6.68399 -27.81868,-13.20676 -51.83062,-12.30754 -22.63757,0.84775 -43.41044,11.43658 -48.98551,29.41842 -1.3062,1.06447 -5.6063,2.52648 -7.76799,1.63297 z"
         id="path843"
         inkscape:connector-curvature="0"
         sodipodi:nodetypes="ccsccsccc" />
      <path
         style="fill:none;fill-opacity:1;stroke:#1d2848;stroke-width:6.00008011;stroke-linecap:round;stroke-linejoin:round"
         d="m 213.69382,245.64552 c -0.63391,17.31778 17.17126,34.96738 36.6429,33.92941 29.91931,-1.5949 44.05896,-25.94723 49.9374,-53.52178"
         id="path849"
         inkscape:connector-curvature="0"
         sodipodi:nodetypes="csc" />
    </g>
    <g
       inkscape:groupmode="layer"
       id="layer20"
       inkscape:label="snout b">
      <path
         style="display:inline;opacity:1;fill:#3250b0;stroke:none;stroke-width:6.00008011;stroke-linecap:round;stroke-linejoin:round"
         d="m 226.44608,304.34936 c -15.58348,-13.91927 -62.32615,-17.95204 -97.98859,-4.10724 -27.54783,10.69457 -47.565951,38.60917 -44.343161,68.95466 42.957081,16.2117 100.786921,-22.73199 142.331751,-64.84742 z"
         id="path921"
         inkscape:connector-curvature="0"
         sodipodi:nodetypes="cscc" />
      <path
         sodipodi:nodetypes="sssssssss"
         inkscape:connector-curvature="0"
         id="path917"
         d="m 199.20656,296.53333 c 8.12966,1.48739 13.06989,2.11857 19.09121,4.12917 4.98906,1.6659 6.05488,0.56534 1.33934,-2.66173 -5.00932,-3.4281 -11.62644,-6.06455 -19.36893,-7.37286 -21.30329,-3.82971 -49.48963,-2.26941 -72.89641,6.81753 -28.695562,11.14014 -49.616742,40.27974 -46.240704,72.06818 0.40506,3.81401 6.475741,4.16106 5.966526,-0.63366 -3.06955,-28.90256 16.045508,-55.59215 42.445618,-65.84115 22.43531,-8.70979 49.25678,-10.23904 69.66335,-6.50548 z"
         style="display:inline;opacity:1;fill:#1d2848;fill-rule:nonzero;stroke:none;stroke-width:1.58749998;stroke-linecap:round;stroke-linejoin:round" />
    </g>
    <g
       inkscape:groupmode="layer"
       id="layer3"
       inkscape:label="snout"
       style="display:inline;opacity:1">
      <path
         sodipodi:nodetypes="csssscccc"
         inkscape:connector-curvature="0"
         id="path837"
         d="m 84.114329,369.19678 c 2.009655,18.92272 15.806283,30.20393 23.772881,29.7023 16.97557,-1.0689 21.95454,-13.25623 43.90947,-15.22475 23.33358,-2.09211 83.73008,16.73488 99.6683,-3.08186 7.63675,-9.49514 2.43309,-18.16332 18.4077,-33.94663 16.38667,-16.19043 37.70474,-27.30673 50.70201,-27.47701 l -140.58868,7.96037 -39.82989,15.78165 z"
         style="fill:#3250b0;stroke:none;stroke-width:6.00008011;stroke-linecap:round;stroke-linejoin:round" />
      <path
         style="fill:#1d2848;stroke:none;stroke-width:6.38128996;stroke-linecap:round;stroke-linejoin:round"
         d="m 175.52217,336.25523 c 3.22263,-6.21142 19.01269,-14.41883 32.03856,-12.89464 2.90818,0.34032 3.89988,2.7818 0.37854,4.38766 -3.52135,1.60586 -7.8622,7.31389 -13.17341,9.81043 -5.94092,2.79254 -10.9516,3.4877 -14.49431,3.7308 -3.54272,0.2431 -5.5203,-3.54831 -4.74937,-5.03425 z"
         id="path831"
         inkscape:connector-curvature="0"
         sodipodi:nodetypes="ssssss" />
      <path
         style="fill:#1d2848;fill-rule:nonzero;stroke:none;stroke-width:1.58749998;stroke-linecap:round;stroke-linejoin:round"
         d="m 81.131066,369.51362 c 2.109606,19.86384 16.798672,33.01844 26.944664,32.37957 18.01858,-1.13459 22.82653,-13.33333 43.98886,-15.23079 22.38923,-2.00745 84.46543,17.28624 101.73814,-4.18974 8.36872,-10.40522 2.67064,-18.3706 18.17848,-33.69272 10.53655,-10.41037 30.43696,-20.5774 46.66191,-26.41706 4.88187,-1.71366 9.36342,-4.06549 12.87683,-5.52567 3.4928,-1.45162 6.09114,-2.16819 6.09114,-2.16819 0,0 -2.57952,-0.79608 -6.66809,-0.76742 -4.32049,0.0302 -9.25775,0.94388 -14.33181,2.81573 -16.53983,5.95299 -37.66175,16.74308 -48.84704,27.79443 -16.44138,16.24448 -11.73215,25.61547 -18.63692,34.20052 -14.58391,18.13283 -73.30651,-0.2041 -97.59846,1.974 -22.74753,2.03957 -27.89753,14.21549 -43.83009,15.2187 -5.78719,0.36435 -18.691387,-9.04344 -20.601088,-27.02502 -0.87531,-8.24185 -6.723851,-6.49724 -5.966526,0.63366 z"
         id="path835"
         inkscape:connector-curvature="0"
         sodipodi:nodetypes="scssscscccscccss" />
      <path
         sodipodi:nodetypes="ssssss"
         inkscape:connector-curvature="0"
         id="path841"
         d="m 133.07186,339.57543 c -2.54494,-5.69205 -16.16544,-13.81037 -27.83111,-13.12912 -2.60449,0.15213 -3.61306,2.2725 -0.56393,3.88329 3.04914,1.6108 6.61481,6.91298 11.20993,9.40874 5.13995,2.79166 9.56103,3.66948 12.69974,4.06918 3.13873,0.3997 5.09416,-2.87041 4.48534,-4.2321 z"
         style="fill:#1d2848;stroke:none;stroke-width:5.68585014;stroke-linecap:round;stroke-linejoin:round" />
    </g>
  </g>
  <g
     inkscape:groupmode="layer"
     id="layer14"
     inkscape:label="derpeyes"
     style="display:none"
     sodipodi:insensitive="true">
    <path
       id="path954"
       style="display:inline;fill:#ffffff;stroke:none;stroke-width:6;stroke-linecap:round;stroke-linejoin:round;stroke-miterlimit:8"
       inkscape:transform-center-x="-26.269443"
       inkscape:transform-center-y="-44.214344"
       d="m 293.38402,266.5036 a 38.822445,51.162842 29.746959 0 1 -59.09211,25.15831 38.822445,51.162842 29.746959 0 1 -8.32113,-63.68341 38.822445,51.162842 29.746959 0 1 59.0921,-25.15832 38.822445,51.162842 29.746959 0 1 8.32114,63.68342"
       inkscape:connector-curvature="0" />
    <path
       id="path952"
       clip-path="none"
       style="display:inline;fill:#f01d0a;stroke:none;stroke-width:6;stroke-linecap:round;stroke-linejoin:round;stroke-miterlimit:8"
       d="m 248.30273,217.0918 a 29.54402,37.818611 25.909722 0 0 -20.48632,7.84765 38.822445,51.162842 29.746959 0 0 -1.84571,3.03907 38.822445,51.162842 29.746959 0 0 4.77149,61.29687 29.54402,37.818611 25.909722 0 0 37.97656,-22.89062 29.54402,37.818611 25.909722 0 0 -10.04883,-46.92579 29.54402,37.818611 25.909722 0 0 -10.36719,-2.36718 z"
       inkscape:connector-curvature="0" />
    <ellipse
       transform="rotate(23.348866)"
       ry="31.265242"
       rx="18.753099"
       cy="137.75052"
       cx="322.08023"
       id="path950"
       style="display:inline;fill:#000000;stroke:none;stroke-width:6;stroke-linecap:round;stroke-linejoin:round;stroke-miterlimit:8" />
    <ellipse
       transform="rotate(-32.759927)"
       ry="10.561875"
       rx="16.184883"
       cy="328.31876"
       cx="73.374001"
       id="path948"
       style="display:inline;fill:#ffffff;stroke:none;stroke-width:6;stroke-linecap:round;stroke-linejoin:round;stroke-miterlimit:8" />
    <path
       id="path954-7"
       style="display:inline;fill:#ffffff;stroke:none;stroke-width:5.1022501;stroke-linecap:round;stroke-linejoin:round;stroke-miterlimit:8"
       inkscape:transform-center-x="-17.042744"
       inkscape:transform-center-y="-40.276958"
       d="m 186.73704,249.73644 a 33.013603,45.820484 21.965888 0 1 -47.75639,30.14534 33.013603,45.820484 21.965888 0 1 -13.47769,-54.84311 33.013603,45.820484 21.965888 0 1 47.75641,-30.14535 33.013603,45.820484 21.965888 0 1 13.47767,54.84312"
       inkscape:connector-curvature="0" />
    <path
       id="path952-5"
       clip-path="none"
       style="display:inline;fill:#f01d0a;stroke:none;stroke-width:5.10224009;stroke-linecap:round;stroke-linejoin:round;stroke-miterlimit:8"
       d="m 170.55664,210.70703 a 25.123473,32.159971 18.128651 0 0 -27.51562,23.72852 25.123473,32.159971 18.128651 0 0 13.87109,38.38086 25.123473,32.159971 18.128651 0 0 13.78516,-0.36133 33.013603,45.820484 21.965888 0 0 16.03906,-22.71875 33.013603,45.820484 21.965888 0 0 4.4707,-22.60156 25.123473,32.159971 18.128651 0 0 -14.2832,-15.44532 25.123473,32.159971 18.128651 0 0 -6.36719,-0.98242 z"
       inkscape:connector-curvature="0" />
    <ellipse
       transform="rotate(15.567795)"
       ry="26.587154"
       rx="15.947151"
       cy="189.18279"
       cx="226.81554"
       id="path950-3"
       style="display:inline;fill:#000000;stroke:none;stroke-width:5.1022501;stroke-linecap:round;stroke-linejoin:round;stroke-miterlimit:8" />
    <ellipse
       transform="rotate(-42.879497)"
       ry="9.1447601"
       rx="14.013314"
       cy="275.87143"
       cx="-36.11565"
       id="path948-6"
       style="display:inline;fill:#ffffff;stroke:none;stroke-width:5.19496012;stroke-linecap:round;stroke-linejoin:round;stroke-miterlimit:8" />
  </g>
  <g
     inkscape:groupmode="layer"
     id="layer15"
     inkscape:label="dealeyes"
     style="display:none;opacity:1"
     sodipodi:insensitive="true">
    <ellipse
       style="fill:#ffffff;stroke-width:3"
       id="path951"
       cx="270.96771"
       cy="251.96104"
       rx="44.549335"
       ry="42.45956" />
    <ellipse
       style="fill:#f01d0a;stroke-width:3"
       id="path955"
       cx="266.992"
       cy="256.67703"
       rx="23.039942"
       ry="27.772797" />
    <ellipse
       style="fill:#000000;stroke-width:3"
       id="path957"
       cx="267.75934"
       cy="258.32709"
       rx="8.2290649"
       ry="21.142397" />
    <ellipse
       style="fill:#ffffff;stroke-width:3"
       id="path959"
       cx="305.88904"
       cy="190.8374"
       rx="5.2087183"
       ry="8.2939911"
       transform="rotate(11.819553)" />
    <path
       style="fill:#3250b0;stroke-width:3"
       d="m 220.31874,248.29513 c 25.09275,3.64552 64.56921,-10.42437 97.91417,-8.88942 l -3.73677,-31.20496 -82.8046,-1.67837 z"
       id="path953"
       inkscape:connector-curvature="0"
       sodipodi:nodetypes="ccccc" />
    <path
       style="fill:#3250b0;stroke-width:3"
       d="m 225.05046,286.06939 c 30.16163,-4.18629 60.95428,-5.93286 91.43142,-8.89929 l 1.90901,18.0442 -84.44839,8.00577 z"
       id="path981"
       inkscape:connector-curvature="0"
       sodipodi:nodetypes="ccccc" />
    <ellipse
       ry="36.912376"
       rx="27.359495"
       cy="251.38013"
       cx="156.00192"
       id="path951-3"
       style="display:inline;fill:#ffffff;stroke-width:2.19205999" />
    <ellipse
       ry="24.144384"
       rx="14.149731"
       cy="255.32916"
       cx="161.53758"
       id="path955-6"
       style="display:inline;fill:#f01d0a;stroke-width:2.19205999" />
    <ellipse
       ry="18.380222"
       rx="5.0537915"
       cy="256.76358"
       cx="162.00882"
       id="path957-7"
       style="display:inline;fill:#000000;stroke-width:2.19205999" />
    <path
       id="path959-5"
       style="display:inline;fill:#ffffff;stroke-width:2.19207001"
       d="m 160.56751,249.97067 a 3.2246342,7.152821 6.3187491 0 1 -4.17438,6.13002 3.2246342,7.152821 6.3187491 0 1 -2.08773,-7.98505 3.2246342,7.152821 6.3187491 0 1 4.1744,-6.13002 3.2246342,7.152821 6.3187491 0 1 2.08771,7.98505"
       inkscape:connector-curvature="0" />
    <path
       sodipodi:nodetypes="csccc"
       inkscape:connector-curvature="0"
       id="path953-3"
       d="m 185.12635,248.19313 c -14.39184,2.95978 -36.48808,-7.51273 -56.02641,-7.82321 -1.38287,-0.022 4.79201,-27.03299 4.79201,-27.03299 l 44.24991,-1.45909 z"
       style="display:inline;fill:#3250b0;stroke-width:2.19205999" />
    <path
       sodipodi:nodetypes="ccccc"
       inkscape:connector-curvature="0"
       id="path981-5"
       d="m 182.22041,281.03233 c -18.52344,-3.63937 -35.23959,-4.49261 -53.95681,-7.07148 l -1.17239,15.6868 c 16.30971,-0.65721 32.65487,-0.30592 48.88446,-3.24314 z"
       style="display:inline;fill:#3250b0;stroke-width:2.19205999" />
  </g>
  <g
     inkscape:groupmode="layer"
     id="layer16"
     inkscape:label="mask"
     sodipodi:insensitive="true"
     style="display:none">
    <path
       style="display:inline;opacity:1;fill:#ffffff;fill-opacity:1;stroke:#bcdeea;stroke-width:5;stroke-linecap:round;stroke-linejoin:round;stroke-miterlimit:4;stroke-dasharray:none"
       d="m 248.63706,315.92858 c 14.48823,-4.95148 45.30247,-19.80811 76.93474,-41.47229 22.48143,-15.39698 45.28768,-34.93951 63.33693,-53.63276 1.45395,2.89521 3.40029,6.11431 4.48441,10.28753 -19.51336,19.38163 -40.44103,37.60336 -61.5926,53.00687 -28.88635,21.03631 -59.81665,38.4248 -88.08175,46.30036"
       id="path2316"
       inkscape:connector-curvature="0"
       sodipodi:nodetypes="csccsc" />
    <path
       style="display:inline;opacity:1;fill:#ffffff;fill-opacity:1;stroke:#bcdeea;stroke-width:5;stroke-linecap:round;stroke-linejoin:round;stroke-miterlimit:4;stroke-dasharray:none"
       d="m 96.428571,317.71429 c -40.714286,73.92857 17.857139,92.5 41.071429,101.07142 18.97184,1.98543 50.4907,3.49174 75.70826,2.6718 15.60817,-0.50749 34.90403,-5.64458 39.00023,-6.60036 -17.85715,-13.92857 -19.64286,-66.07143 -3.57143,-98.92857 -4.81259,1.70446 -22.34264,8.07992 -38.21753,9.35076 -40.67286,3.25599 -102.94509,3.48081 -113.990959,-7.56505 z"
       id="path2314"
       inkscape:connector-curvature="0"
       sodipodi:nodetypes="ccsccsc" />
  </g>
  <g
     inkscape:groupmode="layer"
     id="layer12"
     inkscape:label="glaxes"
     style="display:none;opacity:1">
    <path
       inkscape:connector-curvature="0"
       id="path1813"
       d="m 322.52778,243.99754 -2.07112,19.31254 -22.29112,20.18305 -40.41772,1.42989 -31.32514,-31.55491 -36.76063,0.99127 -17.67578,18.32561 -40.28266,1.30672 -0.43943,-30.64826 z"
       style="display:inline;opacity:1;fill:#ffffff;stroke:none;stroke-width:12.64280033;stroke-miterlimit:8" />
    <rect
       style="display:inline;opacity:1;fill:#000000;stroke-width:4.16337013"
       id="rect1794"
       height="10.408423"
       width="20.816847"
       y="248.54344"
       x="399.22824" />
    <path
       style="display:inline;opacity:1;fill:#000000;stroke-width:4.16337013"
       id="path1796"
       d="m 399.22832,238.135 v 10.40843 h -62.45054 v 10.40842 h -10.40843 v 10.40842 h -10.40842 v 10.40843 h -10.40842 v 10.40842 H 232.69354 V 279.7687 H 222.28512 V 269.36027 H 211.8767 v -10.40842 h -20.81685 v 10.40842 H 180.65143 V 279.7687 H 107.79246 V 269.36027 H 97.384029 V 258.95185 H 86.975599 V 238.135 Z m -135.30951,41.6337 h 10.40843 v -10.40843 h 10.40842 v 10.40843 h 10.40842 v -10.40843 h 10.40843 v -10.40842 h 10.40842 v -10.40842 h -10.40842 v 10.40842 h -10.40843 v -10.40842 h -10.40842 v 10.40842 h -10.40842 v 10.40842 H 263.91881 Z M 139.01773,269.36027 h 10.40843 v -10.40842 h 10.40842 v 10.40842 H 170.243 v -10.40842 h 10.40843 V 248.54343 H 170.243 v 10.40842 h -10.40842 v -10.40842 h -10.40842 v 10.40842 h -10.40843 z"
       inkscape:connector-curvature="0" />
    <rect
       style="display:inline;opacity:1;fill:#000000;stroke-width:4.16337013"
       id="rect1798"
       height="10.408423"
       width="10.408423"
       y="258.95184"
       x="-295.14404"
       transform="scale(-1,1)" />
  </g>
  <g
     inkscape:groupmode="layer"
     id="layer17"
     inkscape:label="roll"
     style="display:none;opacity:1">
    <path
       inkscape:connector-curvature="0"
       id="path2337-3"
       d="M 314.09278,122.66118 C 341.84716,92.839747 399.55736,16.795055 421.0527,33.588512 c 22.19185,17.337619 40.79827,38.356517 35.35074,49.56346 -10.72409,22.062158 -47.39558,75.828958 -86.58507,92.532908"
       style="fill:#ffffff;fill-opacity:1;stroke:#bcdeea;stroke-width:5;stroke-linecap:round;stroke-linejoin:round;stroke-miterlimit:4;stroke-dasharray:none"
       sodipodi:nodetypes="cssc" />
    <path
       style="fill:#ffffff;fill-opacity:1;stroke:#bcdeea;stroke-width:5;stroke-linecap:round;stroke-linejoin:round;stroke-miterlimit:4;stroke-dasharray:none"
       d="m 417.43252,77.553498 c -2.85993,14.506849 -18.5513,23.630582 -35.04766,20.378459 -16.49637,-3.25215 -27.55088,-17.648664 -24.69096,-32.155517 2.85993,-14.506851 18.5513,-23.630592 35.04767,-20.378445 16.49635,3.252146 27.55087,17.648655 24.69095,32.155503 z"
       id="ellipse2327-6"
       inkscape:connector-curvature="0"
       sodipodi:nodetypes="sssss" />
    <path
       style="fill:#ffffff;fill-opacity:1;stroke:#bcdeea;stroke-width:5;stroke-linecap:round;stroke-linejoin:round;stroke-miterlimit:4;stroke-dasharray:none"
       d="m 405.88671,131.26033 c -6.79845,34.48486 -42.28121,56.53167 -79.25295,49.24295 -36.97175,-7.28873 -61.43204,-41.1529 -54.63358,-75.63776 6.79845,-34.484853 42.28121,-56.531668 79.25295,-49.242941 36.97174,7.288724 61.43203,41.152904 54.63358,75.637751 z"
       id="path2329-5"
       inkscape:connector-curvature="0"
       sodipodi:nodetypes="sssss" />
    <path
       style="fill:#b28642;fill-opacity:1;stroke:#826537;stroke-width:5;stroke-linecap:round;stroke-linejoin:round;stroke-miterlimit:4;stroke-dasharray:none;stroke-opacity:1"
       d="m 364.24667,126.23824 c -2.9108,14.76494 -18.88133,24.051 -35.67117,20.741 -16.78984,-3.31 -28.04102,-17.96264 -25.13021,-32.72757 2.91081,-14.764933 18.88133,-24.050999 35.67117,-20.740993 16.78984,3.309998 28.04102,17.962623 25.13021,32.727563 z"
       id="path2325-3"
       inkscape:connector-curvature="0"
       sodipodi:nodetypes="sssss" />
    <path
       sodipodi:nodetypes="ccc"
       inkscape:connector-curvature="0"
       id="path2445"
       d="M 270.26809,162.27679 C 294.86953,124.31611 377.76647,44.333694 434.1178,28.71452 400.13126,64.383688 343.58515,145.88961 331.21799,174.60299"
       style="display:inline;opacity:1;fill:#3a3c3f;fill-opacity:1;stroke:#292929;stroke-width:6.00008011;stroke-linecap:round;stroke-linejoin:round" />
    <path
       sodipodi:nodetypes="cccc"
       inkscape:connector-curvature="0"
       id="path2447"
       d="m 256.15745,180.01405 c 3.34461,-5.62092 24.68157,-34.33615 24.68157,-34.33615 21.02372,-2.95678 45.98829,10.9467 55.64161,20.04734 -3.60243,7.09862 -12.35921,28.14943 -12.35921,28.14943"
       style="display:inline;opacity:1;fill:#3250b0;fill-opacity:1;stroke:none;stroke-width:6.00008011;stroke-linecap:round;stroke-linejoin:round" />
    <path
       id="path2449"
       style="display:inline;opacity:1;fill:#1d2848;fill-opacity:1;fill-rule:nonzero;stroke:none;stroke-width:1.58749998;stroke-linecap:round;stroke-linejoin:round"
       d="m 286.74872,142.27026 c -2.12879,0.005 -4.24404,0.1444 -6.32812,0.4375 a 3.0000409,3.0000409 0 0 0 -1.99024,1.18165 c -18.69992,25.16631 -10.71864,14.47818 -16.88086,23.05273 -4.09795,5.68644 -5.39258,13.07227 -5.39258,13.07227 0,0 6.30907,-4.05005 10.26563,-9.57032 5.93532,-8.25883 -0.59744,0.47547 16.05273,-21.93554 18.50054,-1.97424 40.45174,9.60659 50.32227,17.96289 -2.15783,4.5215 -5.21332,11.53569 -7.65234,17.25586 l -0.004,0.01 c -1.85674,4.40165 -1.05384,9.91756 -1.02148,10.13281 0.002,0.005 0.002,0.004 0.002,0.004 0,0 -9.5e-4,0.001 0.004,0 0.17695,-0.12756 4.689,-3.40967 6.54296,-7.80469 2.8183,-6.60948 6.49738,-15.06707 8.48633,-18.98633 a 3.0000409,3.0000409 0 0 0 -0.61719,-3.54101 c -9.27084,-8.74007 -31.21075,-21.3169 -51.78906,-21.27149 z"
       inkscape:connector-curvature="0" />
    <path
       style="fill:#ffffff;fill-opacity:1;stroke:none;stroke-width:5;stroke-linecap:round;stroke-linejoin:round;stroke-miterlimit:4;stroke-dasharray:none"
       d="m 396.9261,152.94878 c 4.29277,-6.42759 7.39128,-13.7261 8.96083,-21.6876 6.79845,-34.484844 -17.66303,-68.349944 -54.63477,-75.638668 -4.62147,-0.911091 -9.21841,-1.363267 -13.74023,-1.390625 -31.65275,-0.191507 -59.56308,20.458566 -65.51172,50.632813 l 31.44514,9.38663 c 2.54696,-12.91932 15.09188,-21.643578 29.43642,-21.405408 2.04921,0.03402 4.13523,0.250198 6.23397,0.66395 16.78983,3.309998 28.04148,17.963388 25.13068,32.728328 -0.61519,3.12051 -1.81369,5.99632 -3.47994,8.56023 z"
       id="path2463"
       inkscape:connector-curvature="0"
       sodipodi:nodetypes="csssccssscc" />
    <path
       style="fill:none;fill-opacity:1;stroke:#826537;stroke-width:5;stroke-linecap:round;stroke-linejoin:round;stroke-miterlimit:4;stroke-dasharray:none;stroke-opacity:1"
       d="m 303.44535,114.25133 c 2.54696,-12.91932 15.09188,-21.643578 29.43642,-21.405408 2.04921,0.03402 4.13523,0.250198 6.23397,0.66395 16.78983,3.309998 28.04148,17.963388 25.13068,32.728328 -0.61519,3.12051 -1.81369,5.99632 -3.47994,8.56023"
       id="path2472"
       inkscape:connector-curvature="0"
       sodipodi:nodetypes="csscc" />
    <path
       id="path2335-7"
       style="fill:#ffffff;fill-opacity:1;stroke:#bcdeea;stroke-width:5;stroke-linecap:round;stroke-linejoin:round;stroke-miterlimit:4;stroke-dasharray:none"
       d="m 395.55537,84.046866 c 25.65869,36.586334 21.49246,110.350254 -8.63522,171.448614 20.14981,-17.19744 60.87974,-64.86208 77.1432,-75.76907 C 474.69134,145.87406 476.42448,71.507594 455.52911,40.980717 439.27219,17.230338 399.22679,-2.6416337 365.07609,5.8317942 345.5202,10.661532 309.03096,52.920419 281.27659,82.741855"
       inkscape:connector-curvature="0"
       sodipodi:nodetypes="cccscc" />
    <path
       style="fill:none;fill-opacity:1;stroke:#bcdeea;stroke-width:5;stroke-linecap:round;stroke-linejoin:round;stroke-miterlimit:4;stroke-dasharray:none"
       d="m 396.9261,152.94878 c 4.29277,-6.42759 7.39128,-13.7261 8.96083,-21.6876 6.79845,-34.484844 -17.66303,-68.349944 -54.63477,-75.638668 -4.62147,-0.911091 -9.21841,-1.363267 -13.74023,-1.390625 -31.65275,-0.191507 -59.56308,20.458566 -65.51172,50.632813"
       id="path2468"
       inkscape:connector-curvature="0"
       sodipodi:nodetypes="csssc" />
  </g>
  <g
     inkscape:groupmode="layer"
     id="layer19"
     inkscape:label="roll 1"
     style="display:none">
    <path
       inkscape:connector-curvature="0"
       id="path2337-3-5"
       d="m 761.94599,178.58965 c 27.75438,-29.82144 84.71307,-101.732842 106.20841,-84.939385 22.19185,17.337615 40.79827,38.356515 35.35074,49.563465 -10.72409,22.06216 -49.6501,72.07142 -88.83959,88.77537"
       style="display:inline;opacity:1;fill:#ffffff;fill-opacity:1;stroke:#bcdeea;stroke-width:5;stroke-linecap:round;stroke-linejoin:round;stroke-miterlimit:4;stroke-dasharray:none"
       sodipodi:nodetypes="cssc" />
    <path
       style="display:inline;opacity:1;fill:#ffffff;fill-opacity:1;stroke:#bcdeea;stroke-width:5;stroke-linecap:round;stroke-linejoin:round;stroke-miterlimit:4;stroke-dasharray:none"
       d="m 865.28573,133.48196 c -2.85993,14.50685 -18.5513,23.63059 -35.04766,20.37846 -16.49637,-3.25215 -27.55088,-17.64866 -24.69096,-32.15552 2.85993,-14.50685 18.5513,-23.63059 35.04767,-20.37844 16.49635,3.25214 27.55087,17.64865 24.69095,32.1555 z"
       id="ellipse2327-6-6"
       inkscape:connector-curvature="0"
       sodipodi:nodetypes="sssss" />
    <path
       id="path2335-7-2"
       style="display:inline;opacity:1;fill:#ffffff;fill-opacity:1;stroke:#bcdeea;stroke-width:5;stroke-linecap:round;stroke-linejoin:round;stroke-miterlimit:4;stroke-dasharray:none"
       d="m 840.40255,140.35108 c 25.65869,36.58634 21.49246,110.35026 -8.63522,171.44862 20.14981,-17.19744 63.13426,-61.10454 79.39772,-72.01153 10.62799,-33.85235 12.36113,-108.21882 -8.53424,-138.7457 C 886.37389,77.292091 846.32849,57.420119 812.17779,65.893547 792.6219,70.723285 753.87814,109.22464 726.12377,139.04607"
       inkscape:connector-curvature="0"
       sodipodi:nodetypes="cccscc" />
    <path
       style="display:inline;opacity:1;fill:#ffffff;fill-opacity:1;stroke:#bcdeea;stroke-width:5;stroke-linecap:round;stroke-linejoin:round;stroke-miterlimit:4;stroke-dasharray:none"
       d="m 850.73389,187.56455 c -6.79845,34.48486 -42.28121,56.53167 -79.25295,49.24295 -36.97175,-7.28873 -61.43204,-41.1529 -54.63358,-75.63776 6.79845,-34.48486 42.28121,-56.53167 79.25295,-49.24294 36.97174,7.28872 61.43203,41.1529 54.63358,75.63775 z"
       id="path2329-5-9"
       inkscape:connector-curvature="0"
       sodipodi:nodetypes="sssss" />
    <path
       style="display:inline;opacity:1;fill:#b28642;fill-opacity:1;stroke:#826537;stroke-width:5;stroke-linecap:round;stroke-linejoin:round;stroke-miterlimit:4;stroke-dasharray:none;stroke-opacity:1"
       d="m 811.03709,181.58302 c -2.85992,14.50685 -18.55129,23.6306 -35.04765,20.37845 -16.49636,-3.25214 -27.55087,-17.64865 -24.69094,-32.1555 2.85993,-14.50685 18.55129,-23.6306 35.04765,-20.37845 16.49636,3.25214 27.55087,17.64865 24.69094,32.1555 z"
       id="path2325-3-1"
       inkscape:connector-curvature="0"
       sodipodi:nodetypes="sssss" />
  </g>
  <g
     inkscape:groupmode="layer"
     id="layer5"
     inkscape:label="markers"
     style="display:none;opacity:1"
     sodipodi:insensitive="true">
    <circle
       style="fill:#fffa48;stroke:none;stroke-width:2.25"
       id="marker_center"
       cx="212.8992"
       cy="245.87688"
       r="7.2568336" />
    <circle
       r="5.9717622"
       cy="376.8313"
       cx="334.75049"
       id="marker_neckc"
       style="fill:#f01d0a;stroke:none;stroke-width:2.25" />
    <circle
       r="8.4012709"
       cy="350.1987"
       cx="210.18294"
       id="marker_muzzle"
       style="fill:#f01d0a;stroke:none;stroke-width:2.25" />
    <circle
       cy="245.99783"
       cx="243.6461"
       id="marker_rot"
       style="fill:#fffa48;stroke:none;stroke-width:2.25"
       r="7.2568336" />
  </g>
</svg>
