<?xml version="1.0" encoding="UTF-8" standalone="no"?>
<svg
   xmlns:dc="http://purl.org/dc/elements/1.1/"
   xmlns:cc="http://creativecommons.org/ns#"
   xmlns:rdf="http://www.w3.org/1999/02/22-rdf-syntax-ns#"
   xmlns:svg="http://www.w3.org/2000/svg"
   xmlns="http://www.w3.org/2000/svg"
   xmlns:sodipodi="http://sodipodi.sourceforge.net/DTD/sodipodi-0.dtd"
   xmlns:inkscape="http://www.inkscape.org/namespaces/inkscape"
   inkscape:export-ydpi="26.427679"
   inkscape:export-xdpi="26.427679"
   inkscape:export-filename="zareph-knot.png"
   sodipodi:docname="zareph-knot.svg"
   inkscape:version="1.0alpha2 (1:0.92.0+devel+201906271916+a9c687c)"
   id="svg4575"
   version="1.1"
   viewBox="0 0 512.00001 512"
   height="512"
   width="512">
  <defs
     id="defs4569" />
  <sodipodi:namedview
     fit-margin-bottom="0"
     fit-margin-right="0"
     fit-margin-left="0"
     fit-margin-top="0"
     inkscape:guide-bbox="true"
     showguides="true"
     inkscape:object-paths="true"
     inkscape:snap-smooth-nodes="true"
     inkscape:snap-global="false"
     borderlayer="true"
     inkscape:document-rotation="0"
     inkscape:window-maximized="1"
     inkscape:window-y="0"
     inkscape:window-x="30"
     inkscape:window-height="1411"
     inkscape:window-width="2408"
     inkscape:pagecheckerboard="true"
     units="px"
     showgrid="false"
     inkscape:current-layer="layer3"
     inkscape:document-units="px"
     inkscape:cy="222.40189"
     inkscape:cx="311.19375"
     inkscape:zoom="2.7338462"
     inkscape:pageshadow="2"
     inkscape:pageopacity="0.0"
     borderopacity="1.0"
     bordercolor="#666666"
     pagecolor="#ffffff"
     id="base" />
  <metadata
     id="metadata4572">
    <rdf:RDF>
      <cc:Work
         rdf:about="">
        <dc:format>image/svg+xml</dc:format>
        <dc:type
           rdf:resource="http://purl.org/dc/dcmitype/StillImage" />
        <dc:title></dc:title>
      </cc:Work>
    </rdf:RDF>
  </metadata>
  <g
     transform="translate(1805.9056,-368.2493)"
     inkscape:label="knot"
     id="layer3"
     inkscape:groupmode="layer">
    <path
       style="display:inline;opacity:1;fill:#1e1e22;fill-opacity:1;fill-rule:nonzero;stroke:#0f0f10;stroke-width:0.427467;stroke-linecap:round;stroke-linejoin:round;stroke-opacity:1;stop-opacity:1"
       d="m -1577.8882,623.51526 c -5.7159,-17.34991 0.511,-40.9865 8.5733,-46.20275 9.4807,-6.13399 27.9681,2.03393 37.4584,15.48314 -1.5414,12.43532 -2.1667,30.46268 -7.6025,37.76788 -1.5264,2.05136 -7.3944,-0.96282 -9.2233,-0.45723 -1.5843,0.438 -2.8081,0.97294 -3.9438,0.91489 -6.7957,-0.34734 -25.2621,-7.50593 -25.2621,-7.50593 z"
       id="path4683"
       inkscape:connector-curvature="0"
       sodipodi:nodetypes="cscsscc" />
    <path
       sodipodi:nodetypes="csssssc"
       inkscape:connector-curvature="0"
       id="path4685"
       d="m -1549.1943,623.55263 c 1.1736,5.42773 -1.0627,15.55576 -4.1053,17.39978 -1.1813,0.71587 -6.1073,2.17197 -12.7794,0.6307 -14.4748,-3.34374 -24.7595,-6.63949 -33.6581,-9.64145 -6.2774,-2.1177 -15.3152,-5.19732 -18.5311,-8.77582 -3.2159,-3.5785 -3.0459,-17.78392 10.1736,-14.06887 8.8657,2.49151 19.1048,12.69643 29.0498,11.21888"
       style="display:inline;opacity:1;fill:#1e1e22;fill-opacity:1;fill-rule:nonzero;stroke:#0f0f10;stroke-width:1.61562;stroke-linecap:round;stroke-linejoin:round;stroke-opacity:1;stop-opacity:1" />
    <path
       sodipodi:nodetypes="csc"
       inkscape:connector-curvature="0"
       id="path4687"
       d="m -1531.8564,592.79565 c -9.4904,-13.4492 -27.9778,-21.61713 -37.4585,-15.48313 -8.0623,5.21624 -14.2892,28.85283 -8.5733,46.20274"
       style="display:inline;opacity:1;fill:#1e1e22;fill-opacity:1;fill-rule:nonzero;stroke:#0f0f10;stroke-width:1.61562;stroke-linecap:round;stroke-linejoin:round;stroke-opacity:1;stop-opacity:1" />
    <path
       sodipodi:nodetypes="cc"
       inkscape:connector-curvature="0"
       id="path4689"
       d="m -1540.843,630.64215 c -2.6465,0.44335 -5.6482,0.14284 -8.0709,-0.60278"
       style="display:inline;opacity:1;fill:#1e1e22;fill-opacity:1;stroke:#0f0f10;stroke-width:1.61562;stroke-linecap:round;stroke-linejoin:round;stroke-opacity:1;stop-opacity:1" />
    <path
       style="opacity:1;fill:#00a7fd;fill-opacity:1;stroke:#02095b;stroke-width:1.61562;stroke-linecap:round;stroke-linejoin:round;stroke-miterlimit:4;stroke-dasharray:none;stroke-dashoffset:0;stroke-opacity:1"
       d="m -1463.0685,625.86822 c -8.5908,-2.23795 -23.5886,-1.17026 -28.5726,-9.54564 3.9737,-0.20642 7.6383,-2.44479 11.26,-3.97891 -13.5693,-4.10976 -24.8245,-1.58883 -37.595,-13.69891 3.8751,1.47736 10.0539,0.67477 12.9161,-2.4768 -8.2472,-1.46451 -32.9411,-5.83469 -44.7456,-13.01287 0,0 -5.3127,18.90845 -4.5923,19.60497 0.7203,0.69653 82.6159,44.58248 82.6159,44.58248 l 8.7327,-20.91739 z"
       id="path997"
       inkscape:connector-curvature="0"
       sodipodi:nodetypes="cccccc" />
    <path
       sodipodi:nodetypes="ccsc"
       inkscape:connector-curvature="0"
       id="path5286"
       d="m -1517.2058,602.85353 c -21.1378,-13.15537 -43.3137,-25.72995 -64.1567,-34.52789 -14.3296,-6.04859 -29.138,-10.92312 -44.183,-10.77135 -6.8386,0.069 -13.7264,1.17655 -20.6403,3.68458"
       style="color:#000000;font-style:normal;font-variant:normal;font-weight:normal;font-stretch:normal;font-size:medium;line-height:normal;font-family:sans-serif;font-variant-ligatures:normal;font-variant-position:normal;font-variant-caps:normal;font-variant-numeric:normal;font-variant-alternates:normal;font-feature-settings:normal;text-indent:0;text-align:start;text-decoration:none;text-decoration-line:none;text-decoration-style:solid;text-decoration-color:#000000;letter-spacing:normal;word-spacing:normal;text-transform:none;writing-mode:lr-tb;direction:ltr;text-orientation:mixed;dominant-baseline:auto;baseline-shift:baseline;text-anchor:start;white-space:normal;shape-padding:0;clip-rule:nonzero;display:inline;overflow:visible;visibility:visible;opacity:1;isolation:auto;mix-blend-mode:normal;color-interpolation:sRGB;color-interpolation-filters:linearRGB;solid-color:#000000;solid-opacity:1;vector-effect:none;fill:none;fill-opacity:1;fill-rule:nonzero;stroke:#0f0f10;stroke-width:1.61562;stroke-linecap:round;stroke-linejoin:round;stroke-miterlimit:4;stroke-dasharray:none;stroke-dashoffset:0;stroke-opacity:1;color-rendering:auto;image-rendering:auto;shape-rendering:auto;text-rendering:auto;enable-background:accumulate" />
    <path
       style="opacity:1;fill:#00a7fd;fill-opacity:1;stroke:#02095b;stroke-width:1.61562;stroke-linecap:round;stroke-linejoin:round;stroke-miterlimit:4;stroke-dasharray:none;stroke-dashoffset:0;stroke-opacity:1"
       d="m -1431.6663,685.54915 c 5.7004,1.45969 8.3968,11.87198 12.2177,15.73865 8.8633,8.9695 23.7206,20.37758 37.1061,18.54603 -3.929,-3.93528 -8.976,-7.53925 -10.8695,-12.71874 4.78,4.92686 22.3929,7.78692 31.3422,5.75158 -8.075,-3.48331 -12.2357,-7.56116 -12.8267,-13.72861 2.6535,0.99268 5.0581,2.74935 7.8145,3.69199 11.6363,3.97943 28.5061,5.91945 39.579,-0.64184 -2.8603,-2.13103 -7.7117,-3.12467 -9.4919,-6.29216 6.9431,-1.24696 9.1687,-9.30655 11.4122,-13.01147 5.5003,-9.08308 15.4444,-12.62012 25.4771,-14.47303 -5.676,-4.05995 -17.8179,-2.54956 -23.9443,-0.45925 -0.01,-4.53644 5.7694,-8.2542 9.1566,-10.32997 -2.1647,-0.78604 -4.5442,-0.50757 -6.7489,0.0202 -4.0979,0.98098 -7.4642,3.94559 -11.0387,6.01381 -8.0705,4.66963 -18.1154,6.188 -27.3225,5.39 1.8619,-5.32444 9.8253,-6.11348 14.5329,-7.03007 -0.6685,-1.27574 -2.0564,-1.35778 -3.371,-1.47404 -13.7005,-1.21153 -30.7938,10.66366 -45.6302,3.57773 2.2672,0.43333 11.4328,-4.34893 12.8924,-6.0827 -18.7495,3.06292 -33.5835,-0.62528 -51.5187,-4.85362 4.1491,0.96383 13.7478,-1.4689 16.5085,-4.86742 -15.2751,-0.37169 -27.4292,-8.18136 -40.6519,-9.97385"
       id="path989"
       inkscape:connector-curvature="0"
       sodipodi:nodetypes="ccccccccccccccsccsccccc" />
    <path
       style="color:#000000;font-style:normal;font-variant:normal;font-weight:normal;font-stretch:normal;font-size:medium;line-height:normal;font-family:sans-serif;font-variant-ligatures:normal;font-variant-position:normal;font-variant-caps:normal;font-variant-numeric:normal;font-variant-alternates:normal;font-feature-settings:normal;text-indent:0;text-align:start;text-decoration:none;text-decoration-line:none;text-decoration-style:solid;text-decoration-color:#000000;letter-spacing:normal;word-spacing:normal;text-transform:none;writing-mode:lr-tb;direction:ltr;text-orientation:mixed;dominant-baseline:auto;baseline-shift:baseline;text-anchor:start;white-space:normal;shape-padding:0;clip-rule:nonzero;display:inline;overflow:visible;visibility:visible;opacity:1;isolation:auto;mix-blend-mode:normal;color-interpolation:sRGB;color-interpolation-filters:linearRGB;solid-color:#000000;solid-opacity:1;vector-effect:none;fill:#1e1e22;fill-opacity:1;fill-rule:nonzero;stroke:#0f0f10;stroke-width:1.61562;stroke-linecap:round;stroke-linejoin:round;stroke-miterlimit:4;stroke-dasharray:none;stroke-dashoffset:0;stroke-opacity:1;color-rendering:auto;image-rendering:auto;shape-rendering:auto;text-rendering:auto;enable-background:accumulate"
       d="m -1535.129,639.84534 c 49.0966,24.97477 135.0296,83.1459 186.6975,38.88121 -60.5357,10.35602 -126.5893,-50.14894 -168.7743,-75.87302 l -22.1115,-5.78421 c -13.5399,0.34635 -23.1586,18.67391 4.1883,42.77602 z"
       id="path5133"
       inkscape:connector-curvature="0"
       sodipodi:nodetypes="ccccc" />
    <path
       style="opacity:1;fill:#8a8a8a;fill-opacity:1;stroke:#0f0f10;stroke-width:1.61562;stroke-linecap:round;stroke-linejoin:round;stroke-miterlimit:4;stroke-dasharray:none;stroke-dashoffset:0;stroke-opacity:1"
       d="m -1664.2902,635.95652 0.01,0.40443 c 7.2647,-15.99017 20.3516,-30.11081 32.7869,-34.62177 5.4446,-1.97508 16.3583,-0.9052 33.3769,6.27842 17.0185,7.18363 38.4394,19.3402 62.9878,31.82757 49.0965,24.97476 135.0296,83.14586 186.6974,38.88118 -25.7378,13.57494 -57.1252,8.81559 -91.7538,-2.8736 -12.0459,-4.06621 -48.9691,-21.85563 -85.0609,-40.83828 -38.157,-20.06884 -75.5977,-41.28178 -89.8482,-41.80517 -23.2552,-0.8541 -43.9156,11.96427 -49.1955,42.74722 z"
       id="path5262"
       inkscape:connector-curvature="0"
       sodipodi:nodetypes="cccsscsssc" />
    <path
       sodipodi:nodetypes="ssssccsccccs"
       style="color:#000000;font-style:normal;font-variant:normal;font-weight:normal;font-stretch:normal;font-size:medium;line-height:normal;font-family:sans-serif;font-variant-ligatures:normal;font-variant-position:normal;font-variant-caps:normal;font-variant-numeric:normal;font-variant-alternates:normal;font-feature-settings:normal;text-indent:0;text-align:start;text-decoration:none;text-decoration-line:none;text-decoration-style:solid;text-decoration-color:#000000;letter-spacing:normal;word-spacing:normal;text-transform:none;writing-mode:lr-tb;direction:ltr;text-orientation:mixed;dominant-baseline:auto;baseline-shift:baseline;text-anchor:start;white-space:normal;shape-padding:0;clip-rule:nonzero;display:inline;overflow:visible;visibility:visible;opacity:1;isolation:auto;mix-blend-mode:normal;color-interpolation:sRGB;color-interpolation-filters:linearRGB;solid-color:#000000;solid-opacity:1;vector-effect:none;fill:#8a8a8a;fill-opacity:1;fill-rule:nonzero;stroke:#0f0f10;stroke-width:1.61562;stroke-linecap:round;stroke-linejoin:round;stroke-miterlimit:4;stroke-dasharray:none;stroke-dashoffset:0;stroke-opacity:1;color-rendering:auto;image-rendering:auto;shape-rendering:auto;text-rendering:auto;enable-background:accumulate"
       d="m -1506.0378,527.71944 c -10.7576,0.52115 -19.4775,8.90673 -20.4188,19.63574 -0.9412,10.72901 6.2041,20.42393 16.6879,22.89112 12.6806,2.98415 18.6352,8.55092 22.7592,16.03894 4.124,7.48803 5.7847,18.00985 4.0917,29.54297 -3.3861,23.06626 -20.4398,46.74004 -40.8856,52.79227 -11.5678,3.24974 -18.2415,15.33438 -14.831,26.85583 3.4105,11.52145 15.5868,18.02624 27.0597,14.45566 40.7086,-12.05031 65.6922,-49.75683 71.2836,-87.84636 2.7956,-19.04478 0.6803,-39.04431 -8.98,-56.5847 -9.6604,-17.54036 -27.479,-31.5894 -50.361,-37.12828 -2.0905,-0.53739 -4.2498,-0.75763 -6.4057,-0.65319 z"
       id="path5121"
       inkscape:connector-curvature="0" />
    <path
       sodipodi:nodetypes="scccsssccsss"
       style="color:#000000;font-style:normal;font-variant:normal;font-weight:normal;font-stretch:normal;font-size:medium;line-height:normal;font-family:sans-serif;font-variant-ligatures:normal;font-variant-position:normal;font-variant-caps:normal;font-variant-numeric:normal;font-variant-alternates:normal;font-feature-settings:normal;text-indent:0;text-align:start;text-decoration:none;text-decoration-line:none;text-decoration-style:solid;text-decoration-color:#000000;letter-spacing:normal;word-spacing:normal;text-transform:none;writing-mode:lr-tb;direction:ltr;text-orientation:mixed;dominant-baseline:auto;baseline-shift:baseline;text-anchor:start;white-space:normal;shape-padding:0;clip-rule:nonzero;display:inline;overflow:visible;visibility:visible;opacity:1;isolation:auto;mix-blend-mode:normal;color-interpolation:sRGB;color-interpolation-filters:linearRGB;solid-color:#000000;solid-opacity:1;vector-effect:none;fill:#1e1e22;fill-opacity:1;fill-rule:nonzero;stroke:#0f0f10;stroke-width:1.61562;stroke-linecap:round;stroke-linejoin:round;stroke-miterlimit:4;stroke-dasharray:none;stroke-dashoffset:0;stroke-opacity:1;color-rendering:auto;image-rendering:auto;shape-rendering:auto;text-rendering:auto;enable-background:accumulate"
       d="m -1638.3864,559.84203 c -2.6638,-0.0206 -5.3083,0.45303 -7.7994,1.39684 -35.8241,12.99538 -59.4961,47.38362 -65.6351,84.11443 -3.0696,18.36541 -1.3673,38.10084 8.0434,55.69326 9.4108,17.59243 26.7505,31.83969 49.6246,39.25616 11.4265,3.70484 23.6988,-2.43748 27.3522,-13.88059 3.6533,-11.44311 -2.7838,-23.57822 -14.2489,-27.16213 -14.0853,-4.40297 -20.6822,-10.95172 -24.7386,-18.53494 -4.0566,-7.58326 -5.358,-17.3856 -3.539,-28.26921 3.6381,-21.76724 21.2803,-44.81041 37.8336,-50.71648 9.8756,-3.52352 15.9003,-13.50522 14.1982,-23.85149 -1.7022,-10.34626 -10.606,-17.96459 -21.091,-18.04585 z"
       id="path5117"
       inkscape:connector-curvature="0" />
    <path
       sodipodi:nodetypes="cccccccccccccssc"
       inkscape:connector-curvature="0"
       d="m -1686.4696,691.44426 c -4.7471,-2.30935 -9.9543,-4.14437 -15.0222,-5.73218 2.2334,-0.40625 6.6922,0.54673 8.4471,2.26235 -5.4964,-6.73001 -13.6768,-10.19594 -22.1489,-11.59327 3.9262,-0.12037 7.6993,1.21552 11.4405,1.99271 -6.5833,-7.30679 -4.287,-16.56298 -12.3089,-23.8533 2.5563,-0.30371 5.1834,2.33371 6.4371,4.33731 -0.092,-8.35199 -0.3027,-13.44417 -5.1157,-20.93518 2.587,-0.004 5.1336,2.76056 6.5025,4.7863 1.974,-7.40947 0.117,-16.04666 -1.8997,-23.24868 3.6203,1.72253 5.3946,7.30927 6.2336,10.91577 -0.026,-7.90439 1.3048,-15.08537 -1.484,-22.76534 2.5581,-0.36179 6.4084,4.52049 7.7039,6.41145 -3.8752,13.81868 -10.2918,36.31062 -9.211,45.06932 1.0808,8.7587 3.274,15.86555 5.8943,18.04004 2.6202,2.17444 8.1082,8.06831 14.7244,13.0142"
       style="opacity:1;fill:#00a7fd;fill-opacity:1;stroke:none;stroke-width:1.61562;stroke-linecap:round;stroke-linejoin:round;stroke-miterlimit:4;stroke-dasharray:none;stroke-dashoffset:0;stroke-opacity:1"
       id="path1005" />
    <path
       style="opacity:1;fill:#8a8a8a;fill-opacity:1;stroke:#0f0f10;stroke-width:1.61562;stroke-linecap:round;stroke-linejoin:round;stroke-miterlimit:4;stroke-dasharray:none;stroke-dashoffset:0;stroke-opacity:1"
       d="m -1620.6168,593.26979 c -20.9387,1.25116 -38.8158,14.36525 -43.6734,42.68673 l 0.01,0.40443 c 7.2647,-15.99015 20.3516,-30.11081 32.7869,-34.62177 a 21.543794,21.543794 0 0 0 10.8771,-8.46939 z"
       id="path5288"
       inkscape:connector-curvature="0" />
    <path
       style="opacity:1;fill:none;fill-opacity:1;stroke:#02095b;stroke-width:1.61562;stroke-linecap:round;stroke-linejoin:round;stroke-miterlimit:4;stroke-dasharray:none;stroke-dashoffset:0;stroke-opacity:1"
       d="m -1686.4696,691.44426 c -4.7471,-2.30935 -9.9543,-4.14437 -15.0222,-5.73218 2.2334,-0.40625 6.6922,0.54673 8.4471,2.26235 -5.4964,-6.73001 -13.6768,-10.19594 -22.1489,-11.59327 3.9262,-0.12037 7.6993,1.21552 11.4405,1.99271 -6.5833,-7.30679 -4.287,-16.56298 -12.3089,-23.8533 2.5563,-0.30371 5.1834,2.33371 6.4371,4.33731 -0.092,-8.35199 -0.3027,-13.44417 -5.1157,-20.93518 2.587,-0.004 5.1336,2.76056 6.5025,4.7863 1.974,-7.40947 0.117,-16.04666 -1.8997,-23.24868 3.6203,1.72253 5.3946,7.30927 6.2336,10.91577 -0.026,-7.90439 1.3048,-15.08537 -1.484,-22.76534 2.5581,-0.36179 4.7034,3.6367 5.9989,5.52766"
       id="path1014"
       inkscape:connector-curvature="0"
       sodipodi:nodetypes="ccccccccccccc" />
    <path
       style="display:inline;opacity:1;fill:#1e1e22;fill-opacity:1;stroke:#0f0f10;stroke-width:1.57485;stroke-linecap:round;stroke-linejoin:round;stroke-miterlimit:4;stroke-dasharray:none;stroke-opacity:1;stop-opacity:1"
       d="m -1690.2478,620.89151 c -0.7694,7.56182 7.8242,31.93778 15.0091,37.69884 7.1848,5.76111 10.6851,-1.27425 10.6851,-1.27425 l -1.8925,-24.43244"
       id="path3840"
       inkscape:connector-curvature="0" />
    <path
       style="display:inline;opacity:1;fill:#1e1e22;fill-opacity:1;stroke:#0f0f10;stroke-width:1.57485;stroke-linecap:round;stroke-linejoin:round;stroke-miterlimit:4;stroke-dasharray:none;stroke-opacity:1;stop-opacity:1"
       d="m -1672.549,619.55448 c 9.7167,12.22446 21.9971,52.12014 14.4022,57.00673 -7.5948,4.8866 -20.491,-18.79681 -35.9498,-22.74287 -7.3923,-4.76529 -7.5385,-11.42455 -3.0967,-12.91596 6.0135,-2.01907 20.5727,4.35639 27.7209,13.47525"
       id="path3842"
       inkscape:connector-curvature="0"
       sodipodi:nodetypes="cscsc" />
    <path
       sodipodi:nodetypes="cssc"
       inkscape:connector-curvature="0"
       id="path3844"
       d="m -1697.8814,641.22269 c -10.3132,3.59997 -11.8704,13.16995 -10.2181,17.40667 1.3086,3.35559 4.9685,4.58251 8.7563,3.14172 3.7371,-1.42146 11.2538,-8.02648 9.2252,-16.89908"
       style="display:inline;opacity:1;fill:#1e1e22;fill-opacity:1;stroke:#0f0f10;stroke-width:1.57485;stroke-linecap:round;stroke-linejoin:round;stroke-miterlimit:4;stroke-dasharray:none;stroke-opacity:1;stop-opacity:1" />
    <path
       style="display:inline;opacity:1;fill:#1e1e22;fill-opacity:1;stroke:#0f0f10;stroke-width:1.57485;stroke-linecap:round;stroke-linejoin:round;stroke-miterlimit:4;stroke-dasharray:none;stroke-opacity:1;stop-opacity:1"
       d="m -1697.1933,640.90238 c -10.3134,3.59999 -12.5585,13.49026 -10.9062,17.72698 1.3086,3.35559 4.9685,4.58251 8.7563,3.14172 3.7371,-1.42146 11.2538,-8.02648 9.2252,-16.89908"
       id="path3846"
       inkscape:connector-curvature="0"
       sodipodi:nodetypes="cssc" />
    <path
       style="color:#000000;font-style:normal;font-variant:normal;font-weight:normal;font-stretch:normal;font-size:medium;line-height:normal;font-family:sans-serif;font-variant-ligatures:normal;font-variant-position:normal;font-variant-caps:normal;font-variant-numeric:normal;font-variant-alternates:normal;font-feature-settings:normal;text-indent:0;text-align:start;text-decoration:none;text-decoration-line:none;text-decoration-style:solid;text-decoration-color:#000000;letter-spacing:normal;word-spacing:normal;text-transform:none;writing-mode:lr-tb;direction:ltr;text-orientation:mixed;dominant-baseline:auto;baseline-shift:baseline;text-anchor:start;white-space:normal;shape-padding:0;clip-rule:nonzero;display:inline;overflow:visible;visibility:visible;opacity:1;isolation:auto;mix-blend-mode:normal;color-interpolation:sRGB;color-interpolation-filters:linearRGB;solid-color:#000000;solid-opacity:1;vector-effect:none;fill:#1e1e22;fill-opacity:1;fill-rule:nonzero;stroke:#0f0f10;stroke-width:1.61562;stroke-linecap:round;stroke-linejoin:round;stroke-miterlimit:4;stroke-dasharray:none;stroke-dashoffset:0;stroke-opacity:1;color-rendering:auto;image-rendering:auto;shape-rendering:auto;text-rendering:auto;enable-background:accumulate"
       d="m -1698.6782,627.81283 c 22.6624,26.05108 24.3511,24.88792 54.0539,46.77527 39.2495,28.92202 85.7897,49.33344 133.0496,35.34387 11.5681,-3.24955 18.242,-15.33431 14.8314,-26.85593 -3.4105,-11.52162 -15.5871,-18.0264 -27.0601,-14.45556 -28.5401,8.44832 -105.9133,-13.06059 -142.1634,-68.90703 -5.8632,-9.03273 -39.9952,19.72647 -32.7114,28.09938 z"
       id="path5109"
       inkscape:connector-curvature="0"
       sodipodi:nodetypes="sscscss" />
    <path
       style="display:inline;opacity:1;fill:#8a8a8a;fill-opacity:1;stroke:none;stroke-width:1.61562;stroke-linecap:round;stroke-linejoin:round;stroke-miterlimit:4;stroke-dasharray:none;stroke-dashoffset:0;stroke-opacity:1"
       d="m -1700.8061,615.03895 -4.3103,5.27813 c 2.0748,2.44442 4.205,4.92882 6.4382,7.49592 22.6624,26.05107 96.0441,104.19289 187.1034,82.11876 0.3359,-0.0943 0.6674,-0.19704 0.995,-0.30608 13.9323,-4.29475 25.9937,-11.61006 36.0385,-20.90951 l -20.2678,-27.09587 -4.3978,-10.2044 c -0.052,0.061 -0.1042,0.12067 -0.1561,0.18144 -0.4657,0.54999 -0.9384,1.09143 -1.4185,1.62352 -34.1819,38.23247 -82.0796,31.07375 -113.9556,15.80544 -28.8189,-13.80404 -55.7332,-31.44033 -69.8775,-51.56864 z"
       id="path5154"
       inkscape:connector-curvature="0"
       sodipodi:nodetypes="ccccccccccscc" />
    <path
       id="path5219"
       d="m -1499.2069,651.4159 c -0.052,0.061 -0.1042,0.12067 -0.1561,0.18144 -0.4657,0.54999 -0.9384,1.09143 -1.4185,1.62352 -69.0093,72.65718 -169.6889,-15.63514 -183.8332,-35.76345"
       style="display:inline;opacity:1;fill:none;fill-opacity:1;stroke:#0f0f10;stroke-width:1.61562;stroke-linecap:round;stroke-linejoin:round;stroke-miterlimit:4;stroke-dasharray:none;stroke-dashoffset:0;stroke-opacity:1"
       inkscape:connector-curvature="0"
       sodipodi:nodetypes="cccc" />
    <path
       id="path5231"
       d="m -1695.2409,631.73838 c 22.6624,26.05107 98.8729,100.91362 183.6661,78.19338 0.3359,-0.0943 0.6674,-0.19704 0.995,-0.30608 13.9323,-4.29475 25.9937,-11.61006 36.0385,-20.90951"
       style="display:inline;opacity:1;fill:none;fill-opacity:1;stroke:#0f0f10;stroke-width:1.61562;stroke-linecap:round;stroke-linejoin:round;stroke-miterlimit:4;stroke-dasharray:none;stroke-dashoffset:0;stroke-opacity:1"
       inkscape:connector-curvature="0"
       sodipodi:nodetypes="cccc" />
    <path
       style="opacity:1;fill:#00a7fd;fill-opacity:1;stroke:#02095b;stroke-width:1.61562;stroke-linecap:round;stroke-linejoin:round;stroke-miterlimit:4;stroke-dasharray:none;stroke-dashoffset:0;stroke-opacity:1"
       d="m -1603.8266,634.00478 c -1.8252,1.74409 -4.5848,3.85444 -7.2289,3.05166 4.2178,-5.64912 8.2427,-11.36559 11.1568,-17.70585 -1.6051,2.03805 -4.4631,3.10603 -6.9494,3.75886 1.0439,-2.1361 3.0444,-3.76074 4.4617,-5.69312 3.6623,-4.99351 6.4629,-8.73475 11.7211,-12.30823 l 0.9963,40.01735"
       id="path1024"
       inkscape:connector-curvature="0"
       sodipodi:nodetypes="ccccccc" />
    <path
       style="color:#000000;font-style:normal;font-variant:normal;font-weight:normal;font-stretch:normal;font-size:medium;line-height:normal;font-family:sans-serif;font-variant-ligatures:normal;font-variant-position:normal;font-variant-caps:normal;font-variant-numeric:normal;font-variant-alternates:normal;font-feature-settings:normal;text-indent:0;text-align:start;text-decoration:none;text-decoration-line:none;text-decoration-style:solid;text-decoration-color:#000000;letter-spacing:normal;word-spacing:normal;text-transform:none;writing-mode:lr-tb;direction:ltr;text-orientation:mixed;dominant-baseline:auto;baseline-shift:baseline;text-anchor:start;white-space:normal;shape-padding:0;clip-rule:nonzero;display:inline;overflow:visible;visibility:visible;opacity:1;isolation:auto;mix-blend-mode:normal;color-interpolation:sRGB;color-interpolation-filters:linearRGB;solid-color:#000000;solid-opacity:1;vector-effect:none;fill:#1e1e22;fill-opacity:1;fill-rule:nonzero;stroke:none;stroke-width:1.61562;stroke-linecap:round;stroke-linejoin:round;stroke-miterlimit:4;stroke-dasharray:none;stroke-dashoffset:0;stroke-opacity:1;color-rendering:auto;image-rendering:auto;shape-rendering:auto;text-rendering:auto;enable-background:accumulate"
       d="m -1516.6934,526.27262 c -9.3435,-0.0297 -18.3253,1.82867 -26.2623,5.54371 -12.6992,5.94409 -22.0925,15.74231 -29.2432,26.39115 -14.3014,21.29771 -21.5692,47.1839 -28.712,71.64909 -7.1428,24.46521 -14.204,47.66307 -21.61,59.85696 -3.7031,6.09693 -6.9977,8.90559 -8.9743,9.86992 -1.9766,0.96433 -3.488,1.61336 -9.5544,-0.32345 l -13.1033,41.04272 c 14.1066,4.50374 29.3287,3.96337 41.5488,-1.99849 12.22,-5.96185 20.5849,-15.81644 26.907,-26.22546 12.6439,-20.81805 19.0938,-46.00419 26.1429,-70.14814 7.0489,-24.14395 14.6534,-47.09201 23.1231,-59.70494 4.2348,-6.30649 8.2012,-9.73266 11.7396,-11.3888 3.5381,-1.65612 7.2787,-2.44099 14.9228,-0.59059 -22.7681,-11.01187 -5.9197,-40.23455 10.1366,-41.87367 -5.7186,-1.38429 -11.4553,-2.08214 -17.0613,-2.10001 z"
       id="path5119"
       inkscape:connector-curvature="0"
       sodipodi:nodetypes="cccscccccssscccc" />
    <path
       style="opacity:1;fill:#8a8a8a;fill-opacity:1;stroke:none;stroke-width:1.61562;stroke-linecap:round;stroke-linejoin:round;stroke-miterlimit:4;stroke-dasharray:none;stroke-dashoffset:0;stroke-opacity:1"
       d="m -1506.9995,527.55252 c -29.1695,0.10677 -60.0256,38.6386 -72.4374,83.67528 -13.4634,48.85337 -2.4134,128.56956 -74.7163,129.07471 14.1067,4.50374 29.3287,3.96339 41.5488,-1.99847 12.22,-5.96183 20.585,-15.81647 26.907,-26.22547 12.644,-20.81803 19.094,-46.00418 26.1429,-70.14813 7.049,-24.14396 14.6535,-47.09203 23.1231,-59.70496 4.2349,-6.30647 8.2013,-9.73263 11.7396,-11.38877 3.5382,-1.65612 7.2788,-2.441 14.9229,-0.5906 l 10.1365,-41.87367 c -2.4354,-0.56232 -4.895,-0.82897 -7.3671,-0.81992 z"
       id="path5235"
       inkscape:connector-curvature="0"
       sodipodi:nodetypes="ssccssscccs" />
    <path
       sodipodi:nodetypes="ccccsccc"
       inkscape:connector-curvature="0"
       id="path5242"
       d="m -1499.6321,528.37263 c -5.7186,-1.38429 -11.4553,-2.08214 -17.0613,-2.10001 -9.3435,-0.0297 -18.3253,1.82867 -26.2623,5.54371 -12.6992,5.94409 -22.0925,15.74231 -29.2432,26.39115 -14.3014,21.29771 -21.5692,47.1839 -28.712,71.64909 -7.1428,24.46521 -14.204,47.66307 -21.61,59.85696 -3.7031,6.09693 -6.9977,8.90559 -8.9743,9.86992 -1.9766,0.96433 -3.488,1.61336 -9.5544,-0.32345"
       style="color:#000000;font-style:normal;font-variant:normal;font-weight:normal;font-stretch:normal;font-size:medium;line-height:normal;font-family:sans-serif;font-variant-ligatures:normal;font-variant-position:normal;font-variant-caps:normal;font-variant-numeric:normal;font-variant-alternates:normal;font-feature-settings:normal;text-indent:0;text-align:start;text-decoration:none;text-decoration-line:none;text-decoration-style:solid;text-decoration-color:#000000;letter-spacing:normal;word-spacing:normal;text-transform:none;writing-mode:lr-tb;direction:ltr;text-orientation:mixed;dominant-baseline:auto;baseline-shift:baseline;text-anchor:start;white-space:normal;shape-padding:0;clip-rule:nonzero;display:inline;overflow:visible;visibility:visible;opacity:1;isolation:auto;mix-blend-mode:normal;color-interpolation:sRGB;color-interpolation-filters:linearRGB;solid-color:#000000;solid-opacity:1;vector-effect:none;fill:none;fill-opacity:1;fill-rule:nonzero;stroke:#0f0f10;stroke-width:1.61562;stroke-linecap:round;stroke-linejoin:round;stroke-miterlimit:4;stroke-dasharray:none;stroke-dashoffset:0;stroke-opacity:1;color-rendering:auto;image-rendering:auto;shape-rendering:auto;text-rendering:auto;enable-background:accumulate" />
    <path
       id="path5240"
       d="m -1499.6324,528.37244 c -2.4354,-0.56232 -4.895,-0.82897 -7.3671,-0.81992 -29.1695,0.10677 -60.0256,38.6386 -72.4374,83.67528 -13.4634,48.85337 -2.4134,128.56956 -74.7163,129.07471 14.1067,4.50374 29.3287,3.96339 41.5488,-1.99847 12.22,-5.96183 20.585,-15.81647 26.907,-26.22547 12.644,-20.81803 19.094,-46.00418 26.1429,-70.14813 7.049,-24.14396 14.6535,-47.09203 23.1231,-59.70496 4.2349,-6.30647 8.2013,-9.73263 11.7396,-11.38877 3.5382,-1.65612 7.2788,-2.441 14.9229,-0.5906"
       style="opacity:1;fill:none;fill-opacity:1;stroke:#0f0f10;stroke-width:1.61562;stroke-linecap:round;stroke-linejoin:round;stroke-miterlimit:4;stroke-dasharray:none;stroke-dashoffset:0;stroke-opacity:1"
       inkscape:connector-curvature="0"
       sodipodi:nodetypes="cssccssscc" />
    <path
       style="color:#000000;font-style:normal;font-variant:normal;font-weight:normal;font-stretch:normal;font-size:medium;line-height:normal;font-family:sans-serif;font-variant-ligatures:normal;font-variant-position:normal;font-variant-caps:normal;font-variant-numeric:normal;font-variant-alternates:normal;font-feature-settings:normal;text-indent:0;text-align:start;text-decoration:none;text-decoration-line:none;text-decoration-style:solid;text-decoration-color:#000000;letter-spacing:normal;word-spacing:normal;text-transform:none;writing-mode:lr-tb;direction:ltr;text-orientation:mixed;dominant-baseline:auto;baseline-shift:baseline;text-anchor:start;white-space:normal;shape-padding:0;clip-rule:nonzero;display:inline;overflow:visible;visibility:visible;opacity:1;isolation:auto;mix-blend-mode:normal;color-interpolation:sRGB;color-interpolation-filters:linearRGB;solid-color:#000000;solid-opacity:1;vector-effect:none;fill:#1e1e22;fill-opacity:1;fill-rule:nonzero;stroke:none;stroke-width:1.61562;stroke-linecap:round;stroke-linejoin:round;stroke-miterlimit:4;stroke-dasharray:none;stroke-dashoffset:0;stroke-opacity:1;color-rendering:auto;image-rendering:auto;shape-rendering:auto;text-rendering:auto;enable-background:accumulate"
       d="m -1517.2058,602.85353 c -21.8811,-13.4085 -43.3137,-25.72995 -64.1567,-34.52789 -14.3296,-6.04859 -29.138,-10.92312 -44.183,-10.77135 -6.8386,0.069 -13.7264,1.17655 -20.6403,3.68458 23.1935,5.24717 -17.3005,16.40361 -13.2012,27.70403 4.0995,11.3004 18.0773,12.22002 29.3168,7.95655 5.4447,-1.97507 14.9349,3.93471 31.9535,11.11834 17.0186,7.18363 38.4394,19.34019 62.9877,31.82755 z"
       id="path5105"
       inkscape:connector-curvature="0"
       sodipodi:nodetypes="ccscscscc" />
    <path
       style="opacity:1;fill:#8a8a8a;fill-opacity:1;stroke:none;stroke-width:1.61562;stroke-linecap:round;stroke-linejoin:round;stroke-miterlimit:4;stroke-dasharray:none;stroke-dashoffset:0;stroke-opacity:1"
       d="m -1617.2667,593.16934 c -10.4822,0.002 -20.3467,2.85255 -28.3959,8.95219 4.8973,-0.14049 15.7936,-3.71131 14.1687,-0.38235 5.4447,-1.97508 16.3584,-0.9052 33.377,6.27842 17.0185,7.18363 38.4394,19.3402 62.9877,31.82757 l 4.0295,-7.92192 c -36.0765,-19.09756 -70.4745,-38.21738 -83.995,-38.71395 -0.7266,-0.0267 -1.4507,-0.0401 -2.172,-0.0399 z"
       id="path5281"
       inkscape:connector-curvature="0"
       sodipodi:nodetypes="cccscccc" />
    <path
       sodipodi:nodetypes="ccccccccccccsccccssc"
       inkscape:connector-curvature="0"
       d="m -1681.2813,599.85583 c 3.4662,-8.73497 17.0819,-13.63559 13.5611,-25.30217 2.1019,0.32219 2.2705,5.10832 2.3178,7.07017 5.4127,-7.04025 14.6525,-13.07073 13.628,-23.47696 2.5955,1.08692 3.462,5.83289 2.9196,8.40396 5.7911,-3.28145 19.2564,-13.68513 17.3609,-20.689 3.4103,1.79711 1.3626,10.63564 -0.5237,13.33804 8.4741,-6.73933 24.6476,-7.78086 35.9008,-9.22767 -3.7345,2.95662 -8.5069,5.75606 -11.5686,9.5763 10.8231,3.92701 26.8833,5.7852 37.6186,2.13556 -3.0413,5.19942 -13.4213,7.83167 -19.2325,6.92801 1.8187,1.30295 3.704,1.84661 5.9125,2.0395 8.2618,0.72155 16.1885,0.15444 24.2574,2.63553 8.1525,2.50686 15.4339,7.05913 23.6671,9.32737 -2.5508,2.82737 -10.8232,2.10703 -14.3433,0.54062 11.8045,7.17818 36.4984,11.54836 44.7456,13.01287 -2.8622,3.15157 -9.041,3.95416 -12.9161,2.4768 -0.08,-2.28823 -53.1466,-19.33252 -71.891,-27.80237 -16.614,-7.50722 -32.5182,-11.69963 -40.1915,-10.56715 -8.7416,1.29011 -29.3475,13.03034 -43.0531,35.26416"
       style="opacity:1;fill:#00a7fd;fill-opacity:1;stroke:none;stroke-width:1.61562;stroke-linecap:round;stroke-linejoin:round;stroke-miterlimit:4;stroke-dasharray:none;stroke-dashoffset:0;stroke-opacity:1"
       id="path1016" />
    <path
       id="path5295"
       d="m -1531.0997,631.92325 c -36.0765,-19.09756 -70.4745,-38.21738 -83.995,-38.71395 -0.7266,-0.0267 -1.4507,-0.0401 -2.172,-0.0399 -10.4822,0.002 -20.3467,2.85255 -28.3959,8.95218 m 14.1687,-0.38233 c 5.4447,-1.97508 16.3584,-0.90521 33.377,6.27842 17.0185,7.18362 38.4394,19.34019 62.9877,31.82756"
       style="opacity:1;fill:none;fill-opacity:1;stroke:#0f0f10;stroke-width:1.61562;stroke-linecap:round;stroke-linejoin:round;stroke-miterlimit:4;stroke-dasharray:none;stroke-dashoffset:0;stroke-opacity:1"
       inkscape:connector-curvature="0"
       sodipodi:nodetypes="cccccsc" />
    <path
       id="path1004"
       style="opacity:1;fill:none;fill-opacity:1;stroke:#02095b;stroke-width:1.61562;stroke-linecap:round;stroke-linejoin:round;stroke-miterlimit:4;stroke-dasharray:none;stroke-dashoffset:0;stroke-opacity:1"
       d="m -1681.2813,599.85583 c 3.4662,-8.73497 17.0819,-13.63559 13.5611,-25.30217 2.1019,0.32219 2.2705,5.10832 2.3178,7.07017 5.4127,-7.04025 14.6525,-13.07073 13.628,-23.47696 2.5955,1.08692 3.462,5.83289 2.9196,8.40396 5.7911,-3.28145 19.2564,-13.68513 17.3609,-20.689 3.4103,1.79711 1.3626,10.63564 -0.5237,13.33804 8.4741,-6.73933 24.6476,-7.78086 35.9008,-9.22767 -3.7345,2.95662 -8.5069,5.75606 -11.5686,9.5763 10.8231,3.92701 26.8833,5.7852 37.6186,2.13556 -3.0413,5.19942 -13.4213,7.83167 -19.2325,6.92801 1.8187,1.30295 3.704,1.84661 5.9125,2.0395 8.2618,0.72155 16.1885,0.15444 24.2574,2.63553 8.1525,2.50686 15.4339,7.05913 23.6671,9.32737 -2.5508,2.82737 -10.8232,2.10703 -14.3433,0.54062 11.8045,7.17818 36.4984,11.54836 44.7456,13.01287 -2.8622,3.15157 -9.041,3.95416 -12.9161,2.4768"
       inkscape:connector-curvature="0"
       sodipodi:nodetypes="ccccccccccccscccc" />
    <path
       id="path1008"
       style="opacity:1;fill:#00a7fd;fill-opacity:1;stroke:none;stroke-width:1.61562;stroke-linecap:round;stroke-linejoin:round;stroke-miterlimit:4;stroke-dasharray:none;stroke-dashoffset:0;stroke-opacity:1"
       d="m -1603.8266,634.00478 c -0.4378,3.81767 -2.2591,6.4821 -4.0454,8.45672 -3.3852,3.74177 -5.3613,8.94257 -6.6089,13.76427 2.3644,-2.85728 5.3855,-5.22905 8.6449,-6.99226 -1.834,6.3149 -6.4299,11.81383 -10.4699,17.08916 2.1267,-0.48261 3.8156,-1.90075 5.5503,-3.13931 2.0166,6.19914 -6.1084,11.34765 -9.5214,15.26022 -2.7966,3.20602 -5.2497,6.63855 -6.9956,10.52059 2.4317,-1.22047 4.7408,-2.91206 7.4262,-3.53919 -1.6113,11.32562 -18.0903,9.64535 -25.8626,15.68922 3.1906,-0.27636 6.7636,0.138 9.8039,1.1986 1.9883,1.5014 0.087,0.31901 0.1307,0.47959 -1.0278,-0.086 -2.0733,-0.21508 -3.1052,-0.0944 -2.3879,0.27928 -4.56,1.44789 -7.0043,1.32981 -3.4117,-0.16484 -6.5284,-1.59868 -9.9341,-1.48968 2.4771,2.05596 5.1318,3.86244 8.2926,4.08386 -5.1121,0.54958 -8.1179,-3.90821 -11.8734,-6.4054 -2.8644,-1.90469 -6.0651,-2.63783 -9.3978,-3.26275 1.4096,1.56722 2.9572,3.0333 4.2542,4.75606 -4.9779,-3.44905 -8.7455,-10.84034 -15.4833,-12.58958 2.1247,3.00618 3.9979,4.02374 5.2389,7.48692 -9.3255,-1.81067 -11.7755,-13.92334 -19.9872,-17.00256 2.9965,3.73387 6.2142,7.47788 8.3044,11.83958 7.3312,4.53123 25.3355,16.62794 38.3734,17.38936 13.038,0.76142 21.367,-7.21715 29.4539,-17.09094 9.6226,-11.74907 14.1051,-43.78374 15.337,-57.27863"
       inkscape:connector-curvature="0"
       sodipodi:nodetypes="cccccccccccccccccccccccssc" />
    <path
       sodipodi:nodetypes="ccccccccccccccccccccccc"
       inkscape:connector-curvature="0"
       d="m -1603.8266,634.00478 c 1.413,2.64037 -2.2591,6.4821 -4.0454,8.45672 -3.3852,3.74177 -5.3613,8.94257 -6.6089,13.76427 2.3644,-2.85728 5.3855,-5.22905 8.6449,-6.99226 -1.834,6.3149 -6.4299,11.81383 -10.4699,17.08916 2.1267,-0.48261 3.8156,-1.90075 5.5503,-3.13931 2.0166,6.19914 -6.1084,11.34765 -9.5214,15.26022 -2.7966,3.20602 -5.2497,6.63855 -6.9956,10.52059 2.4317,-1.22047 4.7408,-2.91206 7.4262,-3.53919 -1.6113,11.32562 -18.0903,9.64535 -25.8626,15.68922 3.1906,-0.27636 6.7636,0.138 9.8039,1.1986 1.9883,1.5014 0.087,0.31901 0.1307,0.47959 -1.0278,-0.086 -2.0733,-0.21508 -3.1052,-0.0944 -2.3879,0.27928 -4.56,1.44789 -7.0043,1.32981 -3.4117,-0.16484 -6.5284,-1.59868 -9.9341,-1.48968 2.4771,2.05596 5.1318,3.86244 8.2926,4.08386 -5.1121,0.54958 -8.1179,-3.90821 -11.8734,-6.4054 -2.8644,-1.90469 -6.0651,-2.63783 -9.3978,-3.26275 1.4096,1.56722 2.9572,3.0333 4.2542,4.75606 -4.9779,-3.44905 -8.7455,-10.84034 -15.4833,-12.58958 2.1247,3.00618 3.9979,4.02374 5.2389,7.48692 -9.3255,-1.81067 -11.7755,-13.92334 -19.9872,-17.00256 2.9965,3.73387 6.2142,7.47788 8.3044,11.83958"
       style="opacity:1;fill:none;fill-opacity:1;stroke:#02095b;stroke-width:1.61562;stroke-linecap:round;stroke-linejoin:round;stroke-miterlimit:4;stroke-dasharray:none;stroke-dashoffset:0;stroke-opacity:1"
       id="path1010" />
    <path
       inkscape:connector-curvature="0"
       id="path953"
       d="m -1663.6719,626.52413 c -0.7694,7.56182 7.8242,31.93778 15.009,37.69884 7.1848,5.76111 10.6852,-1.27425 10.6852,-1.27425 l -1.8926,-24.43244"
       style="display:inline;opacity:1;fill:#1e1e22;fill-opacity:1;stroke:#0f0f10;stroke-width:1.57485;stroke-linecap:round;stroke-linejoin:round;stroke-miterlimit:4;stroke-dasharray:none;stroke-opacity:1;stop-opacity:1" />
    <path
       sodipodi:nodetypes="cscsc"
       inkscape:connector-curvature="0"
       id="path951-3"
       d="m -1645.9731,625.1871 c 9.7166,12.22446 21.997,52.12014 14.4022,57.00673 -7.5949,4.8866 -20.4911,-18.79681 -35.9498,-22.74287 -7.3923,-4.76529 -7.5385,-11.42455 -3.0967,-12.91596 6.0135,-2.01907 20.5727,4.35639 27.7208,13.47525"
       style="display:inline;opacity:1;fill:#1e1e22;fill-opacity:1;stroke:#0f0f10;stroke-width:1.57485;stroke-linecap:round;stroke-linejoin:round;stroke-miterlimit:4;stroke-dasharray:none;stroke-opacity:1;stop-opacity:1" />
    <path
       style="display:inline;opacity:1;fill:#1e1e22;fill-opacity:1;stroke:#0f0f10;stroke-width:1.57485;stroke-linecap:round;stroke-linejoin:round;stroke-miterlimit:4;stroke-dasharray:none;stroke-opacity:1;stop-opacity:1"
       d="m -1671.3055,646.85531 c -10.3133,3.59997 -11.8704,13.16995 -10.2182,17.40667 1.3086,3.35559 4.9685,4.58251 8.7564,3.14172 3.7371,-1.42146 11.2538,-8.02648 9.2251,-16.89908"
       id="path949"
       inkscape:connector-curvature="0"
       sodipodi:nodetypes="cssc" />
    <path
       sodipodi:nodetypes="cssc"
       inkscape:connector-curvature="0"
       id="path938"
       d="m -1670.6174,646.535 c -10.3134,3.59999 -12.5585,13.49026 -10.9063,17.72698 1.3086,3.35559 4.9685,4.58251 8.7564,3.14172 3.7371,-1.42146 11.2538,-8.02648 9.2251,-16.89908"
       style="display:inline;opacity:1;fill:#1e1e22;fill-opacity:1;stroke:#0f0f10;stroke-width:1.57485;stroke-linecap:round;stroke-linejoin:round;stroke-miterlimit:4;stroke-dasharray:none;stroke-opacity:1;stop-opacity:1" />
    <path
       sodipodi:nodetypes="csssssssc"
       inkscape:connector-curvature="0"
       id="path1009"
       d="m -1519.5536,639.48031 c 3.1885,4.54652 5.0592,14.74839 2.971,17.62893 -0.8107,1.11827 -4.7852,4.37238 -11.5324,5.54197 -14.6377,2.53737 -39.5356,5.62373 -46.5844,7.75435 -6.3416,1.91686 -16.1317,1.15536 -20.4845,-0.89414 -4.3529,-2.04951 -7.5234,-6.99327 -5.8788,-11.47248 1.6447,-4.47921 4.8902,-6.63975 9.1601,-6.69161 4.27,-0.0519 15.8455,1.31898 21.8702,0.56041 4.6796,-0.58924 18.3226,-4.9583 21.7839,-3.85427"
       style="display:inline;opacity:1;fill:#1ecf22;fill-opacity:1;fill-rule:nonzero;stroke:none;stroke-width:0.427467;stroke-linecap:round;stroke-linejoin:round;stop-opacity:1" />
    <path
       sodipodi:nodetypes="cscsscc"
       inkscape:connector-curvature="0"
       id="path1003"
       d="m -1546.0118,650.58435 c -12.0027,-13.77053 -15.4394,-37.97076 -10.0342,-45.9076 6.3561,-9.33325 26.5645,-8.98236 40.5313,-0.27181 3.4066,12.05855 9.8284,28.91494 7.6546,37.75737 -0.6104,2.48303 -7.1883,1.98308 -8.6775,3.15896 -1.2901,1.01868 -2.2103,1.98671 -3.2795,2.37409 -6.3976,2.31786 -26.1947,2.88899 -26.1947,2.88899 z"
       style="display:inline;opacity:1;fill:#1e1e22;fill-rule:nonzero;stroke:none;stroke-width:0.427467;stroke-linecap:round;stroke-linejoin:round;stop-opacity:1;fill-opacity:1" />
    <path
       style="display:inline;opacity:1;fill:#1e1e22;fill-opacity:1;fill-rule:nonzero;stroke:#0f0f10;stroke-width:1.61562;stroke-linecap:round;stroke-linejoin:round;stop-opacity:1;stroke-opacity:1"
       d="m -1519.5536,639.4803 c 3.1885,4.54652 5.0592,14.74839 2.9709,17.62894 -0.8107,1.11826 -4.7852,4.37238 -11.5323,5.54196 -14.6378,2.53737 -39.5356,5.62373 -46.5844,7.75436 -6.3416,1.91686 -16.1317,1.15535 -20.4846,-0.89415 -4.3528,-2.04951 -7.5234,-6.99326 -5.8787,-11.47248 1.6446,-4.4792 4.8901,-6.63974 9.1601,-6.69161 4.27,-0.0519 15.8455,1.31899 21.8702,0.56041 4.6796,-0.58923 18.2513,-4.92693 21.7126,-3.8229"
       id="path836"
       inkscape:connector-curvature="0"
       sodipodi:nodetypes="csssssssc" />
    <path
       style="display:inline;opacity:1;fill:#1e1e22;fill-rule:nonzero;stroke:#0f0f10;stroke-width:1.61562;stroke-linecap:round;stroke-linejoin:round;stop-opacity:1;fill-opacity:1;stroke-opacity:1"
       d="m -1515.5147,604.40493 c -13.9669,-8.71055 -34.1752,-9.06144 -40.5314,0.27181 -5.4051,7.93684 -1.9684,32.13708 10.0343,45.90761"
       id="path832"
       inkscape:connector-curvature="0"
       sodipodi:nodetypes="csc" />
    <path
       style="display:inline;opacity:1;fill:#1ecf22;stroke:#0f0f10;stroke-width:1.61562;stroke-linecap:round;stroke-linejoin:round;stop-opacity:1;stroke-opacity:1"
       d="m -1509.1051,642.77202 c -2.2668,1.4359 -5.1498,2.32417 -7.672,2.5775"
       id="path945"
       inkscape:connector-curvature="0"
       sodipodi:nodetypes="cc" />
    <path
       sodipodi:nodetypes="cscc"
       inkscape:connector-curvature="0"
       id="path1238-2"
       d="m -1754.4596,554.25993 c -0.9554,-3.10018 2.0206,-12.21012 4.7201,-16.15026 2.3898,-3.48806 16.1632,-15.81598 15.5056,-21.84995 9.8282,13.34501 2.6104,35.17591 -9.6186,44.11084"
       style="display:inline;fill:#1e1e22;fill-opacity:1;stroke:#0f0f10;stroke-width:1.61562;stroke-linecap:round;stroke-linejoin:round;stroke-miterlimit:4;stroke-dasharray:none;stroke-opacity:1" />
    <path
       sodipodi:nodetypes="ccccccccccccc"
       inkscape:connector-curvature="0"
       id="path1235-2"
       d="m -1751.2879,550.06952 c -0.8477,-5.47192 8.5638,-17.37812 7.8139,-22.96404 2.2644,4.51085 0.5714,10.17856 0.5714,10.17856 1.3836,-5.53738 7.6844,-19.12056 7.7328,-22.63828 2.7526,2.55649 -0.259,11.83977 -0.259,11.83977 4.1684,-5.32599 7.0333,-16.51471 7.114,-20.99332 5.8046,7.33478 -0.6408,22.20946 0.7747,24.92518 0.87,-1.40796 2.6801,-5.05696 2.8139,-7.28505 3.4156,4.9606 -4.5503,14.4659 -4.6612,16.48286 1.9198,-0.96735 3.928,-3.87201 4.6723,-5.8206 1.5156,4.75546 -12.1817,20.33635 -12.6386,23.16076 -5.8916,-4.55239 -15.3087,-3.04885 -15.3087,-3.04885 z"
       style="display:inline;fill:#121212;fill-opacity:1;stroke:#0b0b0b;stroke-width:1.61562;stroke-linecap:round;stroke-linejoin:round;stroke-miterlimit:4;stroke-dasharray:none;stroke-opacity:1" />
    <path
       sodipodi:nodetypes="ccccccccccccccccccc"
       inkscape:connector-curvature="0"
       id="path1288"
       d="m -1758.2233,557.74762 c -8.1439,-3.03001 7.6473,-15.30314 11.0054,-24.82625 2.1685,6.70895 -3.5328,11.78882 -1.9996,15.55364 5.4933,-9.76972 9.7477,-11.50506 15.4093,-19.1668 -2.2809,6.20226 -2.3746,13.88828 -2.5163,16.5261 9.6748,-3.40612 23.751,-9.40728 29.1907,-9.81348 -11.064,7.20443 -7.0344,15.02391 -6.3555,16.76404 5.871,-5.28239 16.5387,1.68734 24.3258,-0.16414 -1.2687,4.31271 -4.8254,6.50254 -6.7845,6.82586 6.502,2.27517 15.7885,-0.009 18.4478,-1.7444 -3.1731,4.40614 -8.6231,7.66358 -12.1748,7.79024 9.7855,2.50975 10.0171,10.21513 16.9892,9.74841 -2.7082,3.72744 -7.218,1.50111 -8.6631,0.4288 7.3291,5.68987 10.8711,10.96469 16.8196,9.95092 -2.7684,3.47026 -6.676,2.5408 -7.6119,2.13603 5.2818,3.3207 8.2711,9.13194 8.2711,9.13194 l -13.8006,5.94634 -51.1804,-51.57888 z"
       style="fill:#00a7fd;fill-opacity:1;stroke:#02095b;stroke-width:1.61562;stroke-linecap:round;stroke-linejoin:round;stroke-miterlimit:4;stroke-dasharray:none;stroke-opacity:1" />
    <path
       inkscape:transform-center-y="29.202095"
       inkscape:transform-center-x="30.605557"
       inkscape:connector-curvature="0"
       id="path1197-7"
       d="m -1788.7727,576.93169 c 3.1774,-1.78517 6.0183,-2.63762 8.6876,-2.47488 4.2707,0.2604 7.5117,3.36388 9.8532,8.22394 2.3578,4.89376 4.3946,12.65793 7.6147,19.54442 3.2201,6.88649 7.4509,12.5976 13.7809,13.87886 6.3321,1.28166 12.6013,-2.33209 19.0458,-7.03872 6.4445,-4.70664 12.8211,-10.40665 19.8035,-12.22415 a 1.6156231,1.6156231 0 0 1 1.9708,1.1561 1.6156231,1.6156231 0 0 1 -1.1567,1.97097 c -5.7944,1.50835 -12.1102,6.88562 -18.712,11.70706 -6.6017,4.82145 -13.7326,9.18621 -21.5926,7.59532 -7.8618,-1.59134 -12.6785,-8.43005 -16.0671,-15.67674 -3.3885,-7.24677 -5.5212,-15.19917 -7.5984,-19.51076 -2.0936,-4.3453 -4.2628,-6.22599 -7.1385,-6.40131 -2.8757,-0.17532 -7.048,1.59852 -12.6061,5.98805 a 1.6156231,1.6156231 0 0 1 -2.2693,-0.2662 1.6156231,1.6156231 0 0 1 0.2666,-2.26946 c 2.1839,-1.7247 4.2112,-3.13138 6.1176,-4.20249 z"
       style="color:#000000;font-style:normal;font-variant:normal;font-weight:normal;font-stretch:normal;font-size:medium;line-height:normal;font-family:sans-serif;font-variant-ligatures:normal;font-variant-position:normal;font-variant-caps:normal;font-variant-numeric:normal;font-variant-alternates:normal;font-feature-settings:normal;text-indent:0;text-align:start;text-decoration:none;text-decoration-line:none;text-decoration-style:solid;text-decoration-color:#000000;letter-spacing:normal;word-spacing:normal;text-transform:none;writing-mode:lr-tb;direction:ltr;text-orientation:mixed;dominant-baseline:auto;baseline-shift:baseline;text-anchor:start;white-space:normal;shape-padding:0;clip-rule:nonzero;display:inline;overflow:visible;visibility:visible;opacity:1;isolation:auto;mix-blend-mode:normal;color-interpolation:sRGB;color-interpolation-filters:linearRGB;solid-color:#000000;solid-opacity:1;vector-effect:none;fill:#1e1e22;fill-opacity:1;fill-rule:nonzero;stroke:#0f0f10;stroke-width:1.61562;stroke-linecap:round;stroke-linejoin:round;stroke-miterlimit:4;stroke-dasharray:none;stroke-dashoffset:0;stroke-opacity:1;color-rendering:auto;image-rendering:auto;shape-rendering:auto;text-rendering:auto;enable-background:accumulate" />
    <ellipse
       ry="8.7571726"
       rx="8.8563089"
       cy="-447.79434"
       cx="-1792.7144"
       id="ellipse1788"
       style="display:inline;opacity:1;fill:#ffffff;fill-opacity:1;stroke:#000000;stroke-width:1.61562;stroke-linecap:round;stroke-linejoin:round;stroke-miterlimit:4;stroke-dasharray:none;stroke-opacity:1"
       transform="rotate(-31.620313)" />
    <path
       sodipodi:nodetypes="ssss"
       inkscape:connector-curvature="0"
       id="path1814"
       d="m -1763.881,554.29812 c 0.4566,1.03424 -0.5929,4.06648 -2.463,4.05756 -0.764,-0.004 -1.4971,-1.87073 -0.9516,-3.44641 0.4435,-1.28099 2.6254,-2.3982 3.4146,-0.61115 z"
       style="display:inline;opacity:1;fill:#000000;fill-opacity:1;stroke:none;stroke-width:0.856696;stroke-linecap:round;stroke-linejoin:round;stroke-miterlimit:4;stroke-dasharray:none;stroke-opacity:1" />
    <path
       sodipodi:nodetypes="ccssc"
       style="display:inline;opacity:1;fill:#1e1e22;fill-opacity:1;stroke:none;stroke-width:1.80772;stroke-linecap:round;stroke-linejoin:round;stroke-miterlimit:4;stroke-dasharray:none;stroke-opacity:1"
       d="m -1665.9668,599.71345 c -16.2519,-25.67502 -53.7394,-55.77506 -82.6443,-49.32878 -14.4863,6.06529 5.0832,29.29144 10.2146,36.13108 5.9964,7.99261 10.8401,8.69263 19.1927,10.13587 8.3525,1.44324 24.3951,21.15018 27.4635,24.79698"
       id="path1763-3"
       inkscape:connector-curvature="0" />
    <path
       sodipodi:nodetypes="cc"
       inkscape:connector-curvature="0"
       id="path1802-6"
       d="m -1665.9668,599.71345 c -18.085,-27.77235 -58.5437,-58.10758 -83.5497,-49.20127"
       style="display:inline;opacity:1;fill:none;fill-opacity:1;stroke:#0f0f10;stroke-width:1.61562;stroke-linecap:round;stroke-linejoin:round;stroke-miterlimit:4;stroke-dasharray:none;stroke-opacity:1" />
    <path
       sodipodi:nodetypes="ccc"
       inkscape:connector-curvature="0"
       id="path1145"
       d="m -1718.0453,588.49253 c -2.6853,6.11907 -1.5333,13.13128 -0.5544,15.57279 -1.5014,0.0582 -4.8947,0.25531 -4.8947,0.25531"
       style="display:inline;fill:#8aff8a;fill-opacity:1;stroke:#ff0f10;stroke-width:1.61562;stroke-linecap:round;stroke-linejoin:round;stroke-opacity:1" />
    <path
       sodipodi:nodetypes="ccc"
       inkscape:connector-curvature="0"
       id="path1147"
       d="m -1727.5614,585.2068 c -0.6376,4.82189 -1.0762,12.32591 0.2283,15.15513 -2.0411,0.0928 -5.7164,1.48862 -5.7164,1.48862"
       style="display:inline;fill:#8aff8a;fill-opacity:1;stroke:#ff0f10;stroke-width:1.61562;stroke-linecap:round;stroke-linejoin:round;stroke-opacity:1" />
    <path
       sodipodi:nodetypes="ccc"
       inkscape:connector-curvature="0"
       id="path1149"
       d="m -1708.0503,595.73339 c -2.4424,5.43455 -2.9458,11.54001 -2.1705,14.76091 -1.6691,-0.17958 -4.3464,-0.10075 -4.3464,-0.10075"
       style="display:inline;fill:#8aff8a;fill-opacity:1;stroke:#ff0f10;stroke-width:1.61562;stroke-linecap:round;stroke-linejoin:round;stroke-opacity:1" />
    <path
       sodipodi:nodetypes="cc"
       inkscape:connector-curvature="0"
       id="path1151"
       d="m -1696.1968,605.04434 c -3.5628,3.5913 -8.1055,13.72584 -7.5053,16.85622"
       style="display:inline;fill:#8aff8a;fill-opacity:1;stroke:#ff0f10;stroke-width:1.61562;stroke-linecap:round;stroke-linejoin:round;stroke-opacity:1" />
    <path
       sodipodi:nodetypes="cccc"
       style="display:inline;opacity:1;fill:#8a8a8a;fill-opacity:1;stroke:#0f0f10;stroke-width:1.61562;stroke-linecap:round;stroke-linejoin:round;stroke-miterlimit:4;stroke-dasharray:none;stroke-opacity:1"
       d="m -1684.6147,617.45741 c -13.7338,-17.35117 -37.5638,-36.11795 -46.0847,-31.53479 -8.7782,11.77096 -9.7744,11.65433 -6.3929,17.24207 12.5369,-6.77221 34.5567,19.86273 41.8514,28.57369"
       id="path1772-5-5"
       inkscape:connector-curvature="0" />
    <path
       sodipodi:nodetypes="ccc"
       inkscape:connector-curvature="0"
       id="path1747"
       d="m -1767.1697,615.63823 c -1.1107,-0.0517 -4.3866,-4.65544 -3.7221,-6.68287 1.089,1.29107 4.9988,4.33458 6.6483,3.26999"
       style="display:inline;opacity:1;fill:#ffffff;fill-opacity:1;stroke:#bcdeea;stroke-width:1.20514;stroke-linecap:round;stroke-linejoin:round;stroke-miterlimit:4;stroke-dasharray:none;stroke-opacity:1" />
    <path
       sodipodi:nodetypes="ccc"
       inkscape:connector-curvature="0"
       id="path1749"
       d="m -1762.9819,608.2585 c -0.7664,-0.11025 -1.7828,-2.24859 -1.6639,-3.25312 0.9764,0.6406 2.6843,1.02 2.9765,0.80127"
       style="display:inline;opacity:1;fill:#ffffff;fill-opacity:1;stroke:#bcdeea;stroke-width:1.20514;stroke-linecap:round;stroke-linejoin:round;stroke-miterlimit:4;stroke-dasharray:none;stroke-opacity:1" />
    <path
       sodipodi:nodetypes="ccccc"
       inkscape:connector-curvature="0"
       id="path1751"
       d="m -1765.4411,581.11064 c 6.8706,1.40085 12.0214,11.26931 11.4132,14.18602 6.6107,-2.94701 15.6136,-8.09828 15.6136,-8.09828 l -6.0896,-15.77509 z"
       style="display:inline;opacity:1;fill:#e84d66;stroke:#b53147;stroke-width:1.82331;stroke-linecap:round;stroke-linejoin:round;stroke-miterlimit:8;stroke-dasharray:none" />
    <path
       inkscape:transform-center-y="0.82632113"
       inkscape:transform-center-x="-2.0853357"
       sodipodi:nodetypes="csscsc"
       inkscape:connector-curvature="0"
       id="path1753"
       d="m -1741.5307,589.11145 c -5.2063,-1.0194 -11.0354,1.40354 -15.2604,6.90929 -4.0078,5.2229 -2.7,9.40839 -7.9254,15.56225 -5.1378,6.05057 -10.0695,4.96297 -13.7728,5.16504 5.4649,4.3019 11.2525,4.46271 16.8072,1.71078 5.611,-2.77971 22.4745,-12.39174 25.315,-19.7759"
       style="display:inline;opacity:1;fill:#e84d66;fill-opacity:1;stroke:#b53147;stroke-width:1.82331;stroke-linecap:round;stroke-linejoin:round;stroke-miterlimit:8;stroke-dasharray:none;stroke-opacity:1" />
    <path
       sodipodi:nodetypes="cccc"
       inkscape:connector-curvature="0"
       id="path1757"
       d="m -1759.0908,579.25277 c 4.6785,1.18073 10.3952,9.53258 11.5166,13.67168 4.6047,0.34798 9.4276,-11.61655 8.778,-13.74118 -0.6495,-2.12464 -15.2257,-5.24666 -20.2946,0.0695 z"
       style="display:inline;opacity:1;fill:#f797ab;fill-opacity:1;stroke:#de6881;stroke-width:1.80772;stroke-linecap:round;stroke-linejoin:round;stroke-miterlimit:4;stroke-dasharray:none;stroke-opacity:1" />
    <path
       sodipodi:nodetypes="ccc"
       inkscape:connector-curvature="0"
       id="path1774"
       d="m -1760.349,620.02074 c -2.4997,-1.23677 -4.1908,-6.98707 -3.5277,-8.25715 1.7275,1.90988 6.3228,6.34377 8.0526,5.88272"
       style="display:inline;opacity:1;fill:#ffffff;fill-opacity:1;stroke:#bcdeea;stroke-width:1.20514;stroke-linecap:round;stroke-linejoin:round;stroke-miterlimit:4;stroke-dasharray:none;stroke-opacity:1" />
    <path
       inkscape:connector-curvature="0"
       id="path1776"
       d="m -1753.9029,614.55487 c -0.9366,-0.37042 -2.6775,-3.12037 -2.1917,-4.02759 0.7221,0.65633 3.2021,2.02425 4.0233,1.76956"
       style="display:inline;opacity:1;fill:#ffffff;fill-opacity:1;stroke:#bcdeea;stroke-width:1.20514;stroke-linecap:round;stroke-linejoin:round;stroke-miterlimit:4;stroke-dasharray:none;stroke-opacity:1" />
    <path
       inkscape:connector-curvature="0"
       id="path1780"
       d="m -1751.268,608.85783 c -0.6527,-0.19232 -1.6452,-1.90017 -1.5708,-2.32327 0.8718,0.41415 2.2234,0.55135 2.3773,0.48298"
       style="display:inline;opacity:1;fill:#ffffff;fill-opacity:1;stroke:#bcdeea;stroke-width:1.20514;stroke-linecap:round;stroke-linejoin:round;stroke-miterlimit:4;stroke-dasharray:none;stroke-opacity:1" />
    <path
       sodipodi:nodetypes="csscssccc"
       inkscape:connector-curvature="0"
       id="path1778"
       d="m -1737.0974,580.52941 c -5.8593,3.49771 -10.1696,10.55814 -11.5942,15.04141 -1.7562,5.52666 -1.0716,13.50209 -4.7814,17.8168 -2.5367,2.95037 -7.158,6.78316 -13.4769,7.92961 1.1176,3.41121 7.7116,8.98039 15.4779,3.16241 7.9468,-5.95311 12.1976,-16.67834 15.1472,-20.01326 2.2445,-2.5378 14.2635,-9.28869 10.0064,-22.41872 -0.4091,-2.04108 -4.2429,-6.23553 -6.5913,-3.98667 -0.4314,1.37921 -3.2007,2.33421 -4.1877,2.46842 z"
       style="display:inline;opacity:1;fill:#1e1e22;fill-opacity:1;stroke:none;stroke-width:1.80772;stroke-linecap:round;stroke-linejoin:round;stroke-miterlimit:4;stroke-dasharray:none;stroke-opacity:1" />
    <path
       style="display:inline;opacity:1;fill:#0f0f10;fill-opacity:1;fill-rule:nonzero;stroke:none;stroke-width:6;stroke-linecap:round;stroke-linejoin:round;stroke-miterlimit:4;stroke-dasharray:none;stroke-opacity:1"
       d="m -1737.9865,580.20016 c 0.2922,-0.18845 0.9852,0.33899 0.9852,0.33899 0,0 0.1399,0.8579 -0.1094,1.01871 -5.4026,3.48447 -9.3845,10.08099 -10.7148,14.26733 -1.7223,5.42025 -1.6172,13.11107 -4.8785,18.01926 -3.4229,5.15144 -10.2838,8.56635 -14.071,8.79004 a 0.80781154,0.80781154 0 0 1 0.7213,-1.05392 c 1.3637,4.23654 7.9815,6.98242 14.1342,2.23749 8.1812,-6.30925 9.2283,-14.76571 14.5764,-20.27899 2.3815,-2.45504 11.5682,-8.18779 11.0313,-17.59725 -0.1006,-1.78403 0.09,-3.8844 0.09,-3.8844 0,0 0.3477,0.39999 0.7177,1.08662 0.3757,0.69706 0.7448,1.65194 0.8057,2.70571 0.5899,10.33578 -9.6683,16.94189 -11.4845,18.81421 -5.0905,5.24768 -6.3205,13.93316 -14.7494,20.43344 -6.8667,5.29549 -14.8882,2.47893 -16.6589,-3.02181 a 0.80781154,0.80781154 0 0 1 0.7214,-1.05395 c 3.2434,-0.19157 9.6297,-3.26899 12.8208,-8.07137 3.0369,-4.57061 2.8943,-11.98128 4.6842,-17.61437 1.4295,-4.4986 5.622,-11.42275 11.3788,-15.13577 z"
       id="path1782"
       inkscape:connector-curvature="0"
       sodipodi:nodetypes="csscssc" />
    <path
       inkscape:connector-curvature="0"
       id="path1759"
       d="m -1793.0159,584.04625 c 0.3127,1.39909 2.1533,3.94291 3.7637,3.88439 -0.7076,-1.59498 -1.4305,-3.839 -0.996,-4.38101"
       style="display:inline;opacity:1;fill:#ffffff;fill-opacity:1;stroke:#bcdeea;stroke-width:1.20514;stroke-linecap:round;stroke-linejoin:round;stroke-miterlimit:4;stroke-dasharray:none;stroke-opacity:1" />
    <path
       sodipodi:nodetypes="ccc"
       inkscape:connector-curvature="0"
       id="path1761"
       d="m -1783.3145,587.4713 c 0.2392,1.99309 2.423,5.09405 3.6659,5.15192 -0.8975,-2.08169 -0.9654,-4.50957 -0.6257,-4.93827"
       style="display:inline;opacity:1;fill:#ffffff;fill-opacity:1;stroke:#bcdeea;stroke-width:1.20514;stroke-linecap:round;stroke-linejoin:round;stroke-miterlimit:4;stroke-dasharray:none;stroke-opacity:1" />
    <path
       inkscape:connector-curvature="0"
       id="path1765"
       d="m -1774.3819,589.46841 c -1.3119,0.26442 -3.2089,-2.06025 -3.274,-2.79634 -0.064,-0.73606 2.4589,-2.05718 2.4073,-0.62835 -0.052,1.42884 0.2344,2.6498 0.8667,3.42469 z"
       style="display:inline;opacity:1;fill:#ffffff;fill-opacity:1;stroke:#bcdeea;stroke-width:1.20514;stroke-linecap:round;stroke-linejoin:round;stroke-miterlimit:4;stroke-dasharray:none;stroke-opacity:1" />
    <path
       inkscape:connector-curvature="0"
       id="path1769"
       d="m -1765.1994,584.71485 c -0.8636,-1.22447 -1.1613,-4.11461 -0.7817,-4.56783 -1.6169,-1.1998 -2.5505,-0.13108 -2.5225,1.60795 0.028,1.73903 2.4654,3.20195 3.3042,2.95992 z"
       style="display:inline;opacity:1;fill:#ffffff;fill-opacity:1;stroke:#bcdeea;stroke-width:1.20514;stroke-linecap:round;stroke-linejoin:round;stroke-miterlimit:4;stroke-dasharray:none;stroke-opacity:1" />
    <path
       style="display:inline;opacity:1;fill:#1e1e22;fill-opacity:1;stroke:none;stroke-width:1.80772;stroke-linecap:round;stroke-linejoin:round;stroke-miterlimit:4;stroke-dasharray:none;stroke-opacity:1"
       d="m -1793.0507,566.25946 c 1.9774,-1.25171 6.0189,-3.81393 8.2704,-4.2064 3.4222,-0.59656 6.1789,2.75478 13.1867,1.19088 3.3353,-0.74431 10.8096,-8.25416 18.3487,-12.1563 5.6352,-2.91665 16.7824,17.67325 16.903,29.6393 -4.696,1.43212 -14.0786,-2.31549 -20.9569,-1.53299 -11.9865,1.3636 -16.1029,8.02525 -23.3427,8.60722 -5.2455,0.42166 -6.1711,-4.20659 -9.4409,-4.16911 -3.2698,0.0375 -6.1178,2.2728 -8.5387,-1.80686 -1.1717,-4.57425 0.7964,-8.65362 3.3309,-12.12848 -0.2357,-0.68058 0.262,-2.18557 2.2395,-3.43726 z"
       id="path1784"
       inkscape:connector-curvature="0"
       sodipodi:nodetypes="ccccccscccc" />
    <path
       sodipodi:nodetypes="csssscc"
       inkscape:connector-curvature="0"
       id="path1786"
       d="m 222.97624,1341.9995 c -1.75369,0.926 -3.41958,1.7682 -5.12291,2.4164 -2.82394,1.0787 -5.59724,1.7382 -8.17448,2.0949 -1.69923,0.2278 -3.02789,0.3008 -4.30655,0.1894 -2.33641,-0.2226 -3.59891,-1.0948 -3.59891,-1.0948 0,0 0.62988,1.4792 3.10541,2.7266 1.26856,0.6524 2.82049,1.1792 4.69886,1.5118 2.8342,0.5179 6.21478,0.6314 9.80237,-0.1421 2.25573,-0.4957 4.4132,-1.3329 6.415,-2.4055 16.99523,-9.0446 36.35181,-33.3877 56.58617,-42.8791 39.98408,-18.7556 65.67237,-5.5235 90.66843,-18.2731 18.50069,-9.4365 13.17629,-26.4218 21.9172,-31.6663 8.52892,-5.1174 24.94093,-4.1088 24.61734,-23.9305 -0.1997,-14.1924 -16.48694,-27.7725 -34.85487,-35.0098 l -2.19953,5.5823 c 17.43289,6.8688 30.90526,18.8699 31.0551,29.5187 0.2514,15.4 -9.40573,11.3147 -21.705,18.6943 -12.08605,7.2515 -5.23795,23.143 -21.55646,31.4665 -23.06108,11.7626 -49.35159,-1.1113 -90.49026,18.1859 -21.3274,10.0041 -41.04187,34.5979 -56.85691,43.0144 z"
       style="display:inline;opacity:1;fill:#0f0f10;fill-opacity:1;fill-rule:nonzero;stroke:none;stroke-width:22.28242487;stroke-linecap:round;stroke-linejoin:round;stroke-miterlimit:4;stroke-dasharray:none;stroke-opacity:1"
       transform="matrix(-0.22929491,0.14117526,0.14117526,0.22929491,-1876.6103,241.03493)" />
    <path
       sodipodi:nodetypes="ssssss"
       inkscape:connector-curvature="0"
       id="path1792"
       d="m -1776.5041,572.90553 c -0.8706,-0.98048 -4.8023,-0.44593 -6.4596,1.80933 -1.6574,2.25528 -0.06,3.33726 0.9435,2.95887 1.3808,-0.52077 1.7282,-1.5041 2.588,-1.99753 0.8451,-0.48486 1.8326,-0.63907 2.9277,-1.41206 0.5967,-0.42118 0.3753,-0.93634 0,-1.35861 z"
       style="display:inline;opacity:1;fill:#0f0f10;fill-opacity:1;stroke:none;stroke-width:1.20514;stroke-linecap:round;stroke-linejoin:round;stroke-miterlimit:4;stroke-dasharray:none;stroke-opacity:1" />
    <path
       sodipodi:nodetypes="csc"
       inkscape:connector-curvature="0"
       id="path1794"
       d="m 359.51192,1230.886 c 3.42912,0.9397 6.76468,0.2531 9.11033,-0.8123 2.30494,-1.0468 3.45019,-2.2855 3.45019,-2.2855 0,0 -1.67439,-0.1986 -3.82045,-0.6843 -2.14777,-0.4861 -4.68216,-1.3201 -7.14776,-2.0027 -3.82544,-1.053 -7.66583,-3.0691 -12.06332,-3.4901 -5.71761,-0.5476 -23.83599,1.8575 -38.15604,8.3168 -3.60788,1.6066 -6.50144,4.1142 -8.44848,6.4804 -1.89215,2.2995 -2.64832,4.1432 -2.64832,4.1432 0,0 1.83239,-0.782 4.40238,-1.7162 2.11509,-0.7689 6.40846,-2.179 9.16145,-3.4381 13.697,-6.1782 30.96368,-8.2112 35.1171,-7.8135 3.62764,0.3474 6.80133,2.1348 11.04292,3.3023 z"
       style="display:inline;opacity:1;fill:#0f0f10;fill-opacity:1;fill-rule:nonzero;stroke:none;stroke-width:22.28242487;stroke-linecap:round;stroke-linejoin:round;stroke-miterlimit:4;stroke-dasharray:none;stroke-opacity:1"
       transform="matrix(-0.22929491,0.14117526,0.14117526,0.22929491,-1876.6103,241.03493)" />
    <path
       sodipodi:nodetypes="ccssc"
       inkscape:connector-curvature="0"
       id="path1800-2"
       d="m 381.72708,1207.078 c 0.433,2.3836 1.3964,4.6717 2.41862,6.5246 0.73112,1.3107 1.30512,2.2223 1.95225,3.0178 0.57591,0.708 0.99162,1.0435 0.99162,1.0435 0,0 0.41391,-1.9358 0.66029,-4.8082 0.20994,-2.0216 0.31054,-4.4867 -0.11952,-6.8508 -0.97511,-5.3643 -1.98494,-11.1965 -2.989,-13.022 a 3,3 0 0 0 -1.86955,-1.4566 c -8.08027,-2.1133 -29.88545,-7.2743 -46.66732,-0.5852 -12.94617,5.1603 -17.30667,21.2606 -42.02225,29.7901 -10.00557,3.4531 -51.57409,-4.3073 -84.01453,0.6808 -5.17343,0.7939 -9.24003,4.9518 -9.24003,4.9518 0,0 5.51912,1.6923 10.15189,0.9785 32.01294,-4.9224 73.32922,3.1091 85.06005,-0.9393 25.69746,-8.8685 31.26462,-25.495 42.28646,-29.8883 14.75498,-5.8813 35.05374,-1.2429 42.92757,0.8164 a 3,3 0 0 0 -1.86955,-1.4566 c 0.43108,0.7837 1.36737,5.8364 2.343,11.2035 z"
       style="display:inline;opacity:1;fill:#0f0f10;fill-opacity:1;fill-rule:nonzero;stroke:none;stroke-width:22.28242487;stroke-linecap:round;stroke-linejoin:round;stroke-miterlimit:4;stroke-dasharray:none;stroke-opacity:1"
       transform="matrix(-0.22929491,0.14117526,0.14117526,0.22929491,-1876.6103,241.03493)" />
    <path
       inkscape:connector-curvature="0"
       id="path1197"
       d="m -1769.4916,573.68829 c 3.0607,-1.97842 5.8435,-3.0051 8.5177,-3.00792 4.2788,-0.004 7.7056,2.89242 10.3435,7.59821 2.6562,4.7384 5.1696,12.36162 8.81,19.03555 3.6402,6.67397 8.2166,12.11222 14.6137,12.99916 6.3991,0.88723 12.4326,-3.10769 18.5735,-8.20422 6.1408,-5.09655 12.1522,-11.18037 19.0087,-13.42666 a 1.6156231,1.6156231 0 0 1 2.0385,1.03189 1.6156231,1.6156231 0 0 1 -1.0323,2.03881 c -5.69,1.86414 -11.6607,7.62207 -17.9514,12.84295 -6.2906,5.22086 -13.1377,10.0187 -21.0809,8.91741 -7.9453,-1.1016 -13.1762,-7.62902 -17.0069,-14.65208 -3.8307,-7.02308 -6.4514,-14.82822 -8.7916,-19.00295 -2.3586,-4.20737 -4.6401,-5.95016 -7.5211,-5.94714 -2.881,0.003 -6.9356,2.03178 -12.2113,6.75694 a 1.6156231,1.6156231 0 0 1 -2.2814,-0.1252 1.6156231,1.6156231 0 0 1 0.1257,-2.28162 c 2.0728,-1.85659 4.0092,-3.38605 5.8456,-4.57313 z"
       style="color:#000000;font-style:normal;font-variant:normal;font-weight:normal;font-stretch:normal;font-size:medium;line-height:normal;font-family:sans-serif;font-variant-ligatures:normal;font-variant-position:normal;font-variant-caps:normal;font-variant-numeric:normal;font-variant-alternates:normal;font-feature-settings:normal;text-indent:0;text-align:start;text-decoration:none;text-decoration-line:none;text-decoration-style:solid;text-decoration-color:#000000;letter-spacing:normal;word-spacing:normal;text-transform:none;writing-mode:lr-tb;direction:ltr;text-orientation:mixed;dominant-baseline:auto;baseline-shift:baseline;text-anchor:start;white-space:normal;shape-padding:0;clip-rule:nonzero;display:inline;overflow:visible;visibility:visible;opacity:1;isolation:auto;mix-blend-mode:normal;color-interpolation:sRGB;color-interpolation-filters:linearRGB;solid-color:#000000;solid-opacity:1;vector-effect:none;fill:#1e1e22;fill-opacity:1;fill-rule:nonzero;stroke:#0f0f10;stroke-width:1.61562;stroke-linecap:round;stroke-linejoin:round;stroke-miterlimit:4;stroke-dasharray:none;stroke-dashoffset:0;stroke-opacity:1;color-rendering:auto;image-rendering:auto;shape-rendering:auto;text-rendering:auto;enable-background:accumulate" />
    <path
       sodipodi:nodetypes="ccccccccccc"
       inkscape:connector-curvature="0"
       id="path1235"
       d="m -1745.7785,549.09146 c 0.2242,-6.15721 13.0112,-17.18818 13.3661,-23.44944 1.5257,5.40494 -1.5156,11.24198 -1.5156,11.24198 2.6759,-5.75969 12.4163,-19.27705 13.2087,-23.11063 2.4703,3.37212 -2.7721,12.88259 -2.7721,12.88259 5.6745,-4.94324 11.157,-16.56659 12.1869,-21.44327 4.8005,9.23486 -5.3694,24.13302 -4.3937,27.39799 1.2467,-1.35552 3.9916,-4.96214 4.6063,-7.36862 2.6891,6.13841 -8.0133,14.84994 -8.5585,17.03048 2.3011,-0.6534 5.106,-3.40507 6.329,-5.37776 0.6562,5.5148 -17.5861,19.66 -18.6792,22.65013 -5.4804,-6.21288 -16.0864,-6.54983 -16.0864,-6.54983 z"
       style="display:inline;fill:#121212;fill-opacity:1;stroke:#0b0b0b;stroke-width:1.61562;stroke-linecap:round;stroke-linejoin:round;stroke-miterlimit:4;stroke-dasharray:none;stroke-opacity:1" />
    <path
       sodipodi:nodetypes="cscc"
       inkscape:connector-curvature="0"
       id="path1238"
       d="m -1735.2723,559.3725 c -0.1247,-3.80778 6.0639,-13.2121 10.3415,-16.84361 3.7867,-3.21482 23.2088,-12.93297 24.3283,-19.9732 7.016,18.15515 -7.9122,40.66482 -24.5351,47.01488"
       style="fill:#1e1e22;fill-opacity:1;stroke:#0f0f10;stroke-width:1.61562;stroke-linecap:round;stroke-linejoin:round;stroke-miterlimit:4;stroke-dasharray:none;stroke-opacity:1" />
    <path
       sodipodi:nodetypes="cccc"
       inkscape:connector-curvature="0"
       id="path1240"
       d="m -1700.5579,522.67854 c 6.8985,18.13618 -7.9939,40.5563 -24.5795,46.89211 l -4.2999,-3.45454 c 8.768,-0.81316 24.0849,-14.5228 28.8794,-43.43757 z"
       style="fill:#f797ab;fill-opacity:1;stroke:#0f0f10;stroke-width:1.61562;stroke-linecap:round;stroke-linejoin:round;stroke-miterlimit:4;stroke-dasharray:none;stroke-opacity:1" />
    <ellipse
       ry="11.632169"
       rx="11.301707"
       cy="-440.75546"
       cx="-1783.5276"
       id="ellipse1810"
       style="display:inline;opacity:1;fill:#ffffff;fill-opacity:1;stroke:#000000;stroke-width:1.61562;stroke-linecap:round;stroke-linejoin:round;stroke-miterlimit:4;stroke-dasharray:none;stroke-opacity:1"
       transform="rotate(-31.620313)" />
    <path
       sodipodi:nodetypes="ssss"
       inkscape:connector-curvature="0"
       id="path1812"
       d="m -1747.7003,564.91282 c -0.8365,-1.35286 0.039,-5.78082 2.6469,-6.13003 1.0654,-0.1427 2.448,2.31703 1.9926,4.61801 -0.3702,1.87068 -3.1942,3.84935 -4.6395,1.51202 z"
       style="display:inline;opacity:1;fill:#000000;fill-opacity:1;stroke:none;stroke-width:1.20514;stroke-linecap:round;stroke-linejoin:round;stroke-miterlimit:4;stroke-dasharray:none;stroke-opacity:1" />
  </g>
</svg>
