<?xml version="1.0" encoding="UTF-8" standalone="no"?>
<svg
   xmlns:dc="http://purl.org/dc/elements/1.1/"
   xmlns:cc="http://creativecommons.org/ns#"
   xmlns:rdf="http://www.w3.org/1999/02/22-rdf-syntax-ns#"
   xmlns:svg="http://www.w3.org/2000/svg"
   xmlns="http://www.w3.org/2000/svg"
   xmlns:xlink="http://www.w3.org/1999/xlink"
   xmlns:sodipodi="http://sodipodi.sourceforge.net/DTD/sodipodi-0.dtd"
   xmlns:inkscape="http://www.inkscape.org/namespaces/inkscape"
   inkscape:export-ydpi="28.576742"
   inkscape:export-xdpi="28.576742"
   inkscape:export-filename="/home/melano/Pictures/Dragons/Glax/stickers/fire.png"
   sodipodi:docname="fire.svg"
   inkscape:version="1.0alpha2 (1:0.92.0+devel+201906271916+a9c687c)"
   id="svg4575"
   version="1.1"
   viewBox="0 0 512 512"
   height="512"
   width="512">
  <defs
     id="defs4569">
    <inkscape:path-effect
       effect="taper_stroke"
       id="path-effect983"
       is_visible="true"
       stroke_width="4.2333331"
       attach_start="1.1203845"
       end_offset="0"
       smoothing="0.5"
       jointype="extrapolated"
       miter_limit="100" />
    <linearGradient
       id="linearGradient4684"
       inkscape:collect="always">
      <stop
         id="stop4680"
         offset="0"
         style="stop-color:#ff5704;stop-opacity:1" />
      <stop
         id="stop4682"
         offset="1"
         style="stop-color:#b21d05;stop-opacity:1" />
    </linearGradient>
    <linearGradient
       id="linearGradient4647"
       inkscape:collect="always">
      <stop
         id="stop4643"
         offset="0"
         style="stop-color:#fffa48;stop-opacity:1;" />
      <stop
         id="stop4645"
         offset="1"
         style="stop-color:#ff5704;stop-opacity:1" />
    </linearGradient>
    <inkscape:path-effect
       miter_limit="100"
       jointype="round"
       smoothing="0.5"
       end_offset="0.35205677"
       attach_start="0"
       stroke_width="4.2333331"
       is_visible="true"
       id="path-effect4605"
       effect="taper_stroke" />
    <inkscape:path-effect
       miter_limit="100"
       jointype="extrapolated"
       smoothing="0.5"
       end_offset="0.41414315"
       attach_start="0.2"
       stroke_width="4.2333331"
       is_visible="true"
       id="path-effect4560"
       effect="taper_stroke" />
    <inkscape:path-effect
       miter_limit="100"
       jointype="extrapolated"
       smoothing="0.5"
       end_offset="0.35079978"
       attach_start="0.39467765"
       stroke_width="4.23"
       is_visible="true"
       id="path-effect4554"
       effect="taper_stroke" />
    <inkscape:path-effect
       miter_limit="100"
       jointype="round"
       smoothing="0.5"
       end_offset="0.30439911"
       attach_start="0.22213667"
       stroke_width="4.2333331"
       is_visible="true"
       id="path-effect4541"
       effect="taper_stroke" />
    <inkscape:path-effect
       miter_limit="100"
       jointype="extrapolated"
       smoothing="0.5"
       end_offset="0.29165503"
       attach_start="0.3005154"
       stroke_width="4.23"
       is_visible="true"
       id="path-effect4533"
       effect="taper_stroke" />
    <inkscape:path-effect
       miter_limit="100"
       jointype="extrapolated"
       smoothing="0.5"
       end_offset="0.44099265"
       attach_start="0.34955375"
       stroke_width="4.23"
       is_visible="true"
       id="path-effect4500"
       effect="taper_stroke" />
    <radialGradient
       r="109.16728"
       fy="37.305534"
       fx="448.72794"
       cy="37.305534"
       cx="448.72797"
       gradientTransform="matrix(0.66682699,2.9216102,-7.7185923,1.7616883,811.57947,-838.15744)"
       gradientUnits="userSpaceOnUse"
       id="radialGradient4717"
       xlink:href="#linearGradient4684"
       inkscape:collect="always" />
    <radialGradient
       r="120.6755"
       fy="216.60588"
       fx="105.33595"
       cy="229.88435"
       cx="117.56184"
       gradientTransform="matrix(5.5949283,-1.7658956,0.51327836,1.6259134,-55.736647,397.38961)"
       gradientUnits="userSpaceOnUse"
       id="radialGradient4719"
       xlink:href="#linearGradient4647"
       inkscape:collect="always" />
    <linearGradient
       gradientUnits="userSpaceOnUse"
       y2="371.32458"
       x2="349.12036"
       y1="402.87769"
       x1="207.43701"
       id="linearGradient919"
       xlink:href="#linearGradient4647"
       inkscape:collect="always" />
    <linearGradient
       gradientUnits="userSpaceOnUse"
       y2="332.92484"
       x2="453.47711"
       y1="380.73465"
       x1="292.81625"
       id="linearGradient925"
       xlink:href="#linearGradient4684"
       inkscape:collect="always" />
  </defs>
  <sodipodi:namedview
     inkscape:document-rotation="0"
     fit-margin-bottom="0"
     fit-margin-right="0"
     fit-margin-left="0"
     fit-margin-top="0"
     inkscape:object-paths="false"
     inkscape:snap-smooth-nodes="true"
     inkscape:snap-global="false"
     inkscape:window-maximized="1"
     inkscape:window-y="0"
     inkscape:window-x="30"
     inkscape:window-height="1411"
     inkscape:window-width="2408"
     inkscape:pagecheckerboard="true"
     units="px"
     showgrid="false"
     inkscape:current-layer="layer6"
     inkscape:document-units="px"
     inkscape:cy="440.05431"
     inkscape:cx="261.71775"
     inkscape:zoom="2.8284271"
     inkscape:pageshadow="2"
     inkscape:pageopacity="0.0"
     borderopacity="1.0"
     bordercolor="#666666"
     pagecolor="#ffffff"
     id="base"
     borderlayer="true" />
  <metadata
     id="metadata4572">
    <rdf:RDF>
      <cc:Work
         rdf:about="">
        <dc:format>image/svg+xml</dc:format>
        <dc:type
           rdf:resource="http://purl.org/dc/dcmitype/StillImage" />
        <dc:title />
      </cc:Work>
    </rdf:RDF>
  </metadata>
  <g
     transform="translate(73.705353,-49.803562)"
     style="opacity:1"
     inkscape:label="dragon"
     id="layer2"
     inkscape:groupmode="layer" />
  <g
     inkscape:groupmode="layer"
     id="layer3"
     inkscape:label="below"
     style="display:inline">
    <path
       clip-path="none"
       style="display:inline;opacity:1;fill:#ffffff;fill-opacity:1;stroke:#bcdeea;stroke-width:3.59047;stroke-linecap:round;stroke-linejoin:round;stroke-miterlimit:8;stroke-dasharray:none;stroke-opacity:1"
       d="m 262.97998,362.07648 c 3.84693,3.20577 1.49603,13.14367 0.42744,14.21226 -2.56462,-6.41155 -7.26643,-10.79277 -7.26643,-10.79277"
       id="path1000"
       inkscape:connector-curvature="0"
       sodipodi:nodetypes="ccc" />
    <path
       transform="translate(73.705353,-49.803562)"
       sodipodi:nodetypes="ccccsc"
       inkscape:connector-curvature="0"
       id="path4574"
       d="m 110.92733,444.18576 c 12.84533,-3.02243 40.23632,5.0885 48.32133,9.54659 8.08501,4.45808 12.24124,13.39259 22.81975,14.82826 10.57852,1.43564 16.33632,15.09176 16.70104,19.87554 -0.42743,8.12131 -18.45031,18.63408 -38.1124,13.29112 C 140.99497,496.38431 78.161793,479.928 82.436159,471.8067"
       style="opacity:1;fill:#e84d66;fill-opacity:1;stroke:#1d2848;stroke-width:4.78729;stroke-linecap:round;stroke-linejoin:round;stroke-miterlimit:8;stroke-dasharray:none;stroke-opacity:1"
       clip-path="none" />
    <path
       transform="translate(73.705353,-49.803562)"
       sodipodi:nodetypes="cc"
       inkscape:connector-curvature="0"
       id="path4572"
       d="m 197.40147,413.45427 c -2.33578,6.09831 -26.53938,-0.68724 -33.48522,2.73225 l -4.74314,-10.88866 40.80283,-2.26682 z"
       style="opacity:1;fill:#e84d66;fill-opacity:1;stroke:#1d2848;stroke-width:4.78729;stroke-linecap:round;stroke-linejoin:round;stroke-miterlimit:8;stroke-dasharray:none;stroke-opacity:1"
       clip-path="none" />
    <path
       transform="translate(73.705353,-49.803562)"
       sodipodi:nodetypes="ccsc"
       inkscape:connector-curvature="0"
       id="path4570"
       d="m 146.11404,422.66167 c -8.00945,7.7072 -11.72488,12.40716 -2.20423,26.76371 -51.583324,39.16953 -68.526355,2.07809 -64.251989,-9.4627 4.274366,-11.54079 44.453409,-24.36388 66.456219,-17.30101 z"
       style="opacity:1;fill:#f797ab;fill-opacity:1;stroke:#de6881;stroke-width:4.78729;stroke-linecap:round;stroke-linejoin:round;stroke-miterlimit:8;stroke-dasharray:none;stroke-opacity:1"
       clip-path="none" />
    <path
       sodipodi:nodetypes="ccccccc"
       inkscape:connector-curvature="0"
       id="path4580"
       d="m 96.157087,449.58001 c 10.802213,-24.4593 32.762423,-25.67952 52.745453,-28.21082 l -24.48742,-11.38655 -55.890214,24.78727 1.360095,27.9575 27.025984,1.96126 z"
       style="opacity:1;fill:#e84d66;fill-opacity:1;stroke:#b53147;stroke-width:4.78729;stroke-linecap:round;stroke-linejoin:round;stroke-miterlimit:8;stroke-dasharray:none;stroke-opacity:1"
       clip-path="none"
       transform="translate(73.705353,-49.803562)" />
    <path
       transform="translate(73.705353,-49.803562)"
       sodipodi:nodetypes="csscsc"
       inkscape:connector-curvature="0"
       id="path4566"
       d="m 77.306919,461.97567 c 12.395659,-5.87725 27.873661,-21.24769 49.921551,-21.57351 21.69241,-0.32057 32.13394,12.57469 51.16719,12.06304 19.8758,-0.53429 45.62886,-18.27292 53.10901,-12.50252 -7.69387,5.34295 -21.58556,13.35739 -30.02743,23.29529 -9.83257,11.57505 -19.55522,20.9444 -34.83608,18.70036"
       style="opacity:1;fill:#e84d66;fill-opacity:1;stroke:none;stroke-width:4.78729;stroke-linecap:round;stroke-linejoin:round;stroke-miterlimit:8;stroke-dasharray:none;stroke-opacity:1"
       clip-path="none" />
    <path
       style="opacity:1;fill:none;fill-opacity:1;fill-rule:nonzero;stroke:#b53147;stroke-width:3.74347737;stroke-linecap:round;stroke-linejoin:round;stroke-miterlimit:8;stroke-dasharray:none;stroke-opacity:1"
       d="m 62.177083,209.87648 c 10.961308,-5.19717 24.648287,-18.78903 44.144927,-19.07715 19.1823,-0.28348 28.4156,11.11962 45.24644,10.66718 17.57589,-0.47247 40.34896,-16.15849 46.96355,-11.05581 -6.80358,4.7247 -19.08781,11.81176 -26.55283,20.5997 -8.69481,10.23566 -17.29241,18.52084 -30.80506,16.53647"
       id="path4599"
       inkscape:connector-curvature="0"
       sodipodi:nodetypes="csscsc"
       transform="matrix(1.1308558,0,0,1.1308558,80.698958,174.83208)"
       clip-path="none" />
    <path
       transform="translate(73.705353,-49.803562)"
       style="opacity:1;fill:#3250b0;fill-opacity:1;fill-rule:nonzero;stroke:none;stroke-width:1.26664;stroke-linecap:round;stroke-linejoin:round;stroke-miterlimit:8;stroke-dasharray:none;stroke-opacity:1"
       d="m 164.31124,370.23764 c 8.16056,-3.02243 16.01007,-7.2957 22.81937,-6.80047 8.31169,0.60449 15.79643,4.34106 18.43684,9.52066 3.23038,6.33691 1.20896,19.94806 -3.17356,26.14404"
       id="path4588"
       inkscape:connector-curvature="0"
       sodipodi:nodetypes="cssc"
       clip-path="none" />
    <path
       inkscape:original-d="m 139.11379,128.75382 c 7.21627,-2.67269 14.15748,-6.45148 20.17885,-6.01356 7.34991,0.53454 13.96856,3.83874 16.30344,8.41899 2.85658,5.60364 1.06907,17.63979 -2.80633,23.11881"
       inkscape:path-effect="#path-effect4560"
       sodipodi:nodetypes="cssc"
       inkscape:connector-curvature="0"
       id="path4558"
       d="m 142.6026,125.10153 c -2.08739,0.8552 -3.48881,3.65229 -3.48881,3.65229 0,0 2.91138,1.15997 5.09438,0.26476 5.67744,-2.32714 10.51222,-4.48859 14.93094,-4.16723 6.87943,0.50032 12.71582,3.62959 14.57119,7.26922 1.35752,2.66298 1.51719,7.63178 0.5616,12.49047 -0.48449,2.33773 -0.6287,4.70201 -0.89147,6.52862 -0.26131,1.81643 -0.59068,3.1384 -0.59068,3.1384 0,0 1.18408,-0.67652 2.50502,-2.24908 1.36424,-1.62413 2.63293,-3.93851 3.13089,-6.601 1.04523,-5.31447 1.04578,-11.32716 -0.9438,-15.23004 -2.81439,-5.52088 -10.2153,-9.00001 -18.03569,-9.56877 -5.21547,-0.37931 -11.19228,2.15595 -16.84357,4.47236 z"
       style="opacity:1;fill:#1d2848;fill-opacity:1;fill-rule:nonzero;stroke:none;stroke-width:4.23333;stroke-linecap:round;stroke-linejoin:round;stroke-miterlimit:8;stroke-dasharray:none;stroke-opacity:1"
       transform="matrix(1.1308558,0,0,1.1308558,80.698958,174.83208)"
       clip-path="none" />
    <path
       clip-path="none"
       style="opacity:1;fill:#ffffff;fill-opacity:1;stroke:#bcdeea;stroke-width:3.175;stroke-linecap:round;stroke-linejoin:round;stroke-miterlimit:8;stroke-dasharray:none;stroke-opacity:1"
       d="m 142.35047,236.01387 c 2.07746,-1.7338 4.89652,-7.3273 5.46974,-10.3588 1.79892,3.93884 2.19026,9.39194 0.97504,11.32413"
       id="path4838"
       inkscape:connector-curvature="0"
       sodipodi:nodetypes="ccc"
       transform="matrix(1.1308558,0,0,1.1308558,80.698958,174.83208)" />
    <path
       clip-path="none"
       sodipodi:nodetypes="ccc"
       inkscape:connector-curvature="0"
       id="path4840"
       d="m 129.92244,237.48385 c 2.07746,-1.7338 4.89652,-7.3273 5.46974,-10.3588 1.79892,3.93884 2.19026,9.39194 0.97504,11.32413"
       style="opacity:1;fill:#ffffff;fill-opacity:1;stroke:#bcdeea;stroke-width:3.175;stroke-linecap:round;stroke-linejoin:round;stroke-miterlimit:8;stroke-dasharray:none;stroke-opacity:1"
       transform="matrix(1.1308558,0,0,1.1308558,80.698958,174.83208)" />
    <path
       style="display:inline;opacity:1;fill:#3250b0;fill-opacity:1;stroke:none;stroke-width:4.78729;stroke-linecap:round;stroke-linejoin:round;stroke-miterlimit:8;stroke-dasharray:none;stroke-opacity:1"
       d="m 79.197407,360.85541 c -12.702914,0.11199 -19.505799,11.45374 -27.564898,14.22746 -8.066604,2.77629 -26.686319,9.95402 -39.081978,23.63198 l -1.282728,20.08944 17.583004,1.79815 20.381044,42.49947 c 1.360095,3.02243 3.653934,4.71969 7.632079,3.70267 13.464634,-3.44228 24.082962,-33.29182 47.45214,-38.38539 24.56552,-5.35433 44.73196,-2.11466 58.17712,-5.76823 13.90318,-3.77804 21.31271,-15.08652 29.17104,-14.17979 1.97351,0.22772 3.31705,0.65565 4.22394,1.16877 l 0.6586,5.09643 c 17.82695,-9.22258 18.78914,-26.40412 14.00773,-32.10674 -10.4659,-12.48234 -22.80848,-14.08974 -33.09552,-15.56571 -13.8142,-1.98204 -43.74865,13.26518 -74.51856,6.30728 -4.98885,-4.43845 -8.498359,-11.00708 -21.121457,-12.38255 -0.901429,-0.0982 -1.774696,-0.14071 -2.621556,-0.13324 z"
       id="path977"
       inkscape:connector-curvature="0"
       sodipodi:nodetypes="ccccccssssccssccc"
       transform="translate(73.705353,-49.803562)"
       clip-path="none" />
    <path
       style="display:inline;opacity:1;fill:none;fill-opacity:1;stroke:#1d2848;stroke-width:4.78729;stroke-linecap:round;stroke-linejoin:round;stroke-miterlimit:8;stroke-dasharray:none;stroke-opacity:1"
       d="m 12.55028,398.71505 c 12.395659,-13.67796 31.01569,-20.85567 39.082292,-23.63197 8.596373,-2.95863 15.763298,-15.66626 30.186134,-14.09468 12.623098,1.37547 16.132584,7.94425 21.121444,12.3827 30.76991,6.9579 60.91819,-8.76992 74.73239,-6.78788 10.28704,1.47597 22.41601,3.56405 32.88191,16.04639 4.78141,5.70262 3.8191,22.88439 -14.00785,32.10698"
       id="path979"
       inkscape:connector-curvature="0"
       sodipodi:nodetypes="csscssc"
       transform="translate(73.705353,-49.803562)"
       clip-path="none" />
    <path
       transform="matrix(1.1308558,0,0,1.1308558,80.698958,174.83208)"
       style="display:inline;opacity:1;fill:#1d2848;fill-opacity:1;fill-rule:nonzero;stroke:none;stroke-width:4.23333;stroke-linecap:round;stroke-linejoin:round;stroke-miterlimit:8;stroke-dasharray:none;stroke-opacity:1"
       d="m 47.121794,210.38579 c -1.206158,0.81043 -2.298323,1.5327 -3.467239,2.02034 -1.268757,0.4802 -2.31236,0.79016 -3.302875,0.53357 -1.957168,-0.36296 -3.000764,-2.06732 -3.000764,-2.06732 0,0 -0.266996,1.99217 2.011463,3.88577 1.307972,0.98534 3.22007,1.47676 5.18201,1.1286 1.788176,-0.26876 3.499151,-0.98307 4.971777,-2.00981 10.752411,-7.37445 19.713935,-27.36267 37.049234,-31.61809 28.34843,-6.9589 38.56232,-1.61702 51.0139,-4.33269 15.8201,-3.45033 19.84665,-13.91 25.47976,-13.26002 2.90355,0.33502 3.42228,1.18904 3.42228,1.18904 0,0 0.0405,0.10306 0.0194,0.14384 l 3.75816,1.94868 c 0.49419,-0.95308 0.484,-2.13335 0.43756,-2.53742 -0.27484,-2.39114 -2.41178,-4.40261 -7.15214,-4.94958 -8.22134,-0.94861 -12.03416,10.09433 -26.86708,13.32936 -11.62352,2.53507 -22.41643,-2.68883 -51.121045,4.35751 -18.799987,4.61497 -28.911528,25.70706 -38.434381,32.23822 z"
       id="path981"
       inkscape:connector-curvature="0"
       sodipodi:nodetypes="cssssc"
       inkscape:path-effect="#path-effect983"
       inkscape:original-d="m 37.350916,210.87238 c 1.202713,2.6727 3.230738,4.1734 6.748556,3.27406 11.906588,-3.04396 21.420928,-28.90103 41.961315,-33.94323 28.526523,-7.00262 39.029923,-1.71973 51.067473,-4.3451 15.3182,-3.34087 19.22441,-14.0965 26.17342,-13.29469 6.94901,0.80181 5.07812,4.40994 5.07812,4.40994"
       clip-path="none" />
  </g>
  <g
     inkscape:groupmode="layer"
     id="layer4"
     inkscape:label="fire full"
     style="display:none;opacity:1">
    <path
       clip-path="none"
       transform="matrix(0.2992056,0,0,0.2992056,-2.651167,231.15272)"
       sodipodi:nodetypes="scccccccccssscsccscs"
       inkscape:connector-curvature="0"
       id="path4657"
       d="m 1018.0039,745.38672 c 36.3655,23.23351 135.8292,46.48843 194.959,4.04101 -52.528,0 -68.6916,-26.26336 -109.0977,-47.47656 118.0095,-57.78535 217.7846,78.22092 343.4532,31.31445 -58.589,-17.17258 -100.5474,-106.68757 -164.6563,-132.33007 97.6418,-115.54965 370.0331,-24.84517 437.3965,-78.79297 -48.4873,0 -193.9492,-89.90233 -301.0254,-79.80078 C 1600.6736,347.67971 1599.1964,207.83281 1718.0391,83.736328 1609.6533,99.082964 1529.029,240.9143 1379.6367,271.625 c 53.5381,-37.37563 38.2284,-106.39023 58.6972,-167.56337 -60.639,80.34408 -86.822,87.9374 -169.7828,124.94539 -32.9665,14.70604 -104.8673,30.30275 -139.9573,43.61407 -38.0731,14.44297 -103.519,28.80363 -145.94536,59.61329 -42.42641,30.80965 -64.68068,105.02103 -87.79083,101.8919 -43.07191,-5.19768 -289.50104,10.51604 -310.57245,27.65888 -21.07143,17.14287 -46.786,171.78709 -7.85743,191.78711 38.92857,19.99997 245.35857,94.28517 274.28711,86.78515 28.92858,-7.49998 36.07032,-17.50113 36.07032,-21.42969 0,-3.92859 5.95581,-19.60458 5.95581,-19.60458 43.43754,-4.54571 88.89747,22.83006 125.26293,46.06357 z"
       style="opacity:0.730031;fill:url(#radialGradient4717);fill-opacity:1;stroke:none;stroke-width:12;stroke-linecap:round;stroke-linejoin:round;stroke-miterlimit:8;stroke-dasharray:none;stroke-opacity:1" />
    <path
       sodipodi:nodetypes="csscssscsssc"
       inkscape:connector-curvature="0"
       clip-path="none"
       id="path4641"
       d="m 1434.1855,269.60547 c -14.142,23.23351 -77.853,96.86341 -137.3808,112.12695 -78.7919,20.20305 -162.6341,-35.35575 -307.08595,1.00977 -55.36184,13.93727 -57.48551,51.38409 -94.86114,51.38409 -49.00714,-0.72601 -236.89696,-0.94191 -275.90644,27.62372 -50.34525,36.86653 -154.58736,128.32101 -52.98828,182.55273 38.73787,20.67757 75.01182,52.69171 192.96463,55.41996 49.87993,1.15374 99.36785,5.97032 133.81345,-0.39954 40.15128,-1.39075 103.15745,-68.65471 138.39383,-83.23526 58.5888,-24.24367 121.019,-100.03347 162.6347,-122.22851 45.4569,-24.24371 100.0049,-24.24426 158.5938,-64.6504 40.9078,-28.21228 90.9137,-107.07556 81.8222,-159.60351 z"
       style="opacity:0.556176;fill:url(#radialGradient4719);fill-opacity:1;stroke:none;stroke-width:12;stroke-linecap:round;stroke-linejoin:round;stroke-miterlimit:8;stroke-dasharray:none;stroke-opacity:1"
       transform="matrix(0.2992056,0,0,0.2992056,-2.651167,231.15272)" />
  </g>
  <g
     inkscape:groupmode="layer"
     id="layer1"
     inkscape:label="fire b"
     style="display:inline" />
  <g
     inkscape:groupmode="layer"
     id="layer6"
     inkscape:label="fire"
     style="display:inline">
    <path
       d="M 511.39648 256.20703 C 478.96684 260.79883 454.84354 303.23502 410.14453 312.42383 C 426.16343 301.24083 421.58265 280.59241 427.70703 262.28906 C 409.5635 286.32846 401.72858 288.60083 376.90625 299.67383 C 367.04248 304.07396 345.53037 308.73984 335.03125 312.72266 C 323.63956 317.04407 304.05748 321.34016 291.36328 330.55859 C 278.66906 339.77701 271.91469 361.93625 265 361 C 252.11264 359.44483 178.47461 364.19303 172.16992 369.32227 C 165.86524 374.45151 158.17071 420.72097 169.81836 426.70508 C 181.466 432.68919 243.23114 454.91592 251.88672 452.67188 C 260.54231 450.42784 262.67969 447.43522 262.67969 446.25977 C 262.67969 445.08432 265 440 265 440 C 277.99676 438.6399 291.06066 447.22418 301.94141 454.17578 C 312.82217 461.12738 342.58147 468.08528 360.27344 455.38477 C 344.55676 455.38477 339.72059 447.5268 327.63086 441.17969 C 362.93997 423.88999 392.79378 464.58546 430.39453 450.55078 C 412.86438 445.41265 400.31065 418.62746 381.12891 410.95508 C 410.34388 376.38198 491.84449 403.52235 512 387.38086 C 497.49233 387.38086 453.96944 360.48147 421.93164 363.50391 C 476.27947 335.18049 475.83808 293.33739 511.39648 256.20703 z "
       style="display:inline;opacity:0.730031;fill:url(#linearGradient925);fill-opacity:1;stroke:none;stroke-width:3.59047;stroke-linecap:round;stroke-linejoin:round;stroke-miterlimit:8;stroke-dasharray:none;stroke-opacity:1"
       clip-path="none"
       id="path963" />
    <path
       sodipodi:nodetypes="ccsscccscssscc"
       inkscape:connector-curvature="0"
       d="m 305.92434,429.98344 c 7.78991,-3.22341 15.64728,-7.94341 23.06653,-12.77611 9.27672,-6.04262 21.82258,-15.57944 28.74104,-19.26928 13.60096,-7.25385 26.36039,-17.40695 43.89052,-29.49669 12.23984,-8.44127 28.81247,-18.47184 36.14804,-32.28343 -7.60376,2.90033 -31.60827,10.42 -49.41932,14.98694 -13.49214,3.45951 -31.15499,2.6433 -48.73793,4.71904 -13.13995,1.55124 -26.70666,5.04711 -46.08079,4.30119 C 276.46365,359.50795 276.183,361 265,361 c -14.66321,-0.21723 -70.78566,-0.23609 -82.45751,8.31091 -15.06358,11.03067 -46.2534,38.39436 -15.85439,54.62079 11.59059,6.18685 23.95042,23.26201 59.24256,24.07832 14.92435,0.3452 29.46132,-0.68688 39.06934,-8.01002 12.01349,-0.41612 30.38143,-5.65396 40.92434,-10.01656 z"
       style="display:inline;opacity:0.598961;fill:url(#linearGradient919);fill-opacity:1;stroke:none;stroke-width:3.59047;stroke-linecap:round;stroke-linejoin:round;stroke-miterlimit:8;stroke-dasharray:none;stroke-opacity:1"
       clip-path="none"
       id="path965" />
  </g>
  <g
     inkscape:groupmode="layer"
     id="layer5"
     inkscape:label="above"
     style="display:inline">
    <path
       sodipodi:nodetypes="ccc"
       inkscape:connector-curvature="0"
       id="path992"
       d="m 247.35305,367.38519 c 3.84693,3.20577 1.49603,13.14367 0.42744,14.21226 -2.56462,-6.41155 -7.26643,-10.79277 -7.26643,-10.79277"
       style="opacity:1;fill:#ffffff;fill-opacity:1;stroke:#bcdeea;stroke-width:3.59047;stroke-linecap:round;stroke-linejoin:round;stroke-miterlimit:8;stroke-dasharray:none;stroke-opacity:1"
       clip-path="none" />
    <path
       transform="translate(73.705353,-49.803562)"
       sodipodi:nodetypes="ccc"
       inkscape:connector-curvature="0"
       id="path4618"
       d="M 25.128203,380.66503 C -0.5624774,385.04756 -55.117389,412.85395 -63.731326,432.802 -45.143361,423.7347 13.642957,403.33329 28.604,403.18216"
       style="opacity:1;fill:#3a3c3f;fill-opacity:1;stroke:#292929;stroke-width:4.78729;stroke-linecap:round;stroke-linejoin:round;stroke-miterlimit:8;stroke-dasharray:none;stroke-opacity:1"
       clip-path="none" />
    <path
       transform="translate(73.705353,-49.803562)"
       sodipodi:nodetypes="ccc"
       inkscape:connector-curvature="0"
       id="path4616"
       d="m 52.63234,375.98026 c -9.459377,-1.09059 -25.564847,-0.22638 -28.410868,2.72019 -2.417946,6.9516 -6.951595,25.0862 -6.951595,25.0862"
       style="opacity:1;fill:#3250b0;fill-opacity:1;stroke:#1d2848;stroke-width:4.78729;stroke-linecap:round;stroke-linejoin:round;stroke-miterlimit:8;stroke-dasharray:none;stroke-opacity:1"
       clip-path="none" />
    <path
       transform="translate(73.705353,-49.803562)"
       style="opacity:1;fill:#3250b0;fill-opacity:1;stroke:none;stroke-width:4.78729;stroke-linecap:round;stroke-linejoin:round;stroke-miterlimit:8;stroke-dasharray:none;stroke-opacity:1"
       d="m -25.49755,564.58008 c 6.34711,-48.96341 -1.360094,-129.81349 36.118074,-160.34007 l 51.38136,3.92917 26.59741,75.25857 -29.015356,89.16177"
       id="path4614"
       inkscape:connector-curvature="0"
       sodipodi:nodetypes="cc"
       clip-path="none" />
    <path
       transform="translate(73.705353,-49.803562)"
       inkscape:connector-curvature="0"
       id="path4576"
       d="m 103.59427,427.35331 c -13.03682,16.02886 -15.815156,26.50106 -5.55668,37.18697 -9.83104,7.48015 -41.247627,-4.7018 -41.247627,-4.7018 0,0 19.662083,-36.54583 46.804307,-32.48517 z"
       style="opacity:1;fill:#f797ab;fill-opacity:1;stroke:#de6881;stroke-width:4.78729;stroke-linecap:round;stroke-linejoin:round;stroke-miterlimit:8;stroke-dasharray:none;stroke-opacity:1"
       clip-path="none" />
    <path
       clip-path="none"
       style="opacity:1;fill:#ffffff;fill-opacity:1;stroke:#bcdeea;stroke-width:3.175;stroke-linecap:round;stroke-linejoin:round;stroke-miterlimit:8;stroke-dasharray:none;stroke-opacity:1"
       d="m 134.93751,171.51186 c 3.40179,2.83482 1.32292,11.62276 0.37798,12.5677 -2.26786,-5.66964 -6.4256,-9.54389 -6.4256,-9.54389"
       id="path4815"
       inkscape:connector-curvature="0"
       sodipodi:nodetypes="ccc"
       transform="matrix(1.1308558,0,0,1.1308558,80.698958,174.83208)" />
    <path
       clip-path="none"
       sodipodi:nodetypes="ccc"
       inkscape:connector-curvature="0"
       id="path4817"
       d="m 121.61385,170.56692 c 3.40179,2.83482 1.32292,11.62276 0.37798,12.5677 -2.26786,-5.66964 -6.4256,-9.54389 -6.4256,-9.54389"
       style="opacity:1;fill:#ffffff;fill-opacity:1;stroke:#bcdeea;stroke-width:3.175;stroke-linecap:round;stroke-linejoin:round;stroke-miterlimit:8;stroke-dasharray:none;stroke-opacity:1"
       transform="matrix(1.1308558,0,0,1.1308558,80.698958,174.83208)" />
    <path
       transform="translate(73.705353,-49.803562)"
       sodipodi:nodetypes="ccccccsssccccc"
       inkscape:connector-curvature="0"
       id="path4592"
       d="m 79.197407,360.85541 c -12.702914,0.11199 -19.505799,11.45374 -27.564898,14.22746 -8.066604,2.77629 -26.686319,9.95402 -39.081978,23.63198 l -1.282728,20.08944 17.583004,1.79815 20.381044,42.49947 c 1.360095,3.02243 3.653934,4.71969 7.632079,3.70267 13.464634,-3.44228 24.082962,-33.29182 47.45214,-38.38539 24.56552,-5.35433 44.73196,-2.11466 58.17712,-5.76823 13.90318,-3.77804 21.31271,-15.08652 29.17104,-14.17979 -2.62914,-4.73211 -10.96629,-28.9026 -14.20525,-41.40725 -13.8142,-1.98204 -43.74865,13.26518 -74.51856,6.30728 -4.98885,-4.43845 -8.498359,-11.00708 -21.121457,-12.38255 -0.901429,-0.0982 -1.774696,-0.14071 -2.621556,-0.13324 z"
       style="opacity:1;fill:#3250b0;fill-opacity:1;stroke:none;stroke-width:4.78729;stroke-linecap:round;stroke-linejoin:round;stroke-miterlimit:8;stroke-dasharray:none;stroke-opacity:1"
       clip-path="none" />
    <path
       transform="translate(73.705353,-49.803562)"
       sodipodi:nodetypes="scsccsccsscss"
       inkscape:connector-curvature="0"
       id="path4586"
       d="m 52.195273,374.88534 c -3.650659,1.57259 -12.466309,5.41852 -20.320269,9.58218 -18.864772,12.79695 -38.1968554,34.68004 -46.794464,65.09171 -12.525083,44.30402 -11.334235,100.10963 -10.625133,119.7488 3.102954,3.79841 11.686235,7.48486 15.7565134,0.28379 3.9036384,-58.36425 7.9419985,-93.89538 20.4357506,-117.54345 12.870136,-24.36048 16.538997,-47.76616 28.616893,-58.19503 l 8.54898,-0.48153 c 0,0 44.774301,-9.25234 53.322966,-9.14005 4.97762,0.0654 12.65112,-2.13708 13.84144,-8.38991 0.17985,-0.94476 -12.23856,-2.55948 -12.23856,-2.55948 0,0 -11.609344,-4.40613 -23.336097,-3.96766 -12.214221,0.45669 -20.262178,2.57858 -27.20802,5.57063 z"
       style="opacity:1;fill:#292f75;fill-opacity:1;stroke:none;stroke-width:4.78729;stroke-linecap:round;stroke-linejoin:round;stroke-miterlimit:8;stroke-dasharray:none;stroke-opacity:1"
       clip-path="none" />
    <path
       transform="translate(73.705353,-49.803562)"
       sodipodi:nodetypes="cccc"
       inkscape:connector-curvature="0"
       id="path4607"
       d="m 37.822421,573.49624 c 2.720189,-21.76152 22.668245,-67.70249 39.291627,-65.88903 5.742623,-0.90673 32.340032,-7.55608 39.291622,-6.04486 -20.250295,5.44038 -38.98938,47.75443 -37.478161,71.93389"
       style="opacity:1;fill:#c4d9f5;fill-opacity:1;stroke:#1d2848;stroke-width:4.78729;stroke-linecap:round;stroke-linejoin:round;stroke-miterlimit:8;stroke-dasharray:none;stroke-opacity:1"
       clip-path="none" />
    <path
       transform="translate(73.705353,-49.803562)"
       style="opacity:1;fill:#c4d9f5;fill-opacity:1;stroke:none;stroke-width:4.78729;stroke-linecap:round;stroke-linejoin:round;stroke-miterlimit:8;stroke-dasharray:none;stroke-opacity:1"
       d="m 67.504951,459.4942 c 8.082403,-1.75623 40.889269,-2.43211 53.430879,3.45839 13.94944,6.55174 28.28729,32.04254 56.60496,28.62305 12.37193,-1.49397 17.69023,-0.76713 19.43965,-2.7687 5.45018,10.27581 -7.45926,27.87764 -22.43171,29.80407 -23.1126,2.97378 -27.03535,-10.25848 -46.26999,-12.39567 -19.23466,-2.13718 -34.667821,8.18137 -58.238243,5.98412 -25.218758,-2.3509 -38.683008,-12.60938 -36.332107,-31.41659 -0.801489,-15.00098 9.403034,-21.15676 15.523461,-17.68096 1.548997,2.83353 5.339325,9.9369 18.2731,-3.60771 z"
       id="path4603"
       inkscape:connector-curvature="0"
       sodipodi:nodetypes="csscsssccc"
       clip-path="none" />
    <path
       transform="translate(73.705353,-49.803562)"
       sodipodi:nodetypes="cc"
       inkscape:connector-curvature="0"
       id="path4612"
       d="m -25.49755,564.58008 c 6.34711,-48.96341 -1.360094,-129.81349 36.118074,-160.34007"
       style="opacity:1;fill:none;fill-opacity:1;stroke:#1d2848;stroke-width:4.78729;stroke-linecap:round;stroke-linejoin:round;stroke-miterlimit:8;stroke-dasharray:none;stroke-opacity:1"
       clip-path="none" />
    <path
       inkscape:original-d="m 53.509339,207.68215 c 7.147157,-1.55301 36.157812,-2.15068 47.248181,3.05821 12.3353,5.79361 24.8672,23.98178 50.05498,25.31096 8.81301,0.46507 15.31349,-2.12597 18.7722,-2.77622 1.73716,4.42131 -1.00732,23.8484 -21.41804,26.68322 -20.41071,2.83482 -23.90698,-9.07143 -40.91591,-10.96131 -17.008936,-1.88988 -30.656267,7.23467 -51.499263,5.29167 -22.300596,-2.07887 -34.206844,-11.1503 -32.127975,-27.78125"
       inkscape:path-effect="#path-effect4605"
       sodipodi:nodetypes="csscsssc"
       inkscape:connector-curvature="0"
       id="path4564"
       d="m 53.958785,209.75055 c 6.752937,-1.46735 35.311782,-2.06684 45.898894,2.90568 11.683041,5.48726 25.044351,24.14738 50.843281,25.50882 9.04693,0.47741 16.08119,-2.20931 19.27483,-2.80973 a 2.1166666,2.1166666 0 0 0 -2.36115,-1.30617 c 1.04041,2.64797 -0.17815,21.09582 -19.73917,23.81263 -19.68226,2.73364 -22.56119,-8.9874 -40.39097,-10.96849 -17.442291,-1.93803 -31.040954,7.19848 -51.536548,5.28786 -14.147447,-1.31883 -23.455037,-5.44967 -27.696759,-12.04028 -1.909578,-2.88506 -3.035264,-5.99685 -3.745798,-8.8777 -0.679333,-2.75435 -0.881883,-4.75574 -0.881883,-4.75574 0,0 -0.873375,1.81294 -1.241001,4.86965 -0.372531,3.09749 -0.07685,7.26542 2.308898,11.05487 5.248296,8.15459 16.11202,12.58911 30.863613,13.96426 21.190398,1.97538 34.886397,-7.13721 51.461978,-5.29548 16.18808,1.79867 20.30169,13.89013 41.44085,10.95413 21.25542,-2.95214 25.52672,-23.36959 23.09691,-29.55381 a 2.1166666,2.1166666 0 0 0 -2.36115,-1.30617 c -3.72378,0.70008 -9.69048,3.19544 -18.26957,2.74271 -24.57663,-1.29692 -36.27912,-19.01314 -49.26668,-25.1131 -11.593623,-5.44526 -41.056079,-4.84941 -48.597462,-3.21074 z"
       style="opacity:1;fill:#1d2848;fill-opacity:1;fill-rule:nonzero;stroke:none;stroke-width:4.23333;stroke-linecap:round;stroke-linejoin:round;stroke-miterlimit:8;stroke-dasharray:none;stroke-opacity:1"
       transform="matrix(1.1308558,0,0,1.1308558,80.698958,174.83208)"
       clip-path="none" />
    <path
       transform="translate(73.705353,-49.803562)"
       style="display:inline;opacity:1;fill:#ffffff;fill-opacity:1;stroke:none;stroke-width:3.59047;stroke-linecap:round;stroke-linejoin:round;stroke-miterlimit:8;stroke-dasharray:none;stroke-opacity:1"
       d="m 51.767585,400.15765 c -1.602886,1.87003 0.374002,19.28808 1.709746,21.26496 2.244041,2.99205 17.253237,4.08644 23.135002,-0.16027 6.620828,-4.78032 14.479413,-10.41877 19.394933,-12.02166 0.37401,-5.71696 -4.808659,-15.12057 -6.999273,-17.68519"
       id="path4543"
       inkscape:connector-curvature="0"
       sodipodi:nodetypes="ccscc"
       clip-path="none" />
    <path
       transform="translate(73.705353,-49.803562)"
       sodipodi:nodetypes="ccccc"
       inkscape:connector-curvature="0"
       id="path4545"
       d="m 87.74113,391.84832 -20.576527,4.78793 c -2.758732,7.93159 4.80336,23.19162 10.60632,23.89039 3.510858,-2.11253 10.309054,-8.21489 15.241838,-10.23838 1.148699,-6.42025 -1.751163,-13.49237 -5.271631,-18.43994 z"
       style="opacity:1;fill:#f01d0a;fill-opacity:1;stroke:none;stroke-width:4.78729;stroke-linecap:round;stroke-linejoin:round;stroke-miterlimit:8;stroke-dasharray:none;stroke-opacity:1"
       clip-path="none" />
    <path
       transform="translate(73.705353,-49.803562)"
       inkscape:connector-curvature="0"
       id="path4498"
       d="m 83.184172,393.05152 c 3.740069,2.8852 6.411548,13.57111 3.740069,20.30324 -1.282311,1.49602 -2.564619,1.49602 -4.488082,1.49602 -5.877255,-2.03033 -11.754508,-12.39566 -9.189889,-18.05919 5.342957,-1.70975 9.937902,-3.74007 9.937902,-3.74007 z"
       style="display:inline;opacity:1;fill:#000000;fill-opacity:1;stroke:none;stroke-width:4.78729;stroke-linecap:round;stroke-linejoin:round;stroke-miterlimit:8;stroke-dasharray:none;stroke-opacity:1"
       clip-path="none" />
    <ellipse
       transform="rotate(-10.831651,-225.80629,-413.61639)"
       ry="4.6469908"
       rx="3.1735544"
       cy="408.09268"
       cx="8.3658772"
       id="path4550"
       style="opacity:1;fill:#ffffff;fill-opacity:1;stroke:none;stroke-width:4.78729;stroke-linecap:round;stroke-linejoin:round;stroke-miterlimit:8;stroke-dasharray:none;stroke-opacity:1"
       clip-path="none" />
    <path
       transform="translate(73.705353,-49.803562)"
       sodipodi:nodetypes="ccscc"
       inkscape:connector-curvature="0"
       id="path4496"
       d="m 51.767585,400.15765 c -1.602886,1.87003 0.374002,19.28808 1.709746,21.26496 2.244041,2.99205 17.253237,4.08644 23.135002,-0.16027 6.620828,-4.78032 14.479413,-10.41877 19.394933,-12.02166 0.37401,-5.71696 -4.808659,-15.12057 -6.999273,-17.68519"
       style="display:inline;opacity:1;fill:none;fill-opacity:1;stroke:#1d2848;stroke-width:3.59047;stroke-linecap:round;stroke-linejoin:round;stroke-miterlimit:8;stroke-dasharray:none;stroke-opacity:1"
       clip-path="none" />
    <path
       sodipodi:nodetypes="csc"
       inkscape:original-d="m 34.263647,158.29185 c 5.86314,-3.94836 11.062656,-6.78811 20.1257,-6.01831 8.033662,0.68237 20.10335,-5.39297 22.446707,-8.65267"
       inkscape:path-effect="#path-effect4500"
       inkscape:connector-curvature="0"
       id="path4494"
       d="m 39.44421,152.75916 c -3.50191,1.69637 -5.180563,5.53269 -5.180563,5.53269 0,0 4.11158,-0.33114 7.016532,-1.7219 3.53012,-1.70075 7.445766,-2.65483 12.930167,-2.189 5.007758,0.42535 11.156652,-1.46445 15.93198,-3.71229 1.864146,-0.87453 3.440963,-2.17941 4.606672,-3.4987 0.824248,-0.91816 1.364485,-1.71891 1.707677,-2.44956 0.317093,-0.67509 0.379379,-1.09953 0.379379,-1.09953 0,0 -0.365869,0.23046 -0.98565,0.49198 -0.621186,0.26211 -1.51256,0.5092 -2.569717,0.88754 -1.416069,0.4672 -3.345742,1.08791 -4.939896,1.84108 -4.443162,2.09149 -9.798449,3.6622 -13.772444,3.32466 -6.305644,-0.53559 -10.910879,0.56316 -15.124137,2.59303 z"
       style="opacity:1;fill:#1d2848;fill-opacity:1;fill-rule:nonzero;stroke:none;stroke-width:5.29167;stroke-linecap:round;stroke-linejoin:round;stroke-miterlimit:8;stroke-dasharray:none;stroke-opacity:1"
       transform="matrix(1.1308558,0,0,1.1308558,80.698958,174.83208)"
       clip-path="none" />
    <path
       transform="translate(73.705353,-49.803562)"
       sodipodi:nodetypes="sssss"
       inkscape:connector-curvature="0"
       id="path4527"
       d="m 29.132926,448.59422 c 2.122276,3.61361 -0.755612,9.59621 -3.173556,11.18298 -2.417948,1.58679 -4.835892,-0.30223 -4.987014,-2.8713 -0.15112,-2.56906 0.215124,-6.75911 2.795752,-8.61394 2.417944,-1.73789 4.661312,-0.8956 5.364818,0.30226 z"
       style="opacity:1;fill:#1d2848;fill-opacity:1;stroke:none;stroke-width:3.59047;stroke-linecap:round;stroke-linejoin:round;stroke-miterlimit:8;stroke-dasharray:none;stroke-opacity:1"
       clip-path="none" />
    <path
       transform="translate(73.705353,-49.803562)"
       sodipodi:nodetypes="csscc"
       inkscape:connector-curvature="0"
       id="path4578"
       d="m 12.55028,398.71505 c 12.395659,-13.67796 31.01569,-20.85567 39.082292,-23.63197 8.596373,-2.95863 15.763298,-15.66626 30.186134,-14.09468 12.623098,1.37547 16.132584,7.94425 21.121444,12.3827 30.76991,6.9579 60.91819,-8.76992 74.73239,-6.78788"
       style="opacity:1;fill:none;fill-opacity:1;stroke:#1d2848;stroke-width:4.78729;stroke-linecap:round;stroke-linejoin:round;stroke-miterlimit:8;stroke-dasharray:none;stroke-opacity:1"
       clip-path="none" />
    <path
       transform="translate(73.705353,-49.803562)"
       inkscape:connector-curvature="0"
       id="path4537"
       d="m 9.109308,403.03104 c -17.8323538,3.02243 -79.641108,37.93153 -82.814661,53.64818 12.391973,-6.3471 68.9114702,-24.02834 86.44158,-21.00591"
       style="opacity:1;fill:#3a3c3f;fill-opacity:1;stroke:#292929;stroke-width:4.78729;stroke-linecap:round;stroke-linejoin:round;stroke-miterlimit:8;stroke-dasharray:none;stroke-opacity:1"
       clip-path="none" />
    <path
       transform="translate(73.705353,-49.803562)"
       sodipodi:nodetypes="cccc"
       style="opacity:1;fill:#3250b0;fill-opacity:1;stroke:none;stroke-width:4.78729;stroke-linecap:round;stroke-linejoin:round;stroke-miterlimit:8;stroke-dasharray:none;stroke-opacity:1"
       d="m 43.105926,389.92013 c -5.742622,0.45337 -31.578672,5.4037 -36.1123211,7.36829 -4.3825277,12.69422 -8.7650555,41.55844 -8.3116904,44.73201 5.4403791,0.7556 22.3660035,-3.92917 26.4462885,-5.89375"
       id="path4539"
       inkscape:connector-curvature="0"
       clip-path="none" />
    <path
       sodipodi:nodetypes="cccc"
       inkscape:original-d="M 31.612152,146.18308 C 23.563592,146.37626 3.9917839,150.94064 0,152.67445 c -3.8754081,11.22532 -7.7508163,36.74955 -7.3499119,39.55589 4.8108514,0.66817 19.5106759,-2.40543 24.3215279,-4.27631"
       inkscape:path-effect="#path-effect4541"
       inkscape:connector-curvature="0"
       id="path4535"
       d="m 25.154655,148.97308 c 1.643377,-0.24429 3.247654,-0.99828 4.421498,-1.618 1.192283,-0.62946 2.035999,-1.172 2.035999,-1.172 0,0 -0.859542,-0.51678 -2.212754,-0.93653 -1.369038,-0.42465 -3.152583,-0.72178 -4.874526,-0.4597 -9.2898,1.39757 -21.8454295,4.41609 -25.36812708,5.94616 a 2.1166666,2.1166666 0 0 0 -1.15753102,1.25069 c -3.8980263,11.29084 -7.9109454,37.28099 -7.4445189,40.54598 a 2.1166666,2.1166666 0 0 0 1.8042084,1.7972 c 3.8535259,0.53521 12.1982477,-0.90384 18.5191816,-2.41052 1.699151,-0.40051 3.258137,-1.336 4.383813,-2.25016 1.110369,-0.90173 1.709718,-1.71217 1.709718,-1.71217 0,0 -0.992982,-0.17345 -2.336962,-0.30848 -1.319894,-0.13261 -3.104238,-0.24098 -4.7381398,0.15285 -6.1979901,1.47737 -14.1159023,2.72975 -16.9552414,2.3354 a 2.1166666,2.1166666 0 0 0 1.8042084,1.7972 c -0.3353823,-2.34769 3.402515,-27.406 7.2553049,-38.5658 a 2.1166666,2.1166666 0 0 0 -1.15753102,1.25069 C 3.5306821,153.44862 16.03923,150.34441 25.154655,148.97308 Z"
       style="opacity:1;fill:#1d2848;fill-opacity:1;fill-rule:nonzero;stroke:none;stroke-width:4.23333;stroke-linecap:round;stroke-linejoin:round;stroke-miterlimit:8;stroke-dasharray:none;stroke-opacity:1"
       transform="matrix(1.1308558,0,0,1.1308558,80.698958,174.83208)"
       clip-path="none" />
    <path
       transform="translate(73.705353,-49.803562)"
       style="opacity:1;fill:#3250b0;fill-opacity:1;fill-rule:nonzero;stroke:none;stroke-width:1.26564;stroke-linecap:round;stroke-linejoin:round;stroke-miterlimit:8;stroke-dasharray:none;stroke-opacity:1"
       d="m 34.990699,399.14249 c 6.09097,-2.99206 14.639703,-19.34151 31.09601,-22.44042 16.456307,-3.09892 32.378321,6.62527 36.438961,7.69386"
       id="path4582"
       inkscape:connector-curvature="0"
       sodipodi:nodetypes="csc"
       clip-path="none" />
    <path
       sodipodi:nodetypes="csc"
       inkscape:original-d="m 24.75744,154.31398 c 5.38616,-2.64584 12.945685,-17.10343 27.497768,-19.84375 14.552083,-2.74033 28.631697,5.85863 32.222468,6.80357"
       inkscape:path-effect="#path-effect4554"
       inkscape:connector-curvature="0"
       id="path4552"
       d="m 30.909983,145.65487 c -1.818921,1.85973 -3.257349,4.62853 -4.147557,6.0248 -1.020375,1.60043 -2.004986,2.63431 -2.004986,2.63431 0,0 1.433212,-0.0628 3.391361,-1.05414 2.106836,-1.06661 4.059526,-2.74718 5.834714,-4.69872 4.694258,-4.96445 10.534581,-10.48173 18.663093,-12.01242 8.859531,-1.66836 17.624455,1.14976 23.811022,3.68221 1.54265,0.63103 3.25473,0.95176 4.713883,1.09081 1.913871,0.17236 3.306163,-0.0479 3.306163,-0.0479 0,0 -0.847725,-0.98775 -2.300805,-2.25025 -1.077798,-0.96723 -2.491186,-2.04147 -4.116766,-2.70735 -6.430145,-2.63216 -16.161397,-5.81413 -26.196296,-3.92444 -9.488891,1.78687 -16.141612,8.17391 -20.953826,13.26311 z"
       style="opacity:1;fill:#1d2848;fill-opacity:1;fill-rule:nonzero;stroke:none;stroke-width:4.23333;stroke-linecap:round;stroke-linejoin:round;stroke-miterlimit:8;stroke-dasharray:none;stroke-opacity:1"
       transform="matrix(1.1308558,0,0,1.1308558,80.698958,174.83208)"
       clip-path="none" />
    <path
       transform="translate(73.705353,-49.803562)"
       sodipodi:nodetypes="ssssss"
       inkscape:connector-curvature="0"
       id="path4529"
       d="m 150.1058,392.83033 c 2.55751,1.89981 6.02382,1.3776 8.08502,2.04014 2.1157,0.68004 4.30696,3.4758 8.61392,2.49351 4.30697,-0.98229 1.61687,-7.86526 -3.17354,-9.29398 -3.91023,-1.16621 -10.50297,-0.52894 -13.14759,0.68004 -2.11701,0.96778 -1.19386,3.47409 -0.37781,4.08029 z"
       style="opacity:1;fill:#1d2848;fill-opacity:1;stroke:none;stroke-width:3.59047;stroke-linecap:round;stroke-linejoin:round;stroke-miterlimit:8;stroke-dasharray:none;stroke-opacity:1"
       clip-path="none" />
    <path
       inkscape:original-d="m 114.25772,146.05952 c 6.34765,-1.06907 10.61239,-10.54889 20.84703,-11.62622 11.42577,-1.20271 20.37929,14.09847 22.18336,18.04069"
       inkscape:path-effect="#path-effect4533"
       sodipodi:nodetypes="csc"
       inkscape:connector-curvature="0"
       id="path4531"
       d="m 118.32258,141.61447 c -1.08139,0.80807 -1.99195,2.12405 -2.65872,2.93678 -0.71749,0.87457 -1.40614,1.50827 -1.40614,1.50827 0,0 0.83314,0.43033 2.22655,0.42541 1.42785,-0.005 3.16597,-0.47466 4.46245,-1.55281 4.29415,-3.39653 7.96947,-7.72071 14.37944,-8.39544 6.87133,-0.7233 13.12316,5.87931 16.92628,11.47016 0.87223,1.28878 2.17938,2.37153 3.18963,3.14474 1.02978,0.78814 1.84604,1.32241 1.84604,1.32241 0,0 0.15254,-0.9631 0.0109,-2.33362 -0.14336,-1.38722 -0.5825,-3.09856 -1.54906,-4.51268 -4.09714,-6.02307 -11.55116,-14.27834 -20.86661,-13.29777 -7.90798,0.83242 -12.70872,6.23771 -16.56076,9.28455 z"
       style="opacity:1;fill:#1d2848;fill-opacity:1;fill-rule:nonzero;stroke:none;stroke-width:3.175;stroke-linecap:round;stroke-linejoin:round;stroke-miterlimit:8;stroke-dasharray:none;stroke-opacity:1"
       transform="matrix(1.1308558,0,0,1.1308558,80.698958,174.83208)"
       clip-path="none" />
    <path
       sodipodi:nodetypes="csssc"
       inkscape:connector-curvature="0"
       id="path4556"
       d="m 47.121794,210.38579 c -1.206158,0.81043 -2.298323,1.5327 -3.467239,2.02034 -1.268757,0.4802 -2.31236,0.79016 -3.302875,0.53357 -1.957168,-0.36296 -3.000764,-2.06732 -3.000764,-2.06732 0,0 -0.266996,1.99217 2.011463,3.88577 1.307972,0.98534 3.22007,1.47676 5.18201,1.1286 1.788176,-0.26876 3.499151,-0.98307 4.971777,-2.00981 10.752411,-7.37445 19.713935,-27.36267 37.049234,-31.61809 28.34843,-6.9589 38.56232,-1.61702 51.0139,-4.33269 15.82009,-3.45033 19.84665,-13.91 25.47976,-13.26002 l 0.48524,-4.20544 c -8.22134,-0.94861 -12.03416,10.09433 -26.86708,13.32936 -11.62352,2.53507 -22.41643,-2.68883 -51.121045,4.35751 -18.799987,4.61497 -28.911528,25.70706 -38.434381,32.23822 z"
       style="opacity:1;fill:#1d2848;fill-opacity:1;fill-rule:nonzero;stroke:none;stroke-width:3.74348;stroke-linecap:round;stroke-linejoin:round;stroke-miterlimit:8;stroke-dasharray:none;stroke-opacity:1"
       transform="matrix(1.1308558,0,0,1.1308558,80.698958,174.83208)"
       clip-path="none" />
  </g>
</svg>
