<?xml version="1.0" encoding="UTF-8" standalone="no"?>
<svg
   xmlns:dc="http://purl.org/dc/elements/1.1/"
   xmlns:cc="http://creativecommons.org/ns#"
   xmlns:rdf="http://www.w3.org/1999/02/22-rdf-syntax-ns#"
   xmlns:svg="http://www.w3.org/2000/svg"
   xmlns="http://www.w3.org/2000/svg"
   version="1.1"
   id="svg2"
   viewBox="0 0 32 32"
   height="32"
   width="32">
  <defs
     id="defs4" />
  <metadata
     id="metadata7">
    <rdf:RDF>
      <cc:Work
         rdf:about="">
        <dc:format>image/svg+xml</dc:format>
        <dc:type
           rdf:resource="http://purl.org/dc/dcmitype/StillImage" />
        <dc:title></dc:title>
      </cc:Work>
    </rdf:RDF>
  </metadata>
  <g
     transform="translate(0,-1020.3622)"
     id="layer1">
    <rect
       y="1020.3622"
       x="0"
       height="31.999983"
       width="31.999983"
       id="rect4139"
       style="opacity:1;fill:#edbbf3;fill-opacity:1;stroke:none;stroke-width:6;stroke-linecap:round;stroke-linejoin:miter;stroke-miterlimit:6;stroke-dasharray:none;stroke-opacity:1" />
    <path
       id="path4203"
       d="m 14.196422,1022.8216 c -1.17633,1.941 -1.098922,2.725 -0.495288,3.4703 1.050861,1.2975 7.975006,1.6424 8.344901,4.9325 0.181922,1.6181 -0.768919,3.3466 -3.73465,4.4535 2.238132,-1.8274 1.933689,-3.2947 -2.152073,-4.6382 -4.085759,-1.3437 -6.9041445,-5.7638 -1.962901,-8.2181 z"
       style="opacity:1;fill:#9be9d8;fill-opacity:1;stroke:none;stroke-width:4;stroke-linecap:round;stroke-linejoin:miter;stroke-miterlimit:6;stroke-dasharray:none;stroke-opacity:1" />
    <path
       id="path4201"
       d="m 14.196422,1022.8216 c -2.837619,-0.035 -4.4487973,3.2757 -4.086192,5.1844 0.818889,4.3106 7.634364,3.7606 8.68423,5.6608 0.647184,1.1714 -0.483064,2.0111 -0.483064,2.0111 2.083376,-0.4426 2.782736,-3.0916 1.137509,-4.4278 -1.478731,-1.201 -6.485154,-1.6242 -7.472241,-3.8898 -0.911576,-2.0923 2.219758,-4.5387 2.219758,-4.5387 z"
       style="opacity:1;fill:#08bab7;fill-opacity:1;stroke:none;stroke-width:4;stroke-linecap:round;stroke-linejoin:miter;stroke-miterlimit:6;stroke-dasharray:none;stroke-opacity:1" />
    <path
       id="path4207"
       d="m 14.369924,1041.8198 c -1.764046,1.5783 -5.2366895,-1.1572 -4.270845,-3.7138 0.789176,-2.0889 3.163715,-2.3634 4.224423,-3.3888 0.50596,-0.4891 0.214436,-1.5179 -0.139268,-2.089 0,0 3.017444,1.4391 2.181842,3.1103 -0.835598,1.6712 -4.5958,3.0174 -4.085156,4.503 0.510645,1.4854 2.089004,1.5783 2.089004,1.5783 z"
       style="opacity:1;fill:#9be9d8;fill-opacity:1;stroke:none;stroke-width:4;stroke-linecap:round;stroke-linejoin:miter;stroke-miterlimit:6;stroke-dasharray:none;stroke-opacity:1" />
    <path
       id="path4205"
       d="m 13.441477,1039.6843 c -0.29897,0.8109 0.12647,1.5868 0.928447,2.1355 -2.831757,0.6499 -3.451956,-1.9403 -2.924602,-3.2032 0.82711,-1.9807 3.34953,-1.7614 4.038733,-3.6673 0.242612,-0.6709 -0.417811,-1.7176 -1.299821,-2.3211 1.782178,0.4455 2.612802,1.6646 2.562582,2.7163 -0.09083,1.902 -2.625049,2.4949 -3.305339,4.3398 z"
       style="opacity:1;fill:#08bab7;fill-opacity:1;stroke:none;stroke-width:4;stroke-linecap:round;stroke-linejoin:miter;stroke-miterlimit:6;stroke-dasharray:none;stroke-opacity:1" />
    <path
       id="path4211"
       d="m 16.226808,1043.3981 -1.916906,-3.8225 3.448839,2.337 3.379345,-2.3752 -1.800989,4 1.734882,3.9201 -3.359661,-2.9204 -3.37065,2.9294 z"
       style="opacity:1;fill:#fffff0;fill-opacity:1;stroke:none;stroke-width:4;stroke-linecap:round;stroke-linejoin:miter;stroke-miterlimit:6;stroke-dasharray:none;stroke-opacity:1" />
    <path
       id="path4263"
       d="m 17.908804,1037.2407 c -0.291561,1.775 -2.152431,5.6226 -4.104924,6.0769 1.739206,0.7708 3.613049,4.324 4.09151,6.5464 0.500742,-2.2416 1.688096,-5.7024 3.447599,-6.4257 -1.860407,-0.624 -3.306578,-4.3677 -3.434185,-6.1976 z"
       style="opacity:1;fill:#b765b8;fill-opacity:1;stroke:none;stroke-width:4;stroke-linecap:round;stroke-linejoin:miter;stroke-miterlimit:6;stroke-dasharray:none;stroke-opacity:1" />
  </g>
</svg>
