<?xml version="1.0" encoding="UTF-8" standalone="no"?>
<svg
   xmlns:dc="http://purl.org/dc/elements/1.1/"
   xmlns:cc="http://creativecommons.org/ns#"
   xmlns:rdf="http://www.w3.org/1999/02/22-rdf-syntax-ns#"
   xmlns:svg="http://www.w3.org/2000/svg"
   xmlns="http://www.w3.org/2000/svg"
   version="1.1"
   id="svg2"
   viewBox="0 0 32 32"
   height="32"
   width="32">
  <defs
     id="defs4" />
  <metadata
     id="metadata7">
    <rdf:RDF>
      <cc:Work
         rdf:about="">
        <dc:format>image/svg+xml</dc:format>
        <dc:type
           rdf:resource="http://purl.org/dc/dcmitype/StillImage" />
        <dc:title></dc:title>
      </cc:Work>
    </rdf:RDF>
  </metadata>
  <g
     transform="translate(0,-1020.3622)"
     id="layer1">
    <rect
       y="1020.3622"
       x="0"
       height="32"
       width="32"
       id="rect4171"
       style="opacity:1;fill:#9dd9f8;fill-opacity:1;stroke:none;stroke-width:6;stroke-linecap:round;stroke-linejoin:miter;stroke-miterlimit:6;stroke-dasharray:none;stroke-opacity:1" />
    <path
       id="path5410"
       d="m 21.072524,1031.0189 c 0,0 -4.754194,2.5102 -5.400763,4.3739 0.190169,-0.2282 1.217073,-0.9508 2.282011,-1.1029 -3.118749,3.2327 -4.069589,12.3988 -4.259755,17.0009 l -0.494436,-4.9064 1.369209,-9.5843 -3.156788,0.7225 6.351605,-9.0899"
       style="display:inline;fill:#0193cf;stroke:none" />
    <path
       id="path5431"
       d="m 16.166641,1024.6863 c -2.101539,0.46 -7.9866609,11.3319 -7.1936881,16.2581 1.0565011,-0.8533 2.6328841,-1.7775 3.9395411,-2.3001 -1.129539,2.8507 -0.401802,10.2798 0.781523,12.6465 l 0.01184,-0.8806 -0.316114,-7.4107 1.217073,-6.2755 -2.510211,0.4944 5.628964,-9.5084"
       style="display:inline;fill:#f13e32;stroke:none" />
    <path
       d="m 17.995417,1030.0113 c -2.50112,0.9413 -4.410579,6.1856 -4.518154,6.6966 0.860601,-0.5379 2.20529,-0.9681 2.393547,-0.9681 -1.210221,1.3984 -2.528016,9.7354 -2.164949,14.6704 -1.65397,-4.666 -0.282384,-12.2769 0.443746,-13.3527 -1.452264,0.5648 -2.608696,1.0758 -3.738233,1.6136 0.322726,-3.0389 5.244284,-11.8063 7.47647,-12.4518"
       style="display:inline;fill:#f5eb7e;stroke:none"
       id="path5435" />
    <path
       style="display:inline;fill:#ffffff;stroke:none"
       d="m 21.384034,1028.5591 c 0.995069,1.1833 -1.189375,2.7094 -2.429668,0.8925 -0.783593,-1.148 0.0054,-2.8669 1.380808,-3.5819 -1.647045,-0.4958 -0.609521,-2.7101 1.317795,-2.9045 1.91733,-0.1934 4.372525,2.7003 1.687777,5.2318 2.178414,1.2332 2.216728,6.2421 -1.01543,6.9511 -3.356161,0.7362 -4.073454,-2.9414 -3.334829,-4.6527 -0.766605,0.9107 -2.770541,1.5353 -3.317325,1.0139 -0.564068,-0.5378 -0.620081,-2.0735 1.434761,-3.5688 -3.0974,-1.2809 -1.944231,-4.1954 -0.86848,-5.0022 1.075751,-0.8069 3.229167,-1.1801 4.257095,0.4303"
       id="path5438" />
    <path
       id="path5408"
       d="m 21.384034,1028.5591 c 0.225691,0.3186 0.227186,0.6269 0.122287,0.8665 -0.05492,0.1254 -0.140576,0.237 -0.246385,0.3294 -0.0867,0.097 -0.195162,0.1818 -0.319409,0.2477 -0.508553,0.2698 -1.288549,0.2254 -1.874252,-0.6275 -0.36194,-0.5252 -0.371005,-1.1928 -0.113762,-1.8289 0.257181,-0.6359 0.775625,-1.2246 1.437155,-1.5718 0.109613,-0.058 0.222697,-0.1081 0.338598,-0.1516 -0.12169,-0.01 -0.242045,-0.032 -0.359037,-0.066 -0.342896,-0.1019 -0.548572,-0.2788 -0.653085,-0.4846 -0.01238,-0.025 -0.02329,-0.052 -0.03278,-0.078 -0.08735,-0.2447 -0.05589,-0.54 0.0845,-0.8368 0.281909,-0.5962 0.986503,-1.1611 1.899784,-1.2463 0.540751,-0.05 1.138967,0.1661 1.63695,0.5712 0.315575,0.2519 0.588482,0.5763 0.779245,0.9481 0.451539,0.8802 0.452376,2.0415 -0.570138,3.1787 -0.08508,0.093 -0.177134,0.1859 -0.276521,0.2785 -0.05276,0.049 -0.106525,0.097 -0.161257,0.144 0.06516,0.029 0.128738,0.061 0.190452,0.097 1.009737,0.5846 1.544286,2.0777 1.415304,3.5314 -0.107798,1.215 -0.675088,2.333 -1.73102,2.8301 -0.201288,0.099 -0.423099,0.1766 -0.666586,0.2281 -0.907063,0.1906 -1.563227,0.1102 -2.038371,-0.1191 -0.474755,-0.2291 -0.793723,-0.619 -1.000969,-1.0934 -0.322153,-0.7374 -0.362416,-1.6531 -0.304306,-2.3864 0.02263,-0.2155 0.05358,-0.4127 0.0875,-0.5817 0.0332,-0.1653 0.07433,-0.329 0.123248,-0.4904 -0.111135,0.1271 -0.23278,0.2445 -0.363644,0.3511 -0.452454,0.3685 -1.101268,0.6777 -1.699813,0.827 -0.299151,0.075 -0.576781,0.107 -0.80426,0.091 -0.232482,-0.016 -0.381886,-0.08 -0.461259,-0.1635 -0.05796,-0.06 -0.110349,-0.1369 -0.15184,-0.2307 -0.121032,-0.2259 -0.178334,-0.5666 -0.07598,-0.9881 0.143192,-0.5897 0.598611,-1.328 1.599514,-2.0756 0.07289,-0.054 0.146785,-0.1075 0.221649,-0.1592 -0.08471,-0.029 -0.168666,-0.061 -0.251784,-0.094 -0.263389,-0.106 -0.49449,-0.2237 -0.696468,-0.3503 -0.939959,-0.6148 -1.230296,-1.4258 -1.194154,-2.1877 0.0445,-0.938 0.586501,-1.8109 1.08183,-2.1702 0,0 0.0023,-0 0.0023,-0 0.495318,-0.39 1.260503,-0.6881 2.027272,-0.6961 0.705042,-0.01 1.408729,0.2304 1.906874,0.8691 0.03833,0.051 0.0754,0.1043 0.111105,0.1602 l 0.187984,-0.12 c -0.03877,-0.061 -0.07913,-0.1188 -0.12097,-0.1744 -0.528113,-0.7237 -1.300953,-1.019 -2.082279,-1.0396 -0.835582,-0.022 -1.685534,0.2696 -2.265699,0.6866 9e-6,0 -0.003,0 -0.003,0 -0.57892,0.449 -1.147463,1.4351 -1.174178,2.4723 -0.02248,0.8726 0.339651,1.777 1.373644,2.4316 0.152153,0.1001 0.31925,0.1948 0.502198,0.2832 -0.922378,0.7017 -1.409495,1.4219 -1.597686,2.0632 -0.143634,0.4895 -0.11349,0.9377 0.04097,1.2844 0.06892,0.1357 0.157174,0.2534 0.260637,0.3475 0.1942,0.1774 0.466294,0.2418 0.742056,0.2482 0.280449,0.01 0.597282,-0.046 0.916067,-0.1377 0.51619,-0.1486 1.061817,-0.407 1.503389,-0.722 -0.0088,0.077 -0.01662,0.1569 -0.0233,0.2393 -0.07921,0.7482 -0.06373,1.7264 0.270819,2.5437 0.218568,0.534 0.57779,1.0096 1.144881,1.2989 0.566538,0.2889 1.315902,0.3793 2.288512,0.1884 0.27704,-0.054 0.53334,-0.1386 0.768967,-0.2495 1.229261,-0.6008 1.819673,-1.8906 1.914827,-3.1853 0.107281,-1.4596 -0.411263,-3.0139 -1.466537,-3.7208 0.05217,-0.054 0.102246,-0.1074 0.150257,-0.1613 1.106779,-1.2234 1.133095,-2.5216 0.62736,-3.519 -0.21008,-0.4143 -0.510338,-0.7741 -0.857972,-1.0542 -0.552438,-0.4378 -1.230656,-0.6829 -1.865169,-0.6146 -1.014141,0.1091 -1.791753,0.7486 -2.098781,1.4322 -0.154015,0.3429 -0.193585,0.7065 -0.07246,1.0224 0.01306,0.034 0.02797,0.067 0.04475,0.1001 0.105755,0.2134 0.287873,0.391 0.548007,0.5154 -0.608899,0.3762 -1.086883,0.9439 -1.34203,1.5604 -0.285213,0.6892 -0.296966,1.4549 0.124678,2.0778 0.654581,0.9641 1.586978,1.0649 2.231941,0.7301 0.153665,-0.08 0.290686,-0.1842 0.402601,-0.307 0.107695,-0.1441 0.181605,-0.3043 0.213901,-0.4702 0.06304,-0.3237 -0.03448,-0.6476 -0.306863,-0.9218 z"
       style="display:inline;fill:#0193cf;stroke:none" />
  </g>
</svg>
