<?xml version="1.0" encoding="UTF-8" standalone="no"?>
<svg
   xmlns:dc="http://purl.org/dc/elements/1.1/"
   xmlns:cc="http://creativecommons.org/ns#"
   xmlns:rdf="http://www.w3.org/1999/02/22-rdf-syntax-ns#"
   xmlns:svg="http://www.w3.org/2000/svg"
   xmlns="http://www.w3.org/2000/svg"
   version="1.1"
   id="svg2"
   viewBox="0 0 32 32"
   height="32"
   width="32">
  <defs
     id="defs4">
    <clipPath
       id="clipPath5524"
       clipPathUnits="userSpaceOnUse">
      <path
         id="use5526"
         d="M 539.24233,-503.82673 431.39147,-231.3614 549.17597,-7.1451609 658.44591,-269.67685 Z"
         style="opacity:1;fill:#73d4fd;fill-opacity:1;stroke:none;stroke-width:6;stroke-linecap:round;stroke-linejoin:miter;stroke-miterlimit:6;stroke-dasharray:none;stroke-opacity:1" />
    </clipPath>
    <clipPath
       id="clipPath5559"
       clipPathUnits="userSpaceOnUse">
      <path
         id="use5561"
         d="M 539.24233,-503.82673 431.39147,-231.3614 549.17597,-7.1451609 658.44591,-269.67685 Z"
         style="opacity:1;fill:#73d4fd;fill-opacity:1;stroke:none;stroke-width:6;stroke-linecap:round;stroke-linejoin:miter;stroke-miterlimit:6;stroke-dasharray:none;stroke-opacity:1" />
    </clipPath>
    <clipPath
       id="clipPath5563"
       clipPathUnits="userSpaceOnUse">
      <path
         id="use5565"
         d="M 539.24233,-503.82673 431.39147,-231.3614 549.17597,-7.1451609 658.44591,-269.67685 Z"
         style="opacity:1;fill:#73d4fd;fill-opacity:1;stroke:none;stroke-width:6;stroke-linecap:round;stroke-linejoin:miter;stroke-miterlimit:6;stroke-dasharray:none;stroke-opacity:1" />
    </clipPath>
  </defs>
  <metadata
     id="metadata7">
    <rdf:RDF>
      <cc:Work
         rdf:about="">
        <dc:format>image/svg+xml</dc:format>
        <dc:type
           rdf:resource="http://purl.org/dc/dcmitype/StillImage" />
        <dc:title></dc:title>
      </cc:Work>
    </rdf:RDF>
  </metadata>
  <g
     transform="translate(0,-1020.3622)"
     id="layer1">
    <rect
       y="1020.3622"
       x="0"
       height="32"
       width="32"
       id="rect6439"
       style="opacity:1;fill:#ececec;fill-opacity:1;stroke:none;stroke-width:0.40000001;stroke-linecap:round;stroke-linejoin:miter;stroke-miterlimit:6;stroke-dasharray:none;stroke-opacity:1" />
    <g
       id="g6602">
      <path
         style="opacity:1;fill:#f0accf;fill-opacity:1;stroke:none;stroke-width:0.60000002;stroke-linecap:round;stroke-linejoin:miter;stroke-miterlimit:6;stroke-dasharray:none;stroke-opacity:1"
         d="M 14.791016 1.6757812 C 12.408139 1.7018029 10.091774 1.8835512 8.2597656 2.2109375 L 8.2597656 23.720703 C 11.455431 26.511849 14.850391 28.60857 16.027344 30.302734 C 18.272331 27.412902 20.703707 25.898463 22.990234 24.257812 L 22.990234 2.2734375 C 20.747113 1.8470305 17.73976 1.6435802 14.791016 1.6757812 z "
         transform="translate(0,1020.3622)"
         id="rect6597" />
      <path
         style="opacity:1;fill:#e52a5d;fill-opacity:1;stroke:none;stroke-width:0.60000002;stroke-linecap:round;stroke-linejoin:miter;stroke-miterlimit:6;stroke-dasharray:none;stroke-opacity:1"
         d="M 11.740234 1.7988281 C 9.0178903 1.9889597 6.6523423 2.3961085 5.4472656 3.0273438 C 6.9651227 7.1791438 5.045201 7.0005437 1.6523438 5.8398438 C 1.6700937 10.561444 1.5079921 15.312125 3.859375 18.890625 C 5.9481861 22.069504 9.082544 24.510528 11.740234 26.546875 L 11.740234 1.7988281 z "
         transform="translate(0,1020.3622)"
         id="rect6587" />
      <path
         style="opacity:1;fill:#b74b90;fill-opacity:1;stroke:none;stroke-width:0.60000002;stroke-linecap:round;stroke-linejoin:miter;stroke-miterlimit:6;stroke-dasharray:none;stroke-opacity:1"
         d="M 20.267578 1.8964844 L 20.267578 26.234375 C 23.230091 24.005938 26.166167 22.488183 28.392578 18.697266 C 31.094371 14.096866 30.268694 7.9371781 30.134766 6.3300781 C 25.313337 8.0264781 25.402065 6.2410781 26.294922 3.5175781 C 25.537305 2.7126053 23.166881 2.1749285 20.267578 1.8964844 z "
         transform="translate(0,1020.3622)"
         id="rect6589" />
      <path
         style="opacity:1;fill:none;fill-opacity:1;stroke:#9d1f67;stroke-width:0.60000002;stroke-linecap:round;stroke-linejoin:miter;stroke-miterlimit:6;stroke-dasharray:none;stroke-opacity:1"
         d="m 16.026786,1050.6658 c 4.196428,-5.4018 9.0625,-5.9822 12.366071,-11.6072 2.701793,-4.6004 1.875,-10.7589 1.741072,-12.366 -4.821429,1.6964 -4.732143,-0.089 -3.839286,-2.8125 -2.142857,-2.2768 -17.0982144,-2.4554 -20.8482144,-0.4911 1.5178571,4.1518 -0.4017857,3.9732 -3.7946429,2.8125 0.01775,4.7216 -0.1432171,9.473 2.2081658,13.0515 3.5624819,5.4216 10.3919205,8.8579 12.1668345,11.4128 z"
         id="path6585" />
    </g>
    <path
       id="path6583"
       d="m 13.214286,1033.389 2.544643,-8.9732 2.946428,9.0178 5.580357,0.9822 -4.241071,3.9285 1.160714,5.9375 -5.223214,-3.3928 -5.089286,3.1696 0.803572,-5.9375 -4.0625004,-4.0178 z"
       style="opacity:1;fill:#961194;fill-opacity:1;stroke:none;stroke-width:0.40000001;stroke-linecap:round;stroke-linejoin:miter;stroke-miterlimit:6;stroke-dasharray:none;stroke-opacity:1" />
    <path
       id="path6581"
       d="m 18.16967,1036.7864 c 1.282769,-3.2078 -2.746352,-5.0823 -2.904188,-5.619 -0.06313,1.1996 -0.310257,7.1582 -0.310257,7.1582 -1.982064,-0.4222 -3.33303,1.6714 -2.607008,2.4921 0.726072,0.8208 3.192124,0.015 3.232937,-2.1688 0.03541,-1.8948 0.126269,-4.4194 0.126269,-4.4194 0.678833,0.6004 1.833473,0.3836 2.462247,2.5569 z"
       style="opacity:1;fill:#eb1fef;fill-opacity:1;stroke:none;stroke-width:0.40000001;stroke-linecap:round;stroke-linejoin:miter;stroke-miterlimit:6;stroke-dasharray:none;stroke-opacity:1" />
  </g>
</svg>
