<?xml version="1.0" encoding="UTF-8" standalone="no"?>
<!-- Created with Inkscape (http://www.inkscape.org/) -->

<svg
   width="192"
   height="192"
   viewBox="0 0 192 192"
   version="1.1"
   id="svg4575"
   inkscape:version="1.1.1 (3bf5ae0d25, 2021-09-20)"
   sodipodi:docname="yarn.svg"
   xmlns:inkscape="http://www.inkscape.org/namespaces/inkscape"
   xmlns:sodipodi="http://sodipodi.sourceforge.net/DTD/sodipodi-0.dtd"
   xmlns="http://www.w3.org/2000/svg"
   xmlns:svg="http://www.w3.org/2000/svg"
   xmlns:rdf="http://www.w3.org/1999/02/22-rdf-syntax-ns#"
   xmlns:cc="http://creativecommons.org/ns#"
   xmlns:dc="http://purl.org/dc/elements/1.1/">
  <defs
     id="defs4569" />
  <sodipodi:namedview
     id="base"
     pagecolor="#ffffff"
     bordercolor="#666666"
     borderopacity="1.0"
     inkscape:pageopacity="0.0"
     inkscape:pageshadow="2"
     inkscape:zoom="0.98994949"
     inkscape:cx="147.48227"
     inkscape:cy="232.33509"
     inkscape:document-units="px"
     inkscape:current-layer="layer1"
     showgrid="false"
     units="px"
     inkscape:pagecheckerboard="true"
     inkscape:window-width="2408"
     inkscape:window-height="1411"
     inkscape:window-x="30"
     inkscape:window-y="0"
     inkscape:window-maximized="1"
     inkscape:document-rotation="0"
     borderlayer="true" />
  <metadata
     id="metadata4572">
    <rdf:RDF>
      <cc:Work
         rdf:about="">
        <dc:format>image/svg+xml</dc:format>
        <dc:type
           rdf:resource="http://purl.org/dc/dcmitype/StillImage" />
      </cc:Work>
    </rdf:RDF>
  </metadata>
  <g
     inkscape:label="ref"
     inkscape:groupmode="layer"
     id="layer1">
    <path
       style="fill:#3250b0;stroke:#1d2848;stroke-width:4;stroke-linecap:round;stroke-linejoin:round"
       d="m 91.502163,190.19954 c 41.484287,0.43906 74.994987,-18.97405 90.808107,-18.87416 22.4462,0.14179 41.28043,19.52366 68.27244,20.10764 26.99201,0.58397 33.88315,-23.8719 30.62902,-37.45462 -2.80225,-11.69656 -13.9257,-7.41036 -11.68693,-0.0812 3.15874,10.34096 -6.89342,25.3338 -20.25836,25.05668 -15.62295,-0.32394 -38.24082,-20.74192 -66.97566,-20.98812 -20.51932,-0.17581 -66.23553,19.96721 -85.136719,19.69238"
       id="path4449"
       sodipodi:nodetypes="cssssssc" />
    <circle
       style="fill:#3250b0;stroke:#1d2848;stroke-width:4;stroke-linecap:round;stroke-linejoin:round"
       id="path860"
       cx="96"
       cy="96"
       r="94" />
    <path
       id="path3376"
       style="fill:none;stroke:#1d2848;stroke-width:4;stroke-linecap:round;stroke-linejoin:round"
       d="M 67.007812,6.7441406 C 88.146398,15.185067 109.28714,30.504098 128.38672,48.222656 L 149.44336,33.332031 C 137.80796,21.971406 125.56499,11.818925 113.38867,3.6425781"
       sodipodi:nodetypes="cccc" />
    <path
       id="path2937"
       style="fill:none;stroke:#1d2848;stroke-width:4;stroke-linecap:round;stroke-linejoin:round"
       d="M 160.22656,27.398438 C 137.01273,38.875754 113.7915,58.766456 94.056641,82.201172 m 19.082029,20.195308 c 19.52138,-24.454588 41.76937,-46.405509 61.64649,-57.628902 m 11.57422,25.41211 c -17.49064,10.40289 -39.13757,29.223576 -57.7754,52.162112 m 17.22071,29.63672 c 12.32955,-19.50179 28.40332,-39.33124 43.90625,-51.94532"
       sodipodi:nodetypes="cccccccc" />
    <path
       id="path2389"
       style="fill:none;stroke:#1d2848;stroke-width:4;stroke-linecap:round;stroke-linejoin:round"
       d="M 44.980469,17.070312 C 66.212893,25.802873 89.363557,43.57663 110.73828,64.097656 M 12.068359,54.068359 C 53.66325,76.307763 118.6069,138.32341 133.93555,181.92188 m 19.04297,-11.45313 C 136.77387,117.04828 78.227351,57.277169 24.865234,34.568359 M 5.0097656,118.81055 c 24.8699684,14.99932 56.7033134,43.81902 71.8437504,68.97656 m 30.181644,1.42383 C 93.422367,155.66285 51.341354,102.41923 3.5683594,79.810547"
       sodipodi:nodetypes="cccccccccc" />
  </g>
</svg>
