{
    "layers": [
        {
            "ddd": 0,
            "ty": 4,
            "sr": 1,
            "ks": {
                "a": {
                    "k": [
                        0,
                        0
                    ],
                    "a": 0
                },
                "p": {
                    "k": [
                        0,
                        0
                    ],
                    "a": 0
                },
                "s": {
                    "k": [
                        100,
                        100
                    ],
                    "a": 0
                },
                "r": {
                    "k": 0,
                    "a": 0
                },
                "o": {
                    "k": 100,
                    "a": 0
                },
                "sk": {
                    "k": 0,
                    "a": 0
                },
                "sa": {
                    "k": 0,
                    "a": 0
                }
            },
            "ao": 0,
            "ip": 0,
            "op": 12,
            "st": 0,
            "bm": 0,
            "ind": 0,
            "shapes": [
                {
                    "nm": "ffffffff",
                    "ty": "gr",
                    "it": [
                        {
                            "ty": "rc",
                            "d": 1,
                            "p": {
                                "k": [
                                    12,
                                    19.5
                                ],
                                "a": 0
                            },
                            "s": {
                                "k": [
                                    14,
                                    1
                                ],
                                "a": 0
                            },
                            "r": {
                                "k": 0,
                                "a": 0
                            }
                        },
                        {
                            "ty": "rc",
                            "d": 1,
                            "p": {
                                "k": [
                                    12,
                                    20.5
                                ],
                                "a": 0
                            },
                            "s": {
                                "k": [
                                    12,
                                    1
                                ],
                                "a": 0
                            },
                            "r": {
                                "k": 0,
                                "a": 0
                            }
                        },
                        {
                            "ty": "rc",
                            "d": 1,
                            "p": {
                                "k": [
                                    7.5,
                                    2.5
                                ],
                                "a": 0
                            },
                            "s": {
                                "k": [
                                    1,
                                    1
                                ],
                                "a": 0
                            },
                            "r": {
                                "k": 0,
                                "a": 0
                            }
                        },
                        {
                            "ty": "rc",
                            "d": 1,
                            "p": {
                                "k": [
                                    7.5,
                                    6.5
                                ],
                                "a": 0
                            },
                            "s": {
                                "k": [
                                    3,
                                    7
                                ],
                                "a": 0
                            },
                            "r": {
                                "k": 0,
                                "a": 0
                            }
                        },
                        {
                            "ty": "rc",
                            "d": 1,
                            "p": {
                                "k": [
                                    11.5,
                                    18.5
                                ],
                                "a": 0
                            },
                            "s": {
                                "k": [
                                    13,
                                    1
                                ],
                                "a": 0
                            },
                            "r": {
                                "k": 0,
                                "a": 0
                            }
                        },
                        {
                            "ty": "rc",
                            "d": 1,
                            "p": {
                                "k": [
                                    7,
                                    10.5
                                ],
                                "a": 0
                            },
                            "s": {
                                "k": [
                                    4,
                                    1
                                ],
                                "a": 0
                            },
                            "r": {
                                "k": 0,
                                "a": 0
                            }
                        },
                        {
                            "ty": "rc",
                            "d": 1,
                            "p": {
                                "k": [
                                    6.5,
                                    14.5
                                ],
                                "a": 0
                            },
                            "s": {
                                "k": [
                                    3,
                                    7
                                ],
                                "a": 0
                            },
                            "r": {
                                "k": 0,
                                "a": 0
                            }
                        },
                        {
                            "ty": "fl",
                            "o": {
                                "k": 100,
                                "a": 0
                            },
                            "c": {
                                "k": [
                                    1,
                                    1,
                                    1,
                                    1
                                ],
                                "a": 0
                            }
                        },
                        {
                            "ty": "st",
                            "lc": 2,
                            "lj": 2,
                            "ml": 0,
                            "o": {
                                "k": 100,
                                "a": 0
                            },
                            "w": {
                                "k": 0.1,
                                "a": 0
                            },
                            "c": {
                                "k": [
                                    1,
                                    1,
                                    1,
                                    1
                                ],
                                "a": 0
                            }
                        },
                        {
                            "ty": "tr",
                            "a": {
                                "k": [
                                    0,
                                    0
                                ],
                                "a": 0
                            },
                            "p": {
                                "k": [
                                    0,
                                    0
                                ],
                                "a": 0
                            },
                            "s": {
                                "k": [
                                    100,
                                    100
                                ],
                                "a": 0
                            },
                            "r": {
                                "k": 0,
                                "a": 0
                            },
                            "o": {
                                "k": 100,
                                "a": 0
                            },
                            "sk": {
                                "k": 0,
                                "a": 0
                            },
                            "sa": {
                                "k": 0,
                                "a": 0
                            }
                        }
                    ]
                }
            ]
        },
        {
            "ddd": 0,
            "ty": 4,
            "sr": 1,
            "ks": {
                "a": {
                    "k": [
                        0,
                        0
                    ],
                    "a": 0
                },
                "p": {
                    "k": [
                        0,
                        0
                    ],
                    "a": 0
                },
                "s": {
                    "k": [
                        100,
                        100
                    ],
                    "a": 0
                },
                "r": {
                    "k": 0,
                    "a": 0
                },
                "o": {
                    "k": 100,
                    "a": 0
                },
                "sk": {
                    "k": 0,
                    "a": 0
                },
                "sa": {
                    "k": 0,
                    "a": 0
                }
            },
            "ao": 0,
            "ip": 12,
            "op": 24,
            "st": 0,
            "bm": 0,
            "ind": 1,
            "shapes": [
                {
                    "nm": "ffffffff",
                    "ty": "gr",
                    "it": [
                        {
                            "ty": "rc",
                            "d": 1,
                            "p": {
                                "k": [
                                    6.5,
                                    2.5
                                ],
                                "a": 0
                            },
                            "s": {
                                "k": [
                                    1,
                                    1
                                ],
                                "a": 0
                            },
                            "r": {
                                "k": 0,
                                "a": 0
                            }
                        },
                        {
                            "ty": "rc",
                            "d": 1,
                            "p": {
                                "k": [
                                    12.5,
                                    20.5
                                ],
                                "a": 0
                            },
                            "s": {
                                "k": [
                                    11,
                                    1
                                ],
                                "a": 0
                            },
                            "r": {
                                "k": 0,
                                "a": 0
                            }
                        },
                        {
                            "ty": "rc",
                            "d": 1,
                            "p": {
                                "k": [
                                    6.5,
                                    7.5
                                ],
                                "a": 0
                            },
                            "s": {
                                "k": [
                                    3,
                                    9
                                ],
                                "a": 0
                            },
                            "r": {
                                "k": 0,
                                "a": 0
                            }
                        },
                        {
                            "ty": "rc",
                            "d": 1,
                            "p": {
                                "k": [
                                    12,
                                    19.5
                                ],
                                "a": 0
                            },
                            "s": {
                                "k": [
                                    12,
                                    1
                                ],
                                "a": 0
                            },
                            "r": {
                                "k": 0,
                                "a": 0
                            }
                        },
                        {
                            "ty": "rc",
                            "d": 1,
                            "p": {
                                "k": [
                                    7,
                                    12.5
                                ],
                                "a": 0
                            },
                            "s": {
                                "k": [
                                    4,
                                    1
                                ],
                                "a": 0
                            },
                            "r": {
                                "k": 0,
                                "a": 0
                            }
                        },
                        {
                            "ty": "rc",
                            "d": 1,
                            "p": {
                                "k": [
                                    7.5,
                                    15.5
                                ],
                                "a": 0
                            },
                            "s": {
                                "k": [
                                    3,
                                    5
                                ],
                                "a": 0
                            },
                            "r": {
                                "k": 0,
                                "a": 0
                            }
                        },
                        {
                            "ty": "rc",
                            "d": 1,
                            "p": {
                                "k": [
                                    11.5,
                                    18.5
                                ],
                                "a": 0
                            },
                            "s": {
                                "k": [
                                    11,
                                    1
                                ],
                                "a": 0
                            },
                            "r": {
                                "k": 0,
                                "a": 0
                            }
                        },
                        {
                            "ty": "fl",
                            "o": {
                                "k": 100,
                                "a": 0
                            },
                            "c": {
                                "k": [
                                    1,
                                    1,
                                    1,
                                    1
                                ],
                                "a": 0
                            }
                        },
                        {
                            "ty": "st",
                            "lc": 2,
                            "lj": 2,
                            "ml": 0,
                            "o": {
                                "k": 100,
                                "a": 0
                            },
                            "w": {
                                "k": 0.1,
                                "a": 0
                            },
                            "c": {
                                "k": [
                                    1,
                                    1,
                                    1,
                                    1
                                ],
                                "a": 0
                            }
                        },
                        {
                            "ty": "tr",
                            "a": {
                                "k": [
                                    0,
                                    0
                                ],
                                "a": 0
                            },
                            "p": {
                                "k": [
                                    0,
                                    0
                                ],
                                "a": 0
                            },
                            "s": {
                                "k": [
                                    100,
                                    100
                                ],
                                "a": 0
                            },
                            "r": {
                                "k": 0,
                                "a": 0
                            },
                            "o": {
                                "k": 100,
                                "a": 0
                            },
                            "sk": {
                                "k": 0,
                                "a": 0
                            },
                            "sa": {
                                "k": 0,
                                "a": 0
                            }
                        }
                    ]
                }
            ]
        },
        {
            "ddd": 0,
            "ty": 4,
            "sr": 1,
            "ks": {
                "a": {
                    "k": [
                        0,
                        0
                    ],
                    "a": 0
                },
                "p": {
                    "k": [
                        0,
                        0
                    ],
                    "a": 0
                },
                "s": {
                    "k": [
                        100,
                        100
                    ],
                    "a": 0
                },
                "r": {
                    "k": 0,
                    "a": 0
                },
                "o": {
                    "k": 100,
                    "a": 0
                },
                "sk": {
                    "k": 0,
                    "a": 0
                },
                "sa": {
                    "k": 0,
                    "a": 0
                }
            },
            "ao": 0,
            "ip": 24,
            "op": 36,
            "st": 0,
            "bm": 0,
            "ind": 2,
            "shapes": [
                {
                    "nm": "ffffffff",
                    "ty": "gr",
                    "it": [
                        {
                            "ty": "rc",
                            "d": 1,
                            "p": {
                                "k": [
                                    12,
                                    18.5
                                ],
                                "a": 0
                            },
                            "s": {
                                "k": [
                                    12,
                                    1
                                ],
                                "a": 0
                            },
                            "r": {
                                "k": 0,
                                "a": 0
                            }
                        },
                        {
                            "ty": "rc",
                            "d": 1,
                            "p": {
                                "k": [
                                    15,
                                    17.5
                                ],
                                "a": 0
                            },
                            "s": {
                                "k": [
                                    4,
                                    1
                                ],
                                "a": 0
                            },
                            "r": {
                                "k": 0,
                                "a": 0
                            }
                        },
                        {
                            "ty": "rc",
                            "d": 1,
                            "p": {
                                "k": [
                                    11.5,
                                    19.5
                                ],
                                "a": 0
                            },
                            "s": {
                                "k": [
                                    11,
                                    1
                                ],
                                "a": 0
                            },
                            "r": {
                                "k": 0,
                                "a": 0
                            }
                        },
                        {
                            "ty": "rc",
                            "d": 1,
                            "p": {
                                "k": [
                                    10,
                                    20.5
                                ],
                                "a": 0
                            },
                            "s": {
                                "k": [
                                    6,
                                    1
                                ],
                                "a": 0
                            },
                            "r": {
                                "k": 0,
                                "a": 0
                            }
                        },
                        {
                            "ty": "rc",
                            "d": 1,
                            "p": {
                                "k": [
                                    7.5,
                                    2.5
                                ],
                                "a": 0
                            },
                            "s": {
                                "k": [
                                    1,
                                    1
                                ],
                                "a": 0
                            },
                            "r": {
                                "k": 0,
                                "a": 0
                            }
                        },
                        {
                            "ty": "rc",
                            "d": 1,
                            "p": {
                                "k": [
                                    7.5,
                                    10.5
                                ],
                                "a": 0
                            },
                            "s": {
                                "k": [
                                    3,
                                    15
                                ],
                                "a": 0
                            },
                            "r": {
                                "k": 0,
                                "a": 0
                            }
                        },
                        {
                            "ty": "fl",
                            "o": {
                                "k": 100,
                                "a": 0
                            },
                            "c": {
                                "k": [
                                    1,
                                    1,
                                    1,
                                    1
                                ],
                                "a": 0
                            }
                        },
                        {
                            "ty": "st",
                            "lc": 2,
                            "lj": 2,
                            "ml": 0,
                            "o": {
                                "k": 100,
                                "a": 0
                            },
                            "w": {
                                "k": 0.1,
                                "a": 0
                            },
                            "c": {
                                "k": [
                                    1,
                                    1,
                                    1,
                                    1
                                ],
                                "a": 0
                            }
                        },
                        {
                            "ty": "tr",
                            "a": {
                                "k": [
                                    0,
                                    0
                                ],
                                "a": 0
                            },
                            "p": {
                                "k": [
                                    0,
                                    0
                                ],
                                "a": 0
                            },
                            "s": {
                                "k": [
                                    100,
                                    100
                                ],
                                "a": 0
                            },
                            "r": {
                                "k": 0,
                                "a": 0
                            },
                            "o": {
                                "k": 100,
                                "a": 0
                            },
                            "sk": {
                                "k": 0,
                                "a": 0
                            },
                            "sa": {
                                "k": 0,
                                "a": 0
                            }
                        }
                    ]
                }
            ]
        }
    ],
    "v": "5.5.2",
    "fr": 60,
    "ip": 0,
    "op": 36,
    "w": 24,
    "h": 24,
    "ddd": 0,
    "assets": []
}