{
    "$include": "secrets.json",
    "apps": [
        // System
        {
            "enabled": false,
            "class": "mini_apps.db.Database",
            "db_class": "peewee.SqliteDatabase",
            "database": "$vars.db"
        },
        {
            "autostart": true,
            "class": "mini_apps.http.HttpServer",
            "hostname": "localhost",
            "port": 2537,
            "secret-key": "$vars.cookie",
            "websocket": "/socket/",
            "url": "$vars.public-url"
        },
        {
            "class": "mini_apps.http.middleware.messages.MessageMiddleware"
        },
        // Web
        {
            "class": "mini_apps.apps.auth.auth.Auth",
            "bot-token": "$vars.auth-token",
            "bot-username": "$vars.auth-name"
        },
        {
            "name": "api",
            "class": "glaxbots.api.Api"
        },
        {
            "class": "mini_apps.apps.mini_apps.MiniAppsCommon"
        },
        {
            "autostart": false,
            "name": "nfc-events",
            "class": "mini_apps.apps.api_events.api_events.ApiEventApp",
            "bot-token": "$vars.events-bot",
            "session": "$this.bot-token",
            "short-name": "nfc_events",
            "api-url": "https://scheduleapi.nordicfuzzcon.org/v1/PublicSchedule",
            "path-events": "",
            "datetime-format": "%Y-%m-%dT%H:%M:%S%z",
            "event-data": {
                "id": "id",
                "start": "datetime:placement/startTime",
                "finish": "datetime:placement/endTime",
                "day": "eval:self.start.date()",
                "duration": "placement/durationMinutes",
                "title": "title",
                "description": "markdown:description",
                "cancelled": "placement/isCancelled",
                "location": "placement/roomName",
                "image": "null:",
                "hidden": "isHidden",
                "visible": "eval:not self.hidden",
            }
        },
        {
            "autostart": false,
            "name": "rfr-events",
            "class": "mini_apps.apps.api_events.api_events.ApiEventApp",
            "bot-token": "$vars.events-bot",
            "session": "$this.bot-token",
            "short-name": "rfr_events",
            "api-url": "https://reffurence.com/api/events/schedule",
            "path-events": "",
            "datetime-format": "%Y-%m-%dT%H:%M:%S.%f%z",
            "event-data": {
                "id": "str:id",
                "start": "datetime:starts_at",
                "finish": "datetime:ends_at",
                "day": "eval:self.start.date()",
                "duration": "eval:(self.finish-self.start).total_seconds()//60",
                "title": "name",
                "description": "description",
                "cancelled": "null:",
                "location": "room/name",
                "image": "eval:'https://reffurence.com/banners/reffurence-banner.png'",
                "visible": "eval:True",
            }
        },
        {
            "autostart": false,
            "name": "fluufff-events",
            "class": "mini_apps.apps.api_events.api_events.ApiEventApp",
            "bot-token": "$vars.events-bot",
            "session": "$this.bot-token",
            "short-name": "fluufff_events",
            "api-url": "https://ibs.sh/api/v1/sites/06d88e9b-3cbe-42b1-9f19-505be524e818/content?lang=en&pagesize=-1&contentTypes=b1732d5f-a39b-4d72-b238-ee84d9d70551&populate=true",
            "path-events": "_embedded/content",
            "datetime-format": "%Y-%m-%dT%H:%M:%S%z",
            "event-data": {
                "id": "id",
                "start": "datetime:fields/start-time",
                "finish": "datetime:fields/end-time",
                "day": "eval:self.start.date()",
                "duration": "eval:(self.finish-self.start).total_seconds()//60",
                "title": "name",
                "description": "fields/description",
                "cancelled": "null:",
                "location": "fields/location/fields/name",
                "image": "null:",
                "visible": "eval:True",
            }
        },
        {
            "autostart": false,
            "name": "dfc-events",
            "class": "mini_apps.apps.api_events.api_events.ApiEventApp",
            "bot-token": "$vars.events-bot",
            "session": "$this.bot-token",
            "short-name": "dfc_events",
            // "api-url": "https://api-test.dutchfurcon.com/activities",
            "api-url": "https://api.dutchfurcon.com/activities",
            "path-events": "",
            "expand": "activityEvents",
            "expand-name": "event",
            "datetime-format": "%Y-%m-%dT%H:%M:%S%z",
            "event-data": {
                "id": "str:event/id",
                "start": "datetime:event/startDate",
                "finish": "datetime:event/endDate",
                "day": "eval:self.start.date()",
                "duration": "eval:(self.finish-self.start).total_seconds()//60",
                "title": "titleEnglish",
                "description": "descriptionEnglish",
                "cancelled": "null:",
                "location": "event/location",
                "image": "null:",
                "visible": "eval:True",
            }
        },
        {
            "class": "mini_apps.apps.admin.admin.AdminApp",
            "prefix": "",
            "show-token": true
        },
        // Bots
        {
            "name": "glaxbot",
            "class": "mini_apps.telegram.bots.ReplyBot",
            "commands": {
                "start": {
                    "description": "Shows the start command",
                    "message": "This bot provides wisdom from Glax the Dragon.\nPlease note that many of the quotes might be NSFW, use at your own risk!"
                },
                "wisdom": {
                    "description": "Gives a pearl of wisdom",
                    "message":[
                        "My penis is like a photon because it would go inside both slits",
                        "What if I want to cook pasta in my ass?",
                        "I'm like sonic. Gotta cum fast",
                        // "Shove pizza up the ass? 🤔",
                        "Everything is porn with enough imagination",
                        "My personality is a form of house arrest",
                        "Your paws are so musky they bought Twitter",
                        "Boobs are the balls of the chest",
                        "Why get shit-faced when you can get sit-faced",
                        "Does cum hydrate?",
                        "I steal dragoness eggs so I can volunteer to help them make more",
                        "I'm not an experienced birder but I do reliably jizz in the field",
                        "Lamassu is breaking the magic",
                        "The guns are stored in the balls",
                        "My penis is an 11 on the Mohs scale",
                        "I like registration buttons like I like dragon privates, big and green",
                        "My horns are sun dials",
                        "I do love myself a pair of zebra meatballs",
                        "I would also cream looking at a cereal box with Tony the tiger",
                        "There's the 5 seconds rule where you can say \"no homo\" if balls do touch",
                        "If you eat enough teflon you become a terminator",
                    ]
                }
            },
            "bot-token": "$vars.glaxbot",
            "session": "$this.bot-token"
        },
        // dragon.best
        {
            "name": "GlaxFlagBot",
            "named": true,
            "class": "mini_apps.telegram.auto_bot.AutoBot",
            "command-module": "glaxbots.dragonbest",
            "bot-token": "$vars.$name",
            "session": "$this.bot-token"
        },
        {
            "name": "GlaxTimeBot",
            "named": true,
            "class": "mini_apps.telegram.auto_bot.AutoBot",
            "command-module": "glaxbots.dragonbest",
            "bot-token": "$vars.$name",
            "session": "$this.bot-token"
        },
        {
            "name": "GlaxSaysBot",
            "named": true,
            "class": "mini_apps.telegram.auto_bot.AutoBot",
            "command-module": "glaxbots.dragonbest",
            "bot-token": "$vars.$name",
            "session": "$this.bot-token"
        },
        {
            "name": "GlaxShieldBot",
            "named": true,
            "class": "mini_apps.telegram.auto_bot.AutoBot",
            "command-module": "glaxbots.dragonbest",
            "bot-token": "$vars.$name",
            "session": "$this.bot-token"
        },
        {
            "name": "GlaxWeatherBot",
            "named": true,
            "class": "mini_apps.telegram.auto_bot.AutoBot",
            "command-module": "glaxbots.dragonbest",
            "bot-token": "$vars.$name",
            "session": "$this.bot-token"
        },
        {
            "name": "SomeDragonsBot",
            "named": true,
            "class": "mini_apps.telegram.auto_bot.AutoBot",
            "command-module": "glaxbots.dragonbest",
            "bot-token": "$vars.$name",
            "session": "$this.bot-token"
        },
        {
            "name": "GlaxSealBot",
            "named": true,
            "class": "mini_apps.telegram.auto_bot.AutoBot",
            "command-module": "glaxbots.dragonbest",
            "bot-token": "$vars.$name",
            "session": "$this.bot-token"
        },
        {
            "name": "BrexitBusBot",
            "named": true,
            "class": "mini_apps.telegram.auto_bot.AutoBot",
            "command-module": "glaxbots.dragonbest",
            "bot-token": "$vars.$name",
            "session": "$this.bot-token"
        },
        {
            "name": "YouWouldntBot",
            "named": true,
            "class": "mini_apps.telegram.auto_bot.AutoBot",
            "command-module": "glaxbots.dragonbest",
            "bot-token": "$vars.$name",
            "session": "$this.bot-token"
        },
        {
            "name": "IsThisAGlaxBot",
            "named": true,
            "class": "mini_apps.telegram.auto_bot.AutoBot",
            "command-module": "glaxbots.dragonbest",
            "bot-token": "$vars.$name",
            "session": "$this.bot-token"
        },
        {
            "name": "ADRagonBot",
            "named": true,
            "class": "mini_apps.telegram.auto_bot.AutoBot",
            "command-module": "glaxbots.dragonbest",
            "bot-token": "$vars.$name",
            "session": "$this.bot-token"
        },
        {
            "name": "GlaxCertBot",
            "named": true,
            "class": "mini_apps.telegram.auto_bot.AutoBot",
            "command-module": "glaxbots.dragonbest",
            "bot-token": "$vars.$name",
            "session": "$this.bot-token"
        },
        // Animations
        {
            "name": "GlaxMatrixBot",
            "named": true,
            "class": "mini_apps.telegram.auto_bot.AutoBot",
            "command-module": "glaxbots.animations",
            "bot-token": "$vars.$name",
            "session": "$this.bot-token"
        },
        {
            "name": "GlaxScremBot",
            "named": true,
            "class": "glaxbots.animations.ScremBot",
            "file": "noises.svg",
            "bot-token": "$vars.$name",
            "session": "$this.bot-token"
        },
        {
            "name": "GaleVoreBot",
            "named": true,
            "class": "glaxbots.animations.ScremBot",
            "file": "vore.svg",
            "bot-token": "$vars.$name",
            "session": "$this.bot-token"
        },
        {
            "name": "FleeksEeksBot",
            "named": true,
            "class": "glaxbots.animations.ScremBot",
            "file": "fleeks.svg",
            "bot-token": "$vars.$name",
            "session": "$this.bot-token"
        },
        {
            "name": "RashanBot",
            "named": true,
            "class": "glaxbots.animations.ScremBot",
            "file": "vore.svg",
            "bot-token": "$vars.$name",
            "session": "$this.bot-token"
        },
        {
            "name": "GooglaxBot",
            "named": true,
            "class": "mini_apps.telegram.auto_bot.AutoBot",
            "command-module": "glaxbots.animations",
            "bot-token": "$vars.$name",
            "session": "$this.bot-token",
            "admin-only": true
        },
        {
            "name": "GlaxThinkBot",
            "named": true,
            "class": "mini_apps.telegram.auto_bot.AutoBot",
            "command-module": "glaxbots.animations",
            "bot-token": "$vars.$name",
            "session": "$this.bot-token"
        },
        {
            "name": "StickerFromDescriptionBot",
            "named": true,
            "enabled": false,
            "class": "mini_apps.telegram.auto_bot.AutoBot",
            "command-module": "glaxbots.animations",
            "bot-token": "$vars.$name",
            "session": "$this.bot-token"
        },
        {
            "name": "GlaxGearBot",
            "named": true,
            "class": "mini_apps.telegram.auto_bot.AutoBot",
            "command-module": "glaxbots.animations",
            "bot-token": "$vars.$name",
            "session": "$this.bot-token"
        },
        // Misc bots
        {
            "name": "GlaxMakeRobot",
            "class": "mini_apps.telegram.auto_bot.AutoBot",
            "command-module": "glaxbots.baba_commands",
            "bot-token": "$vars.$name",
            "session": "$this.bot-token"
        },
        {
            "name": "eurofurs",
            "class": "glaxbots.eurofurs.EurofursBot",
            // "class": "mini_apps.telegram.bots.AdminCommandsBot",
            "bot-token": "$vars.$name",
            "session": "$this.bot-token",
            "admin-message": "beep boop\n@Raugh @MattBas @RadoRaccoon @pyonium @RowanWuff\nhave a look",
            "admin-chat": "$vars.eurofurs-admin-chat",
            "chats": "$vars.eurofurs-chats",
            "welcome-image": "yay.webp",
            "admins": "$vars.eurofurs-admins"
        },
        {
            "name": "GlaxMathBot",
            "class": "glaxbots.math.MathBot",
            "bot-token": "$vars.$name",
            "session": "$this.bot-token"
        },
        {
            "name": "PoesContBot",
            "class": "glaxbots.concat.ConCatBot",
            "bot-token": "$vars.$name",
            "session": "$this.bot-token"
        },
        {
            "enabled": false,
            "name": "test",
            "class": "glaxbots.test.TestBot",
            "bot-token": "$vars.$name",
            "bot-token": "$vars.glaxbot",
            "session": "$this.bot-token"
        },
        {
            "name": "GlaxmojiBot",
            "class": "mini_apps.telegram.auto_bot.AutoBot",
            "command-module": "glaxbots.emoji_sticker",
            "bot-token": "$vars.$name",
            "session": "$this.bot-token"
        },
    ],
    "pythonpath": [
        "$globals.cwd"
    ]
}
