<?xml version="1.0" encoding="UTF-8" standalone="no"?>
<!-- Created with Inkscape (http://www.inkscape.org/) -->

<svg
   width="1223.2284"
   height="753.42078"
   viewBox="0 0 1223.2284 753.42078"
   version="1.1"
   id="svg4575"
   inkscape:version="1.1.1 (3bf5ae0d25, 2021-09-20)"
   sodipodi:docname="box-fg.svg"
   inkscape:export-filename="/tmp/[poes].png"
   inkscape:export-xdpi="96"
   inkscape:export-ydpi="96"
   xmlns:inkscape="http://www.inkscape.org/namespaces/inkscape"
   xmlns:sodipodi="http://sodipodi.sourceforge.net/DTD/sodipodi-0.dtd"
   xmlns="http://www.w3.org/2000/svg"
   xmlns:svg="http://www.w3.org/2000/svg"
   xmlns:rdf="http://www.w3.org/1999/02/22-rdf-syntax-ns#"
   xmlns:cc="http://creativecommons.org/ns#"
   xmlns:dc="http://purl.org/dc/elements/1.1/">
  <defs
     id="defs4569" />
  <sodipodi:namedview
     id="base"
     pagecolor="#ffffff"
     bordercolor="#666666"
     borderopacity="1.0"
     inkscape:pageopacity="0.0"
     inkscape:pageshadow="2"
     inkscape:zoom="0.12374369"
     inkscape:cx="-476.792"
     inkscape:cy="1907.168"
     inkscape:document-units="px"
     inkscape:current-layer="layer1"
     showgrid="false"
     units="px"
     inkscape:pagecheckerboard="true"
     inkscape:window-width="2408"
     inkscape:window-height="1411"
     inkscape:window-x="30"
     inkscape:window-y="0"
     inkscape:window-maximized="1"
     inkscape:document-rotation="0"
     borderlayer="true"
     inkscape:snap-bbox="true"
     inkscape:snap-page="true"
     fit-margin-top="0"
     fit-margin-left="0"
     fit-margin-right="0"
     fit-margin-bottom="0" />
  <metadata
     id="metadata4572">
    <rdf:RDF>
      <cc:Work
         rdf:about="">
        <dc:format>image/svg+xml</dc:format>
        <dc:type
           rdf:resource="http://purl.org/dc/dcmitype/StillImage" />
      </cc:Work>
    </rdf:RDF>
  </metadata>
  <g
     inkscape:label="ref"
     inkscape:groupmode="layer"
     id="layer1">
    <path
       style="fill:#d2a96a;fill-opacity:1;stroke:#97794c;stroke-width:4;stroke-linecap:round;stroke-linejoin:round;stroke-opacity:1"
       d="M 29.572228,7.1701967 39.739988,477.3955 227.61422,615.79652 228,103.99976 Z"
       id="path23010"
       sodipodi:nodetypes="ccccc" />
    <path
       style="fill:#b8935c;fill-opacity:1;stroke:#97794c;stroke-width:4;stroke-linecap:round;stroke-linejoin:round;stroke-opacity:1"
       d="M 228,104.00023 1.9999983,225.57021 9.4708383,751.42095 227.61422,615.79653 Z"
       id="path16958"
       sodipodi:nodetypes="ccccc" />
    <path
       style="fill:#d2a96a;fill-opacity:1;stroke:#97794c;stroke-width:4;stroke-linecap:round;stroke-linejoin:round;stroke-opacity:1"
       d="M 995.61422,103.79653 1221.2284,225.57021 1213.7576,751.42095 995.61422,615.79653 Z"
       id="path17172" />
    <path
       style="fill:#d2a96a;fill-opacity:1;stroke:#97794c;stroke-width:4;stroke-linecap:round;stroke-linejoin:round;stroke-opacity:1"
       d="M 995.61422,103.79653 778.09379,1.9999997 29.572228,7.1701967 228,104"
       id="path20397"
       sodipodi:nodetypes="cccc" />
    <rect
       style="fill:none;fill-opacity:1;stroke:#97794c;stroke-width:4;stroke-linecap:round;stroke-linejoin:round;stroke-opacity:1"
       id="rect15101"
       width="768"
       height="512"
       x="227.61421"
       y="103.79652" />
  </g>
</svg>
