{
    "layers": [
        {
            "ddd": 0,
            "ty": 4,
            "sr": 1,
            "ks": {
                "a": {
                    "k": [
                        0,
                        0
                    ],
                    "a": 0
                },
                "p": {
                    "k": [
                        0,
                        0
                    ],
                    "a": 0
                },
                "s": {
                    "k": [
                        100,
                        100
                    ],
                    "a": 0
                },
                "r": {
                    "k": 0,
                    "a": 0
                },
                "o": {
                    "k": 100,
                    "a": 0
                },
                "sk": {
                    "k": 0,
                    "a": 0
                },
                "sa": {
                    "k": 0,
                    "a": 0
                }
            },
            "ao": 0,
            "ip": 0,
            "op": 0.6,
            "st": 0,
            "bm": 0,
            "ind": 0,
            "shapes": [
                {
                    "nm": "ffffffff",
                    "ty": "gr",
                    "it": [
                        {
                            "ty": "rc",
                            "d": 1,
                            "p": {
                                "k": [
                                    12,
                                    2.5
                                ],
                                "a": 0
                            },
                            "s": {
                                "k": [
                                    22,
                                    1
                                ],
                                "a": 0
                            },
                            "r": {
                                "k": 0,
                                "a": 0
                            }
                        },
                        {
                            "ty": "rc",
                            "d": 1,
                            "p": {
                                "k": [
                                    13,
                                    23.5
                                ],
                                "a": 0
                            },
                            "s": {
                                "k": [
                                    18,
                                    1
                                ],
                                "a": 0
                            },
                            "r": {
                                "k": 0,
                                "a": 0
                            }
                        },
                        {
                            "ty": "rc",
                            "d": 1,
                            "p": {
                                "k": [
                                    12,
                                    11.5
                                ],
                                "a": 0
                            },
                            "s": {
                                "k": [
                                    24,
                                    17
                                ],
                                "a": 0
                            },
                            "r": {
                                "k": 0,
                                "a": 0
                            }
                        },
                        {
                            "ty": "rc",
                            "d": 1,
                            "p": {
                                "k": [
                                    12.5,
                                    20.5
                                ],
                                "a": 0
                            },
                            "s": {
                                "k": [
                                    23,
                                    1
                                ],
                                "a": 0
                            },
                            "r": {
                                "k": 0,
                                "a": 0
                            }
                        },
                        {
                            "ty": "rc",
                            "d": 1,
                            "p": {
                                "k": [
                                    12,
                                    21.5
                                ],
                                "a": 0
                            },
                            "s": {
                                "k": [
                                    22,
                                    1
                                ],
                                "a": 0
                            },
                            "r": {
                                "k": 0,
                                "a": 0
                            }
                        },
                        {
                            "ty": "rc",
                            "d": 1,
                            "p": {
                                "k": [
                                    12.5,
                                    22.5
                                ],
                                "a": 0
                            },
                            "s": {
                                "k": [
                                    21,
                                    1
                                ],
                                "a": 0
                            },
                            "r": {
                                "k": 0,
                                "a": 0
                            }
                        },
                        {
                            "ty": "rc",
                            "d": 1,
                            "p": {
                                "k": [
                                    11,
                                    0.5
                                ],
                                "a": 0
                            },
                            "s": {
                                "k": [
                                    18,
                                    1
                                ],
                                "a": 0
                            },
                            "r": {
                                "k": 0,
                                "a": 0
                            }
                        },
                        {
                            "ty": "rc",
                            "d": 1,
                            "p": {
                                "k": [
                                    11.5,
                                    1.5
                                ],
                                "a": 0
                            },
                            "s": {
                                "k": [
                                    21,
                                    1
                                ],
                                "a": 0
                            },
                            "r": {
                                "k": 0,
                                "a": 0
                            }
                        },
                        {
                            "ty": "fl",
                            "o": {
                                "k": 100,
                                "a": 0
                            },
                            "c": {
                                "k": [
                                    1,
                                    1,
                                    1,
                                    1
                                ],
                                "a": 0
                            }
                        },
                        {
                            "ty": "st",
                            "lc": 2,
                            "lj": 2,
                            "ml": 0,
                            "o": {
                                "k": 100,
                                "a": 0
                            },
                            "w": {
                                "k": 0.1,
                                "a": 0
                            },
                            "c": {
                                "k": [
                                    1,
                                    1,
                                    1,
                                    1
                                ],
                                "a": 0
                            }
                        },
                        {
                            "ty": "tr",
                            "a": {
                                "k": [
                                    0,
                                    0
                                ],
                                "a": 0
                            },
                            "p": {
                                "k": [
                                    0,
                                    0
                                ],
                                "a": 0
                            },
                            "s": {
                                "k": [
                                    100,
                                    100
                                ],
                                "a": 0
                            },
                            "r": {
                                "k": 0,
                                "a": 0
                            },
                            "o": {
                                "k": 100,
                                "a": 0
                            },
                            "sk": {
                                "k": 0,
                                "a": 0
                            },
                            "sa": {
                                "k": 0,
                                "a": 0
                            }
                        }
                    ]
                }
            ]
        },
        {
            "ddd": 0,
            "ty": 4,
            "sr": 1,
            "ks": {
                "a": {
                    "k": [
                        0,
                        0
                    ],
                    "a": 0
                },
                "p": {
                    "k": [
                        0,
                        0
                    ],
                    "a": 0
                },
                "s": {
                    "k": [
                        100,
                        100
                    ],
                    "a": 0
                },
                "r": {
                    "k": 0,
                    "a": 0
                },
                "o": {
                    "k": 100,
                    "a": 0
                },
                "sk": {
                    "k": 0,
                    "a": 0
                },
                "sa": {
                    "k": 0,
                    "a": 0
                }
            },
            "ao": 0,
            "ip": 0.6,
            "op": 1.2,
            "st": 0,
            "bm": 0,
            "ind": 1,
            "shapes": [
                {
                    "nm": "ffffffff",
                    "ty": "gr",
                    "it": [
                        {
                            "ty": "rc",
                            "d": 1,
                            "p": {
                                "k": [
                                    11.5,
                                    21
                                ],
                                "a": 0
                            },
                            "s": {
                                "k": [
                                    23,
                                    2
                                ],
                                "a": 0
                            },
                            "r": {
                                "k": 0,
                                "a": 0
                            }
                        },
                        {
                            "ty": "rc",
                            "d": 1,
                            "p": {
                                "k": [
                                    12.5,
                                    0.5
                                ],
                                "a": 0
                            },
                            "s": {
                                "k": [
                                    17,
                                    1
                                ],
                                "a": 0
                            },
                            "r": {
                                "k": 0,
                                "a": 0
                            }
                        },
                        {
                            "ty": "rc",
                            "d": 1,
                            "p": {
                                "k": [
                                    11.5,
                                    22.5
                                ],
                                "a": 0
                            },
                            "s": {
                                "k": [
                                    21,
                                    1
                                ],
                                "a": 0
                            },
                            "r": {
                                "k": 0,
                                "a": 0
                            }
                        },
                        {
                            "ty": "rc",
                            "d": 1,
                            "p": {
                                "k": [
                                    11.5,
                                    23.5
                                ],
                                "a": 0
                            },
                            "s": {
                                "k": [
                                    17,
                                    1
                                ],
                                "a": 0
                            },
                            "r": {
                                "k": 0,
                                "a": 0
                            }
                        },
                        {
                            "ty": "rc",
                            "d": 1,
                            "p": {
                                "k": [
                                    12,
                                    1.5
                                ],
                                "a": 0
                            },
                            "s": {
                                "k": [
                                    22,
                                    1
                                ],
                                "a": 0
                            },
                            "r": {
                                "k": 0,
                                "a": 0
                            }
                        },
                        {
                            "ty": "rc",
                            "d": 1,
                            "p": {
                                "k": [
                                    12,
                                    11
                                ],
                                "a": 0
                            },
                            "s": {
                                "k": [
                                    24,
                                    18
                                ],
                                "a": 0
                            },
                            "r": {
                                "k": 0,
                                "a": 0
                            }
                        },
                        {
                            "ty": "fl",
                            "o": {
                                "k": 100,
                                "a": 0
                            },
                            "c": {
                                "k": [
                                    1,
                                    1,
                                    1,
                                    1
                                ],
                                "a": 0
                            }
                        },
                        {
                            "ty": "st",
                            "lc": 2,
                            "lj": 2,
                            "ml": 0,
                            "o": {
                                "k": 100,
                                "a": 0
                            },
                            "w": {
                                "k": 0.1,
                                "a": 0
                            },
                            "c": {
                                "k": [
                                    1,
                                    1,
                                    1,
                                    1
                                ],
                                "a": 0
                            }
                        },
                        {
                            "ty": "tr",
                            "a": {
                                "k": [
                                    0,
                                    0
                                ],
                                "a": 0
                            },
                            "p": {
                                "k": [
                                    0,
                                    0
                                ],
                                "a": 0
                            },
                            "s": {
                                "k": [
                                    100,
                                    100
                                ],
                                "a": 0
                            },
                            "r": {
                                "k": 0,
                                "a": 0
                            },
                            "o": {
                                "k": 100,
                                "a": 0
                            },
                            "sk": {
                                "k": 0,
                                "a": 0
                            },
                            "sa": {
                                "k": 0,
                                "a": 0
                            }
                        }
                    ]
                }
            ]
        },
        {
            "ddd": 0,
            "ty": 4,
            "sr": 1,
            "ks": {
                "a": {
                    "k": [
                        0,
                        0
                    ],
                    "a": 0
                },
                "p": {
                    "k": [
                        0,
                        0
                    ],
                    "a": 0
                },
                "s": {
                    "k": [
                        100,
                        100
                    ],
                    "a": 0
                },
                "r": {
                    "k": 0,
                    "a": 0
                },
                "o": {
                    "k": 100,
                    "a": 0
                },
                "sk": {
                    "k": 0,
                    "a": 0
                },
                "sa": {
                    "k": 0,
                    "a": 0
                }
            },
            "ao": 0,
            "ip": 1.2,
            "op": 1.8,
            "st": 0,
            "bm": 0,
            "ind": 2,
            "shapes": [
                {
                    "nm": "ffffffff",
                    "ty": "gr",
                    "it": [
                        {
                            "ty": "rc",
                            "d": 1,
                            "p": {
                                "k": [
                                    11.5,
                                    23.5
                                ],
                                "a": 0
                            },
                            "s": {
                                "k": [
                                    17,
                                    1
                                ],
                                "a": 0
                            },
                            "r": {
                                "k": 0,
                                "a": 0
                            }
                        },
                        {
                            "ty": "rc",
                            "d": 1,
                            "p": {
                                "k": [
                                    12.5,
                                    20.5
                                ],
                                "a": 0
                            },
                            "s": {
                                "k": [
                                    23,
                                    1
                                ],
                                "a": 0
                            },
                            "r": {
                                "k": 0,
                                "a": 0
                            }
                        },
                        {
                            "ty": "rc",
                            "d": 1,
                            "p": {
                                "k": [
                                    13.5,
                                    0.5
                                ],
                                "a": 0
                            },
                            "s": {
                                "k": [
                                    17,
                                    1
                                ],
                                "a": 0
                            },
                            "r": {
                                "k": 0,
                                "a": 0
                            }
                        },
                        {
                            "ty": "rc",
                            "d": 1,
                            "p": {
                                "k": [
                                    12,
                                    21.5
                                ],
                                "a": 0
                            },
                            "s": {
                                "k": [
                                    22,
                                    1
                                ],
                                "a": 0
                            },
                            "r": {
                                "k": 0,
                                "a": 0
                            }
                        },
                        {
                            "ty": "rc",
                            "d": 1,
                            "p": {
                                "k": [
                                    12.5,
                                    1.5
                                ],
                                "a": 0
                            },
                            "s": {
                                "k": [
                                    21,
                                    1
                                ],
                                "a": 0
                            },
                            "r": {
                                "k": 0,
                                "a": 0
                            }
                        },
                        {
                            "ty": "rc",
                            "d": 1,
                            "p": {
                                "k": [
                                    12,
                                    2.5
                                ],
                                "a": 0
                            },
                            "s": {
                                "k": [
                                    22,
                                    1
                                ],
                                "a": 0
                            },
                            "r": {
                                "k": 0,
                                "a": 0
                            }
                        },
                        {
                            "ty": "rc",
                            "d": 1,
                            "p": {
                                "k": [
                                    11.5,
                                    3.5
                                ],
                                "a": 0
                            },
                            "s": {
                                "k": [
                                    23,
                                    1
                                ],
                                "a": 0
                            },
                            "r": {
                                "k": 0,
                                "a": 0
                            }
                        },
                        {
                            "ty": "rc",
                            "d": 1,
                            "p": {
                                "k": [
                                    12,
                                    12
                                ],
                                "a": 0
                            },
                            "s": {
                                "k": [
                                    24,
                                    16
                                ],
                                "a": 0
                            },
                            "r": {
                                "k": 0,
                                "a": 0
                            }
                        },
                        {
                            "ty": "rc",
                            "d": 1,
                            "p": {
                                "k": [
                                    11.5,
                                    22.5
                                ],
                                "a": 0
                            },
                            "s": {
                                "k": [
                                    21,
                                    1
                                ],
                                "a": 0
                            },
                            "r": {
                                "k": 0,
                                "a": 0
                            }
                        },
                        {
                            "ty": "fl",
                            "o": {
                                "k": 100,
                                "a": 0
                            },
                            "c": {
                                "k": [
                                    1,
                                    1,
                                    1,
                                    1
                                ],
                                "a": 0
                            }
                        },
                        {
                            "ty": "st",
                            "lc": 2,
                            "lj": 2,
                            "ml": 0,
                            "o": {
                                "k": 100,
                                "a": 0
                            },
                            "w": {
                                "k": 0.1,
                                "a": 0
                            },
                            "c": {
                                "k": [
                                    1,
                                    1,
                                    1,
                                    1
                                ],
                                "a": 0
                            }
                        },
                        {
                            "ty": "tr",
                            "a": {
                                "k": [
                                    0,
                                    0
                                ],
                                "a": 0
                            },
                            "p": {
                                "k": [
                                    0,
                                    0
                                ],
                                "a": 0
                            },
                            "s": {
                                "k": [
                                    100,
                                    100
                                ],
                                "a": 0
                            },
                            "r": {
                                "k": 0,
                                "a": 0
                            },
                            "o": {
                                "k": 100,
                                "a": 0
                            },
                            "sk": {
                                "k": 0,
                                "a": 0
                            },
                            "sa": {
                                "k": 0,
                                "a": 0
                            }
                        }
                    ]
                }
            ]
        }
    ],
    "v": "5.5.2",
    "fr": 60,
    "ip": 0,
    "op": 1.8,
    "w": 24,
    "h": 24,
    "ddd": 0,
    "assets": []
}