<?xml version="1.0" encoding="UTF-8" standalone="no"?>
<!-- Created with Inkscape (http://www.inkscape.org/) -->

<svg
   xmlns:dc="http://purl.org/dc/elements/1.1/"
   xmlns:cc="http://creativecommons.org/ns#"
   xmlns:rdf="http://www.w3.org/1999/02/22-rdf-syntax-ns#"
   xmlns:svg="http://www.w3.org/2000/svg"
   xmlns="http://www.w3.org/2000/svg"
   xmlns:xlink="http://www.w3.org/1999/xlink"
   xmlns:sodipodi="http://sodipodi.sourceforge.net/DTD/sodipodi-0.dtd"
   xmlns:inkscape="http://www.inkscape.org/namespaces/inkscape"
   width="128"
   height="128"
   viewBox="0 0 128 128"
   version="1.1"
   id="svg4575"
   inkscape:version="0.92+devel (unknown)"
   sodipodi:docname="icon_audio_file.svg"
   inkscape:export-filename="/home/melano/Pictures/Dragons/Glax/stickers/icons/512x512/icon_audio_file.png"
   inkscape:export-xdpi="384"
   inkscape:export-ydpi="384">
  <defs
     id="defs4569">
    <linearGradient
       inkscape:collect="always"
       id="linearGradient847">
      <stop
         style="stop-color:#ff9300;stop-opacity:1"
         offset="0"
         id="stop843" />
      <stop
         id="stop908"
         offset="0.53872436"
         style="stop-color:#a50000;stop-opacity:1" />
      <stop
         style="stop-color:#ff9300;stop-opacity:1"
         offset="1"
         id="stop845" />
    </linearGradient>
    <linearGradient
       inkscape:collect="always"
       id="linearGradient841">
      <stop
         style="stop-color:#def0ff;stop-opacity:1"
         offset="0"
         id="stop837" />
      <stop
         style="stop-color:#ffffff;stop-opacity:1"
         offset="1"
         id="stop839" />
    </linearGradient>
    <linearGradient
       inkscape:collect="always"
       xlink:href="#linearGradient841"
       id="linearGradient843"
       x1="18.474464"
       y1="125.76379"
       x2="94.563187"
       y2="12.901051"
       gradientUnits="userSpaceOnUse"
       gradientTransform="matrix(1.0115138,0,0,1.0115138,16.281052,262.58918)" />
    <linearGradient
       inkscape:collect="always"
       xlink:href="#linearGradient847"
       id="linearGradient903"
       gradientUnits="userSpaceOnUse"
       gradientTransform="matrix(-3.7795265,0,0,-3.7795265,39.428371,1125.8452)"
       x1="-14.902883"
       y1="290.89694"
       x2="-14.902883"
       y2="270.96494" />
    <linearGradient
       inkscape:collect="always"
       xlink:href="#linearGradient847"
       id="linearGradient924"
       gradientUnits="userSpaceOnUse"
       gradientTransform="matrix(-3.7795265,0,0,-3.7795265,58.873819,1125.8452)"
       x1="-14.902883"
       y1="290.89694"
       x2="-14.902883"
       y2="270.96494" />
    <linearGradient
       inkscape:collect="always"
       xlink:href="#linearGradient847"
       id="linearGradient926"
       gradientUnits="userSpaceOnUse"
       gradientTransform="matrix(-3.7795265,0,0,-3.7795265,54.984741,1125.8452)"
       x1="-14.902883"
       y1="290.89694"
       x2="-14.902883"
       y2="270.96494" />
    <linearGradient
       inkscape:collect="always"
       xlink:href="#linearGradient847"
       id="linearGradient928"
       gradientUnits="userSpaceOnUse"
       gradientTransform="matrix(-3.7795265,0,0,-3.7795265,51.095647,1125.8452)"
       x1="-14.902883"
       y1="290.89694"
       x2="-14.902883"
       y2="270.96494" />
    <linearGradient
       inkscape:collect="always"
       xlink:href="#linearGradient847"
       id="linearGradient930"
       gradientUnits="userSpaceOnUse"
       gradientTransform="matrix(-3.7795265,0,0,-3.7795265,47.206557,1125.8452)"
       x1="-14.902883"
       y1="290.89694"
       x2="-14.902883"
       y2="270.96494" />
    <linearGradient
       inkscape:collect="always"
       xlink:href="#linearGradient847"
       id="linearGradient932"
       gradientUnits="userSpaceOnUse"
       gradientTransform="matrix(-3.7795265,0,0,-3.7795265,43.317458,1125.8452)"
       x1="-14.902883"
       y1="290.89694"
       x2="-14.902883"
       y2="270.96494" />
    <linearGradient
       inkscape:collect="always"
       xlink:href="#linearGradient847"
       id="linearGradient934"
       gradientUnits="userSpaceOnUse"
       gradientTransform="matrix(-3.7795265,0,0,-3.7795265,35.539276,1125.8452)"
       x1="-14.902883"
       y1="290.89694"
       x2="-14.902883"
       y2="270.96494" />
  </defs>
  <sodipodi:namedview
     id="base"
     pagecolor="#ffffff"
     bordercolor="#666666"
     borderopacity="1.0"
     inkscape:pageopacity="0.0"
     inkscape:pageshadow="2"
     inkscape:zoom="1.4"
     inkscape:cx="-375.6293"
     inkscape:cy="78.692286"
     inkscape:document-units="px"
     inkscape:current-layer="layer1"
     showgrid="false"
     units="px"
     inkscape:pagecheckerboard="true"
     inkscape:window-width="2408"
     inkscape:window-height="1411"
     inkscape:window-x="30"
     inkscape:window-y="0"
     inkscape:window-maximized="1"
     inkscape:document-rotation="0"
     inkscape:snap-bbox="false"
     inkscape:snap-bbox-midpoints="true"
     inkscape:snap-object-midpoints="true"
     inkscape:snap-global="false"
     inkscape:snap-smooth-nodes="true"
     showguides="false"
     inkscape:guide-bbox="true"
     borderlayer="true">
    <sodipodi:guide
       position="-39.815647,17.016258"
       orientation="0,-1"
       id="guide887" />
  </sodipodi:namedview>
  <metadata
     id="metadata4572">
    <rdf:RDF>
      <cc:Work
         rdf:about="">
        <dc:format>image/svg+xml</dc:format>
        <dc:type
           rdf:resource="http://purl.org/dc/dcmitype/StillImage" />
        <dc:title />
      </cc:Work>
    </rdf:RDF>
  </metadata>
  <g
     inkscape:label="Layer 1"
     inkscape:groupmode="layer"
     id="layer1"
     transform="translate(0,-263.13333)"
     style="display:inline">
    <path
       style="fill:url(#linearGradient843);fill-opacity:1;stroke:#000000;stroke-width:2.02303;stroke-linecap:round;stroke-linejoin:round;stroke-miterlimit:10"
       d="M 100.60812,264.33759 H 35.0474 v 125.97697 h 91.94108 v -99.59464 h -26.38036 z"
       id="path818"
       inkscape:connector-curvature="0" />
    <path
       style="fill:#ffffff;stroke:#000000;stroke-width:2.02303;stroke-linecap:round;stroke-linejoin:round;stroke-miterlimit:10"
       d="m 100.60827,264.33759 v 26.38233 h 26.38036 z"
       id="rect812"
       inkscape:connector-curvature="0"
       sodipodi:nodetypes="cccc" />
  </g>
  <g
     inkscape:groupmode="layer"
     id="layer2"
     inkscape:label="wave">
    <g
       id="g889"
       transform="translate(-7.5698399)">
      <path
         inkscape:connector-curvature="0"
         id="path922"
         d="M 53.037829,66.777801 V 45.115482"
         style="opacity:1;fill:none;fill-opacity:1;stroke:url(#linearGradient924);stroke-width:6.49999;stroke-linecap:round;stroke-linejoin:round;stroke-miterlimit:4;stroke-dasharray:none;stroke-opacity:1;stop-opacity:1" />
      <path
         inkscape:connector-curvature="0"
         id="path920"
         d="M 64.989864,66.777801 V 30.349553"
         style="opacity:1;fill:none;fill-opacity:1;stroke:url(#linearGradient926);stroke-width:6.49999;stroke-linecap:round;stroke-linejoin:round;stroke-miterlimit:4;stroke-dasharray:none;stroke-opacity:1;stop-opacity:1" />
      <path
         inkscape:connector-curvature="0"
         id="path918"
         d="M 76.941888,66.777801 V 35.905154"
         style="opacity:1;fill:none;fill-opacity:1;stroke:url(#linearGradient928);stroke-width:6.49999;stroke-linecap:round;stroke-linejoin:round;stroke-miterlimit:4;stroke-dasharray:none;stroke-opacity:1;stop-opacity:1" />
      <path
         inkscape:connector-curvature="0"
         id="path916"
         d="M 88.893923,66.777801 V 48.831588"
         style="opacity:1;fill:none;fill-opacity:1;stroke:url(#linearGradient930);stroke-width:6.49999;stroke-linecap:round;stroke-linejoin:round;stroke-miterlimit:4;stroke-dasharray:none;stroke-opacity:1;stop-opacity:1" />
      <path
         inkscape:connector-curvature="0"
         id="path914"
         d="M 100.84595,66.777801 V 58.90191"
         style="opacity:1;fill:none;fill-opacity:1;stroke:url(#linearGradient932);stroke-width:6.49999;stroke-linecap:round;stroke-linejoin:round;stroke-miterlimit:4;stroke-dasharray:none;stroke-opacity:1;stop-opacity:1" />
      <path
         inkscape:connector-curvature="0"
         id="path912"
         d="M 124.75,66.777801 V 97.650447"
         style="opacity:1;fill:none;fill-opacity:1;stroke:url(#linearGradient934);stroke-width:6.49999;stroke-linecap:round;stroke-linejoin:round;stroke-miterlimit:4;stroke-dasharray:none;stroke-opacity:1;stop-opacity:1" />
      <path
         inkscape:connector-curvature="0"
         id="path895"
         d="M 112.79797,66.777801 V 84.724013"
         style="opacity:1;fill:none;fill-opacity:1;stroke:url(#linearGradient903);stroke-width:6.49999;stroke-linecap:round;stroke-linejoin:round;stroke-miterlimit:4;stroke-dasharray:none;stroke-opacity:1;stop-opacity:1" />
    </g>
  </g>
  <g
     inkscape:groupmode="layer"
     id="layer3"
     inkscape:label="durg"
     style="display:inline">
    <path
       style="fill:#fa8cab;stroke:#fb6e98;stroke-width:2;stroke-linecap:round;stroke-linejoin:round;stroke-miterlimit:4;stroke-dasharray:none"
       d="m 35.135716,64.761904 c -1.069849,1.78699 -0.734024,7.436485 -0.02271,8.85212 0.71131,1.415634 -9.940109,2.460632 -9.940109,2.460632 L 22.605689,65.312032 Z"
       id="path888"
       inkscape:connector-curvature="0"
       sodipodi:nodetypes="csccc" />
    <path
       style="fill:#e84577;stroke:#c12e53;stroke-width:2;stroke-linecap:round;stroke-linejoin:round;stroke-miterlimit:4;stroke-dasharray:none"
       d="m 27.541004,70.80784 c 5.559157,-1.218156 12.604812,3.188508 15.357594,3.710838 2.752782,0.52233 4.859873,-1.020717 5.835374,-0.07702 0.9755,0.943694 -3.325125,5.37136 -4.833182,5.436248 -1.508057,0.06489 -17.1755,-1.199115 -18.784359,-4.898262 -1.60886,-3.699147 2.424573,-4.171801 2.424573,-4.171801 z"
       id="path886"
       inkscape:connector-curvature="0"
       sodipodi:nodetypes="cssssc" />
    <path
       style="fill:#fa8cab;stroke:#fb6e98;stroke-width:2;stroke-linecap:round;stroke-linejoin:round;stroke-miterlimit:4;stroke-dasharray:none"
       d="m 32.129599,65.197703 c -1.516342,3.391342 0.04439,10.14304 0.04439,10.14304 l -9.094802,0.448992 -5.359661,-8.6246 z"
       id="path884"
       inkscape:connector-curvature="0"
       sodipodi:nodetypes="ccccc" />
    <path
       sodipodi:nodetypes="ccc"
       inkscape:connector-curvature="0"
       id="path880"
       d="m 10.070384,54.79494 c -4.715339,0.907644 -18.054097,4.674219 -23.90785,9.965419 6.6394147,-1.054995 18.5786566,-2.745272 23.975121,-3.079803"
       style="display:inline;opacity:1;fill:#3a3c3f;stroke:#2d2d2d;stroke-width:2;stroke-linecap:round;stroke-linejoin:round;stroke-miterlimit:10;stroke-dasharray:none"
       inkscape:transform-center-x="14.129881"
       inkscape:transform-center-y="-1.5646997" />
    <path
       sodipodi:nodetypes="cccc"
       inkscape:connector-curvature="0"
       id="path882"
       d="m 14.335558,54.601131 c -2.458879,-0.502194 -6.0535491,-0.06188 -7.1572937,0.381566 -0.4685716,1.938122 -0.9547064,6.453375 -0.4281503,7.169489 1.4183502,0.408257 2.6847138,0.355941 4.663993,0.110838"
       style="display:inline;opacity:1;fill:#295aa8;stroke:#1d2d48;stroke-width:2;stroke-linecap:round;stroke-linejoin:round;stroke-miterlimit:10;stroke-dasharray:none"
       inkscape:transform-center-x="1.8513576"
       inkscape:transform-center-y="-0.2024823" />
    <path
       style="display:inline;opacity:1;fill:#295aa8;stroke:none;stroke-width:1.73373;stroke-linecap:round;stroke-linejoin:round;stroke-miterlimit:10;stroke-dasharray:none"
       d="M 5.9877566,66.038775 C 2.7168846,67.822558 -6.6885215,74.917894 -15.382799,83.303243 L 1.228999,93.643517 C 5.0292559,88.842057 15.421148,80.679153 16.982422,79.8141 18.745236,77.218222 14.180119,64.462359 5.9877566,66.038775 Z"
       id="path900"
       inkscape:connector-curvature="0"
       sodipodi:nodetypes="ccccc"
       inkscape:transform-center-x="6.1308"
       inkscape:transform-center-y="-13.78385" />
    <path
       style="display:inline;opacity:1;fill:#295aa8;stroke:none;stroke-width:1.73373;stroke-linecap:round;stroke-linejoin:round;stroke-miterlimit:10;stroke-dasharray:none"
       d="m 18.805214,79.127903 c 3.010504,-4.696755 4.081951,-8.773691 5.600605,-10.27251 2.685467,-2.650392 14.763249,-3.591629 20.240332,-6.783355 1.28168,-0.746887 3.201322,-4.012495 3.252117,-4.491203 0.26786,-2.524402 -2.8222,-7.411139 -6.158041,-7.288158 -2.577143,0.09501 -9.279035,3.890528 -11.689494,3.713043 C 27.517224,53.819159 22.457615,51.460605 16.287945,53.238394 9.0247873,55.331264 5.6859141,59.817742 5.7465471,67.29095"
       id="path870"
       inkscape:connector-curvature="0"
       inkscape:transform-center-x="-5.0286262"
       inkscape:transform-center-y="5.4606097" />
    <path
       inkscape:connector-curvature="0"
       style="display:inline;opacity:1;fill:#a0c4f4;stroke:none;stroke-width:1.73373;stroke-linecap:round;stroke-linejoin:round;stroke-miterlimit:10;stroke-dasharray:none"
       d="M 12.42374,76.686557 C 7.5459392,79.954238 1.7046041,85.334119 -1.314719,87.585329 -2.3940039,88.700766 -2.3423928,92.357757 -0.63123043,94.17407 3.8737281,89.585005 14.912381,80.957626 16.368875,80.23198 18.777612,78.099219 15.653737,74.522755 12.42374,76.686557 Z"
       id="path868"
       sodipodi:nodetypes="scccs"
       inkscape:transform-center-x="-1.9334364"
       inkscape:transform-center-y="-18.283776" />
    <path
       style="display:inline;opacity:1;fill:#233275;stroke:none;stroke-width:1.73373;stroke-linecap:round;stroke-linejoin:round;stroke-miterlimit:10;stroke-dasharray:none"
       d="m 9.8698942,64.911672 c 0.5574708,-1.871085 1.0563598,-3.66742 1.6143098,-4.915434 1.239551,-2.772611 9.535283,-5.59168 7.667473,-7.062918 -0.41214,-0.465226 -2.238084,0.0093 -2.863079,0.304813 -7.2631587,2.092874 -11.43493,7.226583 -11.3742966,14.699795"
       id="path896"
       inkscape:connector-curvature="0"
       inkscape:transform-center-x="9.6324964"
       inkscape:transform-center-y="9.798853"
       sodipodi:nodetypes="csccc" />
    <path
       style="display:inline;opacity:1;fill:#233275;stroke:none;stroke-width:1.73373;stroke-linecap:round;stroke-linejoin:round;stroke-miterlimit:10;stroke-dasharray:none"
       d="m 5.0403871,66.453702 c -3.345744,1.639045 -12.1060046,7.851664 -21.1586431,15.848817 l 3.634852,2.489337 c 0.103812,-0.102728 0.207052,-0.207357 0.305874,-0.326775 3.9741075,-4.802505 16.1391344,-12.059706 18.932072,-14.283108 2.6756578,-2.130038 3.0002185,-3.584982 3.752873,-5.684731"
       id="path875"
       inkscape:connector-curvature="0"
       inkscape:transform-center-x="9.9240091"
       inkscape:transform-center-y="-8.6544696"
       sodipodi:nodetypes="ccccsc" />
    <path
       sodipodi:nodetypes="csscsccc"
       inkscape:connector-curvature="0"
       d="m 22.096608,69.747558 c 5.035362,1.061169 8.169962,4.229633 9.710735,5.216008 4.027608,2.578403 9.085444,3.392919 10.971494,3.64479 1.764944,0.235696 2.957051,0.09118 3.74856,-0.641117 -0.479851,1.865946 -1.237735,4.199929 -2.030787,4.825041 -1.993684,1.57149 -5.64045,-0.03076 -8.146165,-0.443267 -2.105385,-0.346594 -21.109338,-1.492403 -23.719401,-8.008321 -0.266388,-2.341608 2.028002,-6.97847 9.465564,-4.593134 z"
       style="fill:#a0c4f4;stroke:none;stroke-width:2;stroke-linecap:round;stroke-linejoin:round;stroke-miterlimit:4;stroke-dasharray:none"
       id="path876" />
    <path
       style="display:inline;opacity:1;fill:none;stroke:#1d2d48;stroke-width:2;stroke-linecap:round;stroke-linejoin:round;stroke-miterlimit:10;stroke-dasharray:none"
       d="M -1.821418,95.551865 C 2.1096253,92.010362 15.3031,79.803416 18.220572,78.914586"
       id="path864"
       inkscape:connector-curvature="0"
       inkscape:transform-center-x="-1.3922236"
       inkscape:transform-center-y="-20.670221"
       sodipodi:nodetypes="cc" />
    <ellipse
       style="display:inline;opacity:1;fill:#ffffff;stroke:none;stroke-width:1.73373;stroke-linecap:round;stroke-linejoin:round;stroke-miterlimit:10;stroke-dasharray:none"
       id="path866"
       cx="-0.81502444"
       cy="63.283131"
       rx="4.4438305"
       ry="3.6246531"
       transform="rotate(-18.557583)"
       inkscape:transform-center-x="2.4338012"
       inkscape:transform-center-y="9.9176929" />
    <path
       style="display:inline;opacity:1;fill:#1d2d48;stroke:none;stroke-width:1.84491;stroke-linecap:round;stroke-linejoin:round;stroke-miterlimit:10"
       d="m 35.085601,56.469604 c 1.306529,-0.487264 2.051289,-1.246012 3.272003,-1.33436 0.945189,-0.06834 1.821951,-0.140598 2.432874,-0.23041 0.346966,-0.05109 0.84547,1.15817 0.571752,1.445482 -0.744888,0.781872 -1.76947,0.307537 -2.851296,0.574843 -0.388121,0.09595 -0.89841,0.473242 -1.197579,0.577385 -1.037596,0.361182 -2.289725,-0.26253 -2.227755,-1.032941 z"
       id="path853"
       inkscape:connector-curvature="0"
       sodipodi:nodetypes="cssssscc"
       inkscape:transform-center-x="-16.460798"
       inkscape:transform-center-y="13.914243" />
    <ellipse
       style="display:inline;opacity:1;fill:#f01d0a;stroke:none;stroke-width:0.590846;stroke-linecap:round;stroke-linejoin:round;stroke-miterlimit:10;stroke-dasharray:none"
       id="path855"
       cx="49.791031"
       cy="39.608482"
       rx="1.879907"
       ry="1.8205818"
       transform="rotate(31.621939)"
       inkscape:transform-center-x="-2.9651086"
       inkscape:transform-center-y="0.56846647" />
    <path
       style="fill:none;stroke:#1d2d48;stroke-width:2;stroke-linecap:round;stroke-linejoin:round;stroke-miterlimit:4;stroke-dasharray:none"
       d="M 4.8290398,66.502535 C 1.4832954,68.141584 -7.4950365,74.762746 -15.642867,81.919463"
       id="path892"
       inkscape:connector-curvature="0"
       inkscape:transform-center-x="12.525501"
       inkscape:transform-center-y="-8.2209196" />
    <path
       style="fill:none;stroke:#1d2d48;stroke-width:2;stroke-linecap:round;stroke-linejoin:round;stroke-miterlimit:4;stroke-dasharray:none"
       d="m 21.753081,70.050575 c 6.835238,-3.537153 16.489008,-5.738535 18.166847,-6.053981 2.699835,-0.507588 5.05988,-1.894539 5.863041,-4.494054 0.445551,-1.442073 1.696936,-0.75032 1.535508,-2.141954 -0.125139,-2.535487 -2.773401,-7.052169 -6.109241,-6.929188 -2.577143,0.09501 -8.839824,3.494059 -11.428743,3.567175 -2.539351,0.0719 -6.181758,-3.066202 -12.351426,-1.288416 -7.263157,2.092872 -12.77242,7.845312 -12.7117861,15.318519"
       id="path904"
       inkscape:connector-curvature="0"
       inkscape:transform-center-x="-4.2232798"
       inkscape:transform-center-y="9.9300044" />
    <path
       style="fill:none;stroke:#1d2d48;stroke-width:2;stroke-linecap:round;stroke-linejoin:round;stroke-miterlimit:4;stroke-dasharray:none"
       d="m 12.631044,74.340692 c 2.610063,6.515918 20.562318,8.030439 22.667701,8.377035 2.505716,0.412501 6.688399,1.851706 8.682083,0.280215 0.793053,-0.625111 1.317192,-2.449365 1.797043,-4.315312 -0.673933,0.377755 -1.664509,0.503126 -3.429452,0.26743 -1.88605,-0.251872 -6.272159,-1.393384 -10.299768,-3.971787 -1.540772,-0.986374 -5.227709,-3.873335 -10.286833,-4.930884"
       id="path873"
       inkscape:connector-curvature="0" />
    <path
       style="display:inline;opacity:1;fill:#3a3c3f;stroke:#2d2d2d;stroke-width:2;stroke-linecap:round;stroke-linejoin:round;stroke-miterlimit:10;stroke-dasharray:none"
       d="M 7.6248161,59.057189 C 2.4535515,60.456967 -12.075774,65.750693 -18.151154,72.121769 -10.851338,70.398954 2.2925682,67.531052 8.2690466,66.712611"
       id="path859"
       inkscape:connector-curvature="0"
       sodipodi:nodetypes="ccc"
       inkscape:transform-center-x="17.221029"
       inkscape:transform-center-y="-7.3765292" />
    <path
       style="display:inline;opacity:1;fill:#295aa8;stroke:#1d2d48;stroke-width:2;stroke-linecap:round;stroke-linejoin:round;stroke-miterlimit:10;stroke-dasharray:none"
       d="m 12.354248,58.488859 c -2.7772917,-0.355424 -6.7403359,0.431728 -7.9317008,1.016382 -0.3610658,2.195107 -0.5285658,7.259022 0.1164965,8.012226 1.6118345,0.336891 3.0164669,0.173996 5.198356,-0.26235"
       id="path857"
       inkscape:connector-curvature="0"
       sodipodi:nodetypes="cccc"
       inkscape:transform-center-x="4.0512232"
       inkscape:transform-center-y="-4.8358719" />
  </g>
</svg>
