<?xml version="1.0" encoding="UTF-8" standalone="no"?>
<!-- Created with Inkscape (http://www.inkscape.org/) -->

<svg
   width="512"
   height="512"
   viewBox="0 0 512 512"
   version="1.1"
   id="svg4575"
   inkscape:version="1.1.2 (0a00cf5339, 2022-02-04)"
   sodipodi:docname="aperiodic.svg"
   inkscape:export-filename="../stickers/aperiodic-mono.png"
   inkscape:export-xdpi="96"
   inkscape:export-ydpi="96"
   xmlns:inkscape="http://www.inkscape.org/namespaces/inkscape"
   xmlns:sodipodi="http://sodipodi.sourceforge.net/DTD/sodipodi-0.dtd"
   xmlns:xlink="http://www.w3.org/1999/xlink"
   xmlns="http://www.w3.org/2000/svg"
   xmlns:svg="http://www.w3.org/2000/svg"
   xmlns:rdf="http://www.w3.org/1999/02/22-rdf-syntax-ns#"
   xmlns:cc="http://creativecommons.org/ns#"
   xmlns:dc="http://purl.org/dc/elements/1.1/">
  <defs
     id="defs4569" />
  <sodipodi:namedview
     id="base"
     pagecolor="#ffffff"
     bordercolor="#666666"
     borderopacity="1.0"
     inkscape:pageopacity="0.0"
     inkscape:pageshadow="2"
     inkscape:zoom="0.7"
     inkscape:cx="260.71429"
     inkscape:cy="196.42857"
     inkscape:document-units="px"
     inkscape:current-layer="layer4"
     showgrid="false"
     units="px"
     inkscape:pagecheckerboard="true"
     inkscape:window-width="2408"
     inkscape:window-height="1411"
     inkscape:window-x="30"
     inkscape:window-y="0"
     inkscape:window-maximized="1"
     inkscape:document-rotation="0"
     borderlayer="true"
     inkscape:snap-global="true"
     showguides="false"
     inkscape:guide-bbox="true"
     inkscape:snap-midpoints="true"
     inkscape:snap-center="true">
    <sodipodi:guide
       position="355.80269,868.19045"
       orientation="1,0"
       id="guide8247" />
    <sodipodi:guide
       position="306.92198,794.81509"
       orientation="0.86602531,0.50000017"
       id="guide8249" />
    <sodipodi:guide
       position="326.47427,794.81509"
       orientation="-0.8660259,0.49999915"
       id="guide8280" />
    <sodipodi:guide
       position="336.25041,856.90191"
       orientation="0.50000049,0.86602512"
       id="guide8369" />
    <sodipodi:guide
       position="297.14583,856.90191"
       orientation="0.50000086,-0.86602491"
       id="guide8429" />
    <sodipodi:guide
       position="355.80269,823.03638"
       orientation="0,-1"
       id="guide8460" />
    <sodipodi:guide
       position="349.28523,834.32492"
       orientation="-0.49999948,0.8660257"
       id="guide8462" />
    <sodipodi:guide
       position="297.14583,856.90191"
       orientation="0.8660253,0.50000018"
       id="guide8551" />
    <sodipodi:guide
       position="277.5936,868.19041"
       orientation="0,-1"
       id="guide8727" />
    <sodipodi:guide
       position="394.90721,834.32492"
       orientation="0,-1"
       id="guide8797" />
    <sodipodi:guide
       position="336.25041,789.17084"
       orientation="-0.49999986,-0.86602548"
       id="guide8879" />
    <sodipodi:guide
       position="297.14583,811.74787"
       orientation="-0.70710678,0.70710678"
       id="guide9227" />
    <sodipodi:guide
       position="277.59355,823.03638"
       orientation="-0.5,0.8660254"
       id="guide9471" />
    <sodipodi:guide
       position="302.03391,791.99296"
       orientation="-0.8660254,-0.5"
       id="guide9727" />
    <sodipodi:guide
       position="284.11096,834.32492"
       orientation="-0.5,0.8660254"
       id="guide9980" />
    <sodipodi:guide
       position="306.92197,839.96915"
       orientation="0,-1"
       id="guide10156" />
    <sodipodi:guide
       position="339.07253,794.05891"
       orientation="0.5,0.8660254"
       id="guide10433" />
    <sodipodi:guide
       position="394.90722,845.61344"
       orientation="-0.25881905,-0.96592583"
       id="guide11255" />
    <sodipodi:guide
       position="309.30746,811.24378"
       orientation="-0.70710678,-0.70710678"
       id="guide11596" />
  </sodipodi:namedview>
  <metadata
     id="metadata4572">
    <rdf:RDF>
      <cc:Work
         rdf:about="">
        <dc:format>image/svg+xml</dc:format>
        <dc:type
           rdf:resource="http://purl.org/dc/dcmitype/StillImage" />
      </cc:Work>
    </rdf:RDF>
  </metadata>
  <g
     inkscape:label="construction"
     inkscape:groupmode="layer"
     id="layer1"
     style="display:none">
    <path
       sodipodi:type="star"
       style="fill:none;stroke:#1d2848;stroke-width:3"
       id="path1935"
       inkscape:flatsided="true"
       sodipodi:sides="6"
       sodipodi:cx="6.0837159"
       sodipodi:cy="-292.37384"
       sodipodi:r1="45.154026"
       sodipodi:r2="39.104534"
       sodipodi:arg1="1.0471976"
       sodipodi:arg2="1.5707963"
       inkscape:rounded="0"
       inkscape:randomized="0"
       transform="translate(-60.747561,28.523022)"
       d="m 28.660727,-253.26931 -45.154026,0 -22.577011,-39.10453 22.577015,-39.10454 45.154026,1e-5 22.577011,39.10453 z" />
    <path
       style="fill:none;stroke:#1d2848;stroke-width:3"
       d="m -54.663846,-263.85081 -33.865518,-19.55226 11.288508,-19.55229 h 22.577012 22.577012 l 11.288504,19.55229 z"
       id="path2052" />
    <path
       style="fill:none;stroke:#1d2848;stroke-width:3"
       d="m 72.048784,-361.62833 19.552271,33.86551 -19.552279,11.28851 -19.552267,-11.28851 -19.552264,-11.2885 1.6e-5,-22.57701 z"
       id="path2312" />
    <path
       style="fill:none;stroke:#1d2848;stroke-width:3"
       d="m 111.15333,-293.89731 h 39.10452 l 1e-5,-22.57704 -19.55226,-11.28851 -19.55227,-11.2885 -19.552275,11.28854 z"
       id="path2314" />
    <path
       style="fill:none;stroke:#1d2848;stroke-width:3"
       d="m 32.94423,-293.89727 19.55226,-33.86555 19.552286,11.28851 -1.5e-5,22.57704 1.1e-5,22.57701 -19.552297,11.28851 z"
       id="path2316" />
    <path
       style="fill:none;stroke:#1d2848;stroke-width:3"
       d="m 111.15331,-293.89727 -19.552255,-33.86551 -19.552305,11.2885 1.1e-5,22.57701 1.1e-5,22.57701 19.552283,11.28851 z"
       id="path2318" />
    <path
       style="fill:none;stroke:#1d2848;stroke-width:3"
       d="m 188.71639,-441.99365 -39.10453,-22.57701 -19.55228,11.28854 -19.55227,-33.86551 H 71.40279 l -1.9e-5,22.57701 19.552237,11.2885 -19.552248,33.86555 19.552241,33.86552 19.552299,-11.28851 19.55228,11.28851 19.55226,-33.86552 39.10453,-4e-5 z"
       id="path2353" />
    <g
       id="layer2"
       inkscape:label="original"
       transform="translate(-181.00848,-121.98033)"
       inkscape:groupmode="layer"
       style="display:inline">
      <path
         style="fill:#3250b0;stroke:none;stroke-width:3"
         d="m 575.9157,-211.63311 -39.10453,-22.57701 -19.55228,11.28854 -19.55227,-33.86551 H 458.6021 l -2e-5,22.57701 19.55223,11.2885 -19.55224,33.86555 19.55224,33.86552 19.5523,-11.28851 19.55228,11.28851 19.55226,-33.86552 39.10453,-5e-5 z"
         id="path8209" />
      <path
         style="fill:#c4d9f5;stroke:none;stroke-width:3"
         d="m 575.91569,-200.34459 h -19.55236 l -19.55216,-11.2886 -6.51746,11.2886 -39.97777,23.08114 -23.85542,-23.85542 -7.85849,12.06282 19.55228,33.86554 19.5523,-11.28851 19.55227,11.2885 19.55229,-33.86553 h 39.10446 l 6e-5,-11.28854"
         id="path10761"
         sodipodi:nodetypes="ccccccccccccc" />
      <path
         style="fill:#292f75;stroke:none;stroke-width:3"
         d="m 458.60208,-234.21008 h 13.03481 l 6.51742,11.2885 19.55235,-11.2885 19.55223,11.2885 -19.55227,-33.86551 H 458.6021 Z"
         id="path8762" />
      <path
         style="fill:#3250b0;stroke:none;stroke-width:3"
         d="m 523.77628,-189.05605 -16.29353,28.22129 9.77613,5.64424 19.55229,-33.86553"
         id="path10843" />
      <path
         style="fill:#c4d9f5;stroke:none;stroke-width:3"
         d="m 520.08101,-160.07858 -9.77614,-5.64425 -2.82212,4.88807 9.77613,5.64424 z"
         id="path10431"
         inkscape:transform-center-x="15.521705"
         inkscape:transform-center-y="-13.034862"
         sodipodi:nodetypes="ccccc" />
      <path
         style="fill:none;stroke:#1d2848;stroke-width:3"
         d="m 575.9157,-211.63311 -39.10453,-22.57701 -19.55228,11.28854 -19.55227,-33.86551 H 458.6021 l -2e-5,22.57701 19.55223,11.2885 -19.55224,33.86555 19.55224,33.86552 19.5523,-11.28851 19.55228,11.28851 19.55226,-33.86552 39.10453,-5e-5 z"
         id="path2353-9" />
      <path
         style="fill:#3250b0;stroke:none;stroke-width:3"
         d="m 487.93045,-205.98882 6.75139,11.69375 -16.52753,16.52753 9.77615,16.93278 -9.77615,5.64425 -19.55228,-33.86554 6.51741,-11.28854 9.77609,-5.64423 z"
         id="path10993"
         sodipodi:nodetypes="ccccccccc" />
      <path
         style="fill:#c4d9f5;stroke:none;stroke-width:3"
         d="m 483.04238,-158.01263 -21.18164,-36.68769 -3.25871,5.64427 19.55228,33.86554 z"
         id="path10283" />
      <path
         style="fill:none;stroke:#1d2848;stroke-width:3"
         d="m 487.93045,-205.98882 6.75139,11.69375 -16.52753,16.52753 9.77615,16.93278 -9.77615,5.64425 -19.55228,-33.86554 6.51741,-11.28854 9.77609,-5.64423 z"
         id="path9159"
         sodipodi:nodetypes="ccccccccc" />
      <path
         style="fill:none;stroke:#1d2848;stroke-width:3"
         d="m 523.77628,-189.05605 -16.29353,28.22129 9.77613,5.64424 19.55229,-33.86553"
         id="path10281" />
      <circle
         style="fill:#f01d0a;stroke:none;stroke-width:3"
         id="path11053"
         cx="536.81116"
         cy="-222.11115"
         r="2.9690001" />
    </g>
  </g>
  <g
     inkscape:groupmode="layer"
     id="layer3"
     inkscape:label="tile"
     style="display:inline">
    <use
       x="0"
       y="0"
       xlink:href="#layer2"
       id="use3414-9"
       transform="rotate(-60,586.60257,185.67134)"
       width="100%"
       height="100%"
       style="display:inline"
       inkscape:transform-center-x="247.22539"
       inkscape:transform-center-y="-124.4257" />
    <use
       x="0"
       y="0"
       xlink:href="#layer2"
       id="use4066-84"
       transform="rotate(180,276.631,184.00423)"
       width="100%"
       height="100%"
       style="display:inline"
       inkscape:transform-center-x="32.150367"
       inkscape:transform-center-y="423.06733" />
    <use
       x="0"
       y="0"
       xlink:href="#layer2"
       id="use4066-8"
       transform="rotate(60,-346.17696,-359.51159)"
       width="100%"
       height="100%"
       style="display:inline"
       inkscape:transform-center-x="296.10602"
       inkscape:transform-center-y="-34.117576" />
    <use
       x="0"
       y="0"
       xlink:href="#layer2"
       id="use5623"
       transform="rotate(180,100.66054,14.67644)"
       width="100%"
       height="100%"
       style="display:inline"
       inkscape:transform-center-x="384.09129"
       inkscape:transform-center-y="84.411751" />
    <use
       x="0"
       y="0"
       xlink:href="#layer2"
       id="use5625"
       transform="rotate(-120,288.71084,-63.78755)"
       width="100%"
       height="100%"
       style="display:inline"
       inkscape:transform-center-x="198.3447"
       inkscape:transform-center-y="-237.31111" />
    <use
       x="0"
       y="0"
       xlink:href="#layer2"
       id="use5627"
       transform="rotate(-60,430.1842,50.209077)"
       width="100%"
       height="100%"
       style="display:inline"
       inkscape:transform-center-x="208.12082"
       inkscape:transform-center-y="-327.61912" />
    <use
       x="0"
       y="0"
       xlink:href="#layer2"
       id="use3307-9"
       transform="rotate(180,120.21285,-86.92017)"
       width="100%"
       height="100%"
       style="display:inline"
       inkscape:transform-center-x="344.98666"
       inkscape:transform-center-y="-118.78147" />
    <use
       x="0"
       y="0"
       xlink:href="#layer2"
       id="use4150-0"
       transform="rotate(-120,210.50186,26.520676)"
       width="100%"
       height="100%"
       style="display:inline"
       inkscape:transform-center-x="393.86739"
       inkscape:transform-center-y="-169.57973" />
    <use
       x="0"
       y="0"
       xlink:href="#layer2"
       id="use5746"
       transform="translate(-236.55246,448.23244)"
       width="100%"
       height="100%"
       style="display:inline"
       inkscape:transform-center-x="149.46407"
       inkscape:transform-center-y="-152.64696" />
    <use
       x="0"
       y="0"
       xlink:href="#layer2"
       id="use3303-8"
       transform="rotate(120,-48.285304,-110.05292)"
       width="100%"
       height="100%"
       style="display:inline"
       inkscape:transform-center-x="286.32997"
       inkscape:transform-center-y="56.190494" />
    <use
       x="0"
       y="0"
       xlink:href="#layer2"
       id="use5021-5"
       transform="matrix(1,0,0,-1,-119.23879,300.2774)"
       width="100%"
       height="100%"
       style="display:inline"
       inkscape:transform-center-x="32.150391"
       inkscape:transform-center-y="355.33627" />
    <use
       x="0"
       y="0"
       xlink:href="#layer2"
       id="use5904"
       transform="rotate(180,276.63101,116.27313)"
       width="100%"
       height="100%"
       style="display:inline"
       inkscape:transform-center-x="32.150343"
       inkscape:transform-center-y="287.60513" />
    <use
       x="0"
       y="0"
       xlink:href="#layer2"
       id="use3307-3"
       transform="rotate(-60,1055.8574,321.1336)"
       width="100%"
       height="100%"
       style="display:inline"
       inkscape:transform-center-x="129.91175"
       inkscape:transform-center-y="349.69201" />
    <use
       x="0"
       y="0"
       xlink:href="#layer2"
       id="use4066-84-17"
       transform="translate(-197.44788,245.03901)"
       width="100%"
       height="100%"
       style="display:inline"
       inkscape:transform-center-x="110.35949"
       inkscape:transform-center-y="-355.84038" />
    <use
       x="0"
       y="0"
       xlink:href="#layer2"
       id="use5021-5-5"
       transform="matrix(-1,0,0,1,475.0529,312.77008)"
       width="100%"
       height="100%"
       style="display:inline"
       inkscape:transform-center-x="110.35948"
       inkscape:transform-center-y="-288.10931" />
    <use
       x="0"
       y="0"
       xlink:href="#layer2"
       id="use5904-1"
       transform="translate(-197.44788,380.50121)"
       width="100%"
       height="100%"
       style="display:inline"
       inkscape:transform-center-x="110.35948"
       inkscape:transform-center-y="-220.37818" />
    <use
       x="0"
       y="0"
       xlink:href="#layer2"
       id="use3307-3-7"
       transform="rotate(120,186.34206,-200.36108)"
       width="100%"
       height="100%"
       style="display:inline"
       inkscape:transform-center-x="12.598098"
       inkscape:transform-center-y="-282.465" />
    <use
       x="0"
       y="0"
       xlink:href="#layer2"
       id="use4066-84-1"
       transform="rotate(60,-33.340484,-88.587484)"
       width="100%"
       height="100%"
       style="display:inline"
       inkscape:transform-center-x="-94.939371"
       inkscape:transform-center-y="-169.57986" />
    <use
       x="0"
       y="0"
       xlink:href="#layer2"
       id="use5021-5-3"
       transform="matrix(-0.5,-0.8660254,-0.8660254,0.5,184.20432,600.84828)"
       width="100%"
       height="100%"
       style="display:inline"
       inkscape:transform-center-x="-65.610918"
       inkscape:transform-center-y="-124.42581" />
    <use
       x="0"
       y="0"
       xlink:href="#layer2"
       id="use5904-8"
       transform="rotate(60,-150.65417,-156.31857)"
       width="100%"
       height="100%"
       style="display:inline"
       inkscape:transform-center-x="22.374313"
       inkscape:transform-center-y="-101.84877" />
    <use
       x="0"
       y="0"
       xlink:href="#layer2"
       id="use3307-3-0"
       transform="rotate(180,335.28778,-53.054649)"
       width="100%"
       height="100%"
       style="display:inline"
       inkscape:transform-center-x="-85.163193"
       inkscape:transform-center-y="-51.050426" />
    <use
       x="0"
       y="0"
       xlink:href="#layer2"
       id="use4066-84-9"
       transform="rotate(-60,860.33437,117.94043)"
       width="100%"
       height="100%"
       style="display:inline"
       inkscape:transform-center-x="51.702802"
       inkscape:transform-center-y="78.767539" />
    <use
       x="0"
       y="0"
       xlink:href="#layer2"
       id="use5021-5-7"
       transform="matrix(-0.5,0.8660254,0.8660254,0.5,722.93501,255.50439)"
       width="100%"
       height="100%"
       style="display:inline"
       inkscape:transform-center-x="-36.282409"
       inkscape:transform-center-y="101.34456" />
    <use
       x="0"
       y="0"
       xlink:href="#layer2"
       id="use5904-9"
       transform="rotate(-60,977.64808,50.20933)"
       width="100%"
       height="100%"
       style="display:inline"
       inkscape:transform-center-x="-65.610902"
       inkscape:transform-center-y="146.49864" />
    <use
       x="0"
       y="0"
       xlink:href="#layer2"
       id="use3307-3-9"
       transform="rotate(60,-228.86339,-20.856368)"
       width="100%"
       height="100%"
       style="display:inline"
       inkscape:transform-center-x="-55.834788"
       inkscape:transform-center-y="33.613502" />
    <use
       x="0"
       y="0"
       xlink:href="#layer2"
       id="use6272"
       transform="rotate(-60,664.81163,185.67143)"
       width="100%"
       height="100%"
       style="display:inline"
       inkscape:transform-center-x="208.12094"
       inkscape:transform-center-y="-56.694621" />
    <use
       x="0"
       y="0"
       xlink:href="#layer2"
       id="use6274"
       transform="matrix(-0.5,0.8660254,0.8660254,0.5,566.51687,120.04223)"
       width="100%"
       height="100%"
       style="display:inline"
       inkscape:transform-center-x="120.13573"
       inkscape:transform-center-y="-34.117598" />
    <use
       x="0"
       y="0"
       xlink:href="#layer2"
       id="use6276"
       transform="rotate(-60,782.1253,117.94037)"
       width="100%"
       height="100%"
       style="display:inline"
       inkscape:transform-center-x="90.807281"
       inkscape:transform-center-y="11.036466" />
    <use
       x="0"
       y="0"
       xlink:href="#layer2"
       id="use6278"
       transform="rotate(60,-189.75878,-224.04955)"
       width="100%"
       height="100%"
       style="display:inline"
       inkscape:transform-center-x="100.58337"
       inkscape:transform-center-y="-101.84868" />
    <use
       x="0"
       y="0"
       xlink:href="#layer2"
       id="use6280"
       transform="rotate(180,296.18328,82.407602)"
       width="100%"
       height="100%"
       style="display:inline"
       inkscape:transform-center-x="-6.9541984"
       inkscape:transform-center-y="219.87407" />
    <use
       x="0"
       y="0"
       xlink:href="#layer2"
       id="use6282"
       transform="rotate(-60,1055.8572,50.209322)"
       width="100%"
       height="100%"
       style="display:inline"
       inkscape:transform-center-x="-104.71545"
       inkscape:transform-center-y="214.22969" />
    <use
       x="0"
       y="0"
       xlink:href="#layer2"
       id="use6284"
       transform="rotate(60,-463.49073,114.60577)"
       width="100%"
       height="100%"
       style="display:inline"
       inkscape:transform-center-x="-55.834768"
       inkscape:transform-center-y="304.5378" />
    <use
       x="0"
       y="0"
       xlink:href="#layer2"
       id="use6286"
       transform="rotate(120,29.923737,160.87137)"
       width="100%"
       height="100%"
       style="display:inline"
       inkscape:transform-center-x="-65.610901"
       inkscape:transform-center-y="394.84591" />
    <use
       x="0"
       y="0"
       xlink:href="#layer2"
       id="use6288"
       transform="rotate(-120,484.23367,94.251854)"
       width="100%"
       height="100%"
       style="display:inline"
       inkscape:transform-center-x="41.926591"
       inkscape:transform-center-y="169.07574" />
    <use
       x="0"
       y="0"
       xlink:href="#layer2"
       id="use6290"
       transform="translate(115.38846,786.88794)"
       width="100%"
       height="100%"
       style="display:inline"
       inkscape:transform-center-x="-202.47685"
       inkscape:transform-center-y="186.00854" />
    <use
       x="0"
       y="0"
       xlink:href="#layer2"
       id="use5623-3-0"
       transform="translate(-41.02971,380.50123)"
       width="100%"
       height="100%"
       style="display:inline"
       inkscape:transform-center-x="-46.058688"
       inkscape:transform-center-y="-220.37816" />
    <use
       x="0"
       y="0"
       xlink:href="#layer2"
       id="use6345"
       transform="rotate(60,-33.340693,182.3368)"
       width="100%"
       height="100%"
       style="display:inline"
       inkscape:transform-center-x="-329.56658"
       inkscape:transform-center-y="-34.117533" />
    <use
       x="0"
       y="0"
       xlink:href="#layer2"
       id="use6347"
       transform="rotate(120,-9.1808456,47.98628)"
       width="100%"
       height="100%"
       style="display:inline"
       inkscape:transform-center-x="90.807325"
       inkscape:transform-center-y="259.38383" />
    <use
       x="0"
       y="0"
       xlink:href="#layer2"
       id="use6349"
       transform="rotate(180,217.97411,14.676462)"
       width="100%"
       height="100%"
       style="display:inline"
       inkscape:transform-center-x="149.46415"
       inkscape:transform-center-y="84.411794" />
    <use
       x="0"
       y="0"
       xlink:href="#layer2"
       id="use6349-2"
       transform="rotate(180,354.84004,-154.65117)"
       width="100%"
       height="100%"
       style="display:inline"
       inkscape:transform-center-x="-124.26772"
       inkscape:transform-center-y="-254.24347" />
    <use
       x="0"
       y="0"
       xlink:href="#layer2"
       id="use6351"
       transform="rotate(-120,366.91994,71.674784)"
       width="100%"
       height="100%"
       style="display:inline"
       inkscape:transform-center-x="198.34487"
       inkscape:transform-center-y="33.613465" />
    <use
       x="0"
       y="0"
       xlink:href="#layer2"
       id="use6353"
       transform="rotate(-120,640.65191,139.40592)"
       width="100%"
       height="100%"
       style="display:inline"
       inkscape:transform-center-x="-153.5962"
       inkscape:transform-center-y="372.26901" />
    <use
       x="0"
       y="0"
       xlink:href="#layer2"
       id="use6355"
       transform="rotate(-60,1134.0665,50.209298)"
       width="100%"
       height="100%"
       style="display:inline"
       inkscape:transform-center-x="-143.82013"
       inkscape:transform-center-y="281.96092" />
    <use
       x="0"
       y="0"
       xlink:href="#layer2"
       id="use6361-2"
       transform="rotate(-60,625.70701,-17.521807)"
       width="100%"
       height="100%"
       style="display:inline"
       inkscape:transform-center-x="51.702747"
       inkscape:transform-center-y="-192.15684" />
    <use
       x="0"
       y="0"
       xlink:href="#layer2"
       id="use6363"
       transform="rotate(-60,782.12535,388.86467)"
       width="100%"
       height="100%"
       style="display:inline"
       inkscape:transform-center-x="325.43459"
       inkscape:transform-center-y="146.49866" />
    <use
       x="0"
       y="0"
       xlink:href="#layer2"
       id="use6351-2"
       transform="rotate(-120,562.44274,3.9437538)"
       width="100%"
       height="100%"
       style="display:inline"
       inkscape:transform-center-x="-153.59612"
       inkscape:transform-center-y="101.34463" />
    <use
       x="0"
       y="0"
       xlink:href="#layer2"
       id="use6355-4"
       transform="rotate(-60,899.43903,-85.252778)"
       width="100%"
       height="100%"
       style="display:inline"
       inkscape:transform-center-x="-143.82001"
       inkscape:transform-center-y="11.036563" />
    <use
       x="0"
       y="0"
       xlink:href="#layer2"
       id="use6347-3"
       transform="rotate(120,225.44645,-42.321868)"
       width="100%"
       height="100%"
       style="display:inline"
       inkscape:transform-center-x="-182.92446"
       inkscape:transform-center-y="-79.271579" />
    <use
       x="0"
       y="0"
       xlink:href="#layer2"
       id="use5623-3-7"
       transform="translate(154.49287,583.69468)"
       width="100%"
       height="100%"
       style="display:inline"
       inkscape:transform-center-x="-241.58127"
       inkscape:transform-center-y="-17.184712" />
    <use
       x="0"
       y="0"
       xlink:href="#layer2"
       id="use6685"
       transform="matrix(-1,0,0,1,826.99367,651.42573)"
       width="100%"
       height="100%"
       style="display:inline"
       inkscape:transform-center-x="-241.58129"
       inkscape:transform-center-y="50.546334" />
    <use
       x="0"
       y="0"
       xlink:href="#layer2"
       id="use6687"
       transform="translate(154.49301,719.15686)"
       width="100%"
       height="100%"
       style="display:inline"
       inkscape:transform-center-x="-241.58141"
       inkscape:transform-center-y="118.27747" />
    <use
       x="0"
       y="0"
       xlink:href="#layer2"
       id="use6689"
       transform="translate(193.59744,515.96354)"
       width="100%"
       height="100%"
       style="display:inline"
       inkscape:transform-center-x="-280.68584"
       inkscape:transform-center-y="-84.915856" />
    <use
       x="0"
       y="0"
       xlink:href="#layer2"
       id="use6691"
       transform="rotate(60,5.7638302,-20.85643)"
       width="100%"
       height="100%"
       style="display:inline"
       inkscape:transform-center-x="-173.14834"
       inkscape:transform-center-y="-169.57966" />
    <use
       x="0"
       y="0"
       xlink:href="#layer2"
       id="use6870"
       transform="rotate(-120,406.02454,184.55996)"
       width="100%"
       height="100%"
       style="display:inline"
       inkscape:transform-center-x="237.44939"
       inkscape:transform-center-y="236.8068" />
    <use
       x="0"
       y="0"
       xlink:href="#layer2"
       id="use6872"
       transform="matrix(0.5,0.8660254,0.8660254,-0.5,171.60963,12.199181)"
       width="100%"
       height="100%"
       style="display:inline"
       inkscape:transform-center-x="208.12095"
       inkscape:transform-center-y="191.65274" />
    <use
       x="0"
       y="0"
       xlink:href="#layer2"
       id="use6874"
       transform="rotate(-120,445.12911,116.82887)"
       width="100%"
       height="100%"
       style="display:inline"
       inkscape:transform-center-x="120.1357"
       inkscape:transform-center-y="169.07571" />
    <use
       x="0"
       y="0"
       xlink:href="#layer2"
       id="use6876"
       transform="translate(-314.76165,719.15679)"
       width="100%"
       height="100%"
       style="display:inline"
       inkscape:transform-center-x="227.67325"
       inkscape:transform-center-y="118.2774" />
    <use
       x="0"
       y="0"
       xlink:href="#layer2"
       id="use6878"
       transform="rotate(60,162.1821,114.60577)"
       width="100%"
       height="100%"
       style="display:inline"
       inkscape:transform-center-x="-368.67119"
       inkscape:transform-center-y="-237.31076" />
    <use
       x="0"
       y="0"
       xlink:href="#layer2"
       id="use6880"
       transform="matrix(-0.5,-0.8660254,-0.8660254,0.5,457.93611,533.11738)"
       width="100%"
       height="100%"
       style="display:inline"
       inkscape:transform-center-x="-339.3427"
       inkscape:transform-center-y="-192.15671" />
    <use
       x="0"
       y="0"
       xlink:href="#layer2"
       id="use6882"
       transform="rotate(60,44.868405,46.874671)"
       width="100%"
       height="100%"
       style="display:inline"
       inkscape:transform-center-x="-251.35748"
       inkscape:transform-center-y="-169.57966" />
    <use
       x="0"
       y="0"
       xlink:href="#layer2"
       id="use6884"
       transform="rotate(180,472.15368,-86.920103)"
       width="100%"
       height="100%"
       style="display:inline"
       inkscape:transform-center-x="-358.895"
       inkscape:transform-center-y="-118.78133" />
    <use
       x="0"
       y="0"
       xlink:href="#layer2"
       id="use11890"
       transform="rotate(-120,406.02453,-176.67255)"
       width="100%"
       height="100%"
       style="display:inline"
       inkscape:transform-center-x="-75.387118"
       inkscape:transform-center-y="-305.04197" />
    <use
       x="0"
       y="0"
       xlink:href="#layer2"
       id="use12216"
       transform="rotate(-60,703.91624,-288.44595)"
       width="100%"
       height="100%"
       style="display:inline" />
    <use
       x="0"
       y="0"
       xlink:href="#layer2"
       id="use12218"
       transform="translate(232.70208,312.77033)"
       width="100%"
       height="100%"
       style="display:inline" />
    <use
       x="0"
       y="0"
       xlink:href="#layer2"
       id="use12220"
       transform="rotate(180,374.39231,-188.5167)"
       width="100%"
       height="100%"
       style="display:inline" />
    <use
       x="0"
       y="0"
       xlink:href="#layer2"
       id="use12220-5"
       transform="rotate(120,264.55105,70.563244)"
       width="100%"
       height="100%"
       style="display:inline" />
    <use
       x="0"
       y="0"
       xlink:href="#layer2"
       id="use12220-5-1"
       transform="rotate(180,198.42182,116.2731)"
       width="100%"
       height="100%"
       style="display:inline" />
    <use
       x="0"
       y="0"
       xlink:href="#layer2"
       id="use12300"
       transform="rotate(-60,1094.9618,-152.98386)"
       width="100%"
       height="100%"
       style="display:inline"
       inkscape:transform-center-x="26.069628"
       inkscape:transform-center-y="-11.792669" />
    <use
       x="0"
       y="0"
       xlink:href="#layer2"
       id="use12302"
       transform="rotate(60,-307.07259,250.068)"
       width="100%"
       height="100%"
       style="display:inline"
       inkscape:transform-center-x="-3.6953253"
       inkscape:transform-center-y="-11.036395" />
    <use
       x="0"
       y="0"
       xlink:href="#layer2"
       id="use12304"
       transform="matrix(-0.5,0.8660254,0.8660254,0.5,918.45792,458.69779)"
       width="100%"
       height="100%"
       style="display:inline"
       inkscape:transform-center-x="3.6953236"
       inkscape:transform-center-y="-11.0364" />
    <use
       x="0"
       y="0"
       xlink:href="#layer2"
       id="use12220-5-6"
       transform="rotate(-60,508.3935,185.67121)"
       width="100%"
       height="100%"
       style="display:inline" />
  </g>
  <g
     inkscape:groupmode="layer"
     id="layer4"
     inkscape:label="center">
    <use
       x="0"
       y="0"
       xlink:href="#layer2"
       id="use5623-7"
       transform="translate(-80.13436,583.69461)"
       width="100%"
       height="100%"
       style="display:inline"
       inkscape:transform-center-x="-6.9540397"
       inkscape:transform-center-y="-17.184785" />
  </g>
</svg>
