<?xml version="1.0" encoding="UTF-8" standalone="no"?>
<svg
   xmlns:dc="http://purl.org/dc/elements/1.1/"
   xmlns:cc="http://creativecommons.org/ns#"
   xmlns:rdf="http://www.w3.org/1999/02/22-rdf-syntax-ns#"
   xmlns:svg="http://www.w3.org/2000/svg"
   xmlns="http://www.w3.org/2000/svg"
   xmlns:xlink="http://www.w3.org/1999/xlink"
   xmlns:sodipodi="http://sodipodi.sourceforge.net/DTD/sodipodi-0.dtd"
   xmlns:inkscape="http://www.inkscape.org/namespaces/inkscape"
   inkscape:export-ydpi="96"
   inkscape:export-xdpi="96"
   inkscape:export-filename="../stickers/phone.png"
   enable-background="new"
   sodipodi:docname="phone.svg"
   inkscape:version="0.92+devel (unknown)"
   id="svg4575"
   version="1.1"
   viewBox="0 0 512 512"
   height="512"
   width="512">
  <defs
     id="defs4569">
    <linearGradient
       id="linearGradient1030"
       inkscape:collect="always">
      <stop
         id="stop1026"
         offset="0"
         style="stop-color:#eff7fc;stop-opacity:0.51264518" />
      <stop
         id="stop1028"
         offset="1"
         style="stop-color:#eff7fc;stop-opacity:0;" />
    </linearGradient>
    <inkscape:path-effect
       miter_limit="100"
       jointype="extrapolated"
       smoothing="0.5"
       end_offset="0.01622895"
       attach_start="0.18471035"
       stroke_width="6"
       is_visible="true"
       id="path-effect898"
       effect="taper_stroke" />
    <inkscape:path-effect
       miter_limit="100"
       jointype="extrapolated"
       smoothing="0.5"
       end_offset="0.2"
       attach_start="0.12484912"
       stroke_width="6"
       is_visible="true"
       id="path-effect896"
       effect="taper_stroke" />
    <inkscape:path-effect
       miter_limit="100"
       jointype="extrapolated"
       smoothing="0.5"
       end_offset="0.13655815"
       attach_start="0.11921895"
       stroke_width="6"
       is_visible="true"
       id="path-effect1278"
       effect="taper_stroke" />
    <inkscape:path-effect
       miter_limit="100"
       jointype="extrapolated"
       smoothing="0.5"
       end_offset="0.23924778"
       attach_start="0.24617414"
       stroke_width="6"
       is_visible="true"
       id="path-effect1276"
       effect="taper_stroke" />
    <inkscape:path-effect
       miter_limit="100"
       jointype="extrapolated"
       smoothing="0.5"
       end_offset="0.66360695"
       attach_start="0.17702038"
       stroke_width="6"
       is_visible="true"
       id="path-effect1274"
       effect="taper_stroke" />
    <inkscape:path-effect
       miter_limit="100"
       jointype="extrapolated"
       smoothing="0.5"
       end_offset="0.16710569"
       attach_start="0.54443132"
       stroke_width="6"
       is_visible="true"
       id="path-effect1272"
       effect="taper_stroke" />
    <inkscape:path-effect
       miter_limit="100"
       jointype="extrapolated"
       smoothing="0.5"
       end_offset="0.029893984"
       attach_start="0.19007707"
       stroke_width="6"
       is_visible="true"
       id="path-effect1270"
       effect="taper_stroke" />
    <inkscape:path-effect
       miter_limit="100"
       jointype="extrapolated"
       smoothing="0.5"
       end_offset="0.2"
       attach_start="0.2"
       stroke_width="6"
       is_visible="true"
       id="path-effect1208"
       effect="taper_stroke" />
    <inkscape:path-effect
       effect="taper_stroke"
       id="path-effect1243"
       is_visible="true"
       stroke_width="6"
       attach_start="0.38288385"
       end_offset="0.39867581"
       smoothing="0.5"
       jointype="extrapolated"
       miter_limit="100" />
    <inkscape:path-effect
       effect="taper_stroke"
       id="path-effect1223"
       is_visible="true"
       stroke_width="6"
       attach_start="0.073862875"
       end_offset="0.90650202"
       smoothing="0.5"
       jointype="extrapolated"
       miter_limit="100" />
    <inkscape:path-effect
       effect="taper_stroke"
       id="path-effect1221"
       is_visible="true"
       stroke_width="6"
       attach_start="0.22974238"
       end_offset="0.62292379"
       smoothing="0.5"
       jointype="extrapolated"
       miter_limit="100" />
    <linearGradient
       gradientTransform="matrix(0.6349539,0,0,0.6349539,6.624375,300.37084)"
       inkscape:collect="always"
       xlink:href="#linearGradient1775"
       id="linearGradient1777"
       x1="155.61604"
       y1="38.018059"
       x2="95.616043"
       y2="178.01595"
       gradientUnits="userSpaceOnUse" />
    <linearGradient
       inkscape:collect="always"
       id="linearGradient1775">
      <stop
         style="stop-color:#37aee2;stop-opacity:1"
         offset="0"
         id="stop1771" />
      <stop
         style="stop-color:#1e96c8;stop-opacity:1"
         offset="1"
         id="stop1773" />
    </linearGradient>
    <linearGradient
       gradientUnits="userSpaceOnUse"
       y2="251.86945"
       x2="67.336151"
       y1="162.97723"
       x1="105.43339"
       id="linearGradient1859"
       xlink:href="#linearGradient1775"
       inkscape:collect="always" />
    <radialGradient
       gradientUnits="userSpaceOnUse"
       gradientTransform="matrix(0.84315064,1.2139984,-1.5498543,1.0764141,81.13571,-769.27451)"
       r="117.53389"
       fy="310.83212"
       fx="673.8092"
       cy="310.83212"
       cx="673.8092"
       id="radialGradient1024"
       xlink:href="#linearGradient1030"
       inkscape:collect="always" />
    <filter
       height="1.5227538"
       y="-0.26137689"
       width="1.6291755"
       x="-0.31458776"
       id="filter1035"
       style="color-interpolation-filters:sRGB"
       inkscape:collect="always">
      <feGaussianBlur
         id="feGaussianBlur1037"
         stdDeviation="39.819446"
         inkscape:collect="always" />
    </filter>
    <clipPath
       id="clipPath1073"
       clipPathUnits="userSpaceOnUse">
      <path
         inkscape:connector-curvature="0"
         id="path1075"
         d="m 163.94922,136.2793 c -2.2999,0.0186 -4.59896,0.0934 -6.89844,0.22656 l -40.90625,202.46289 c 4.00825,1.12093 11.01195,3.12818 18.87305,5.44727 4.77202,1.40778 9.49449,2.82133 13.24414,3.98437 3.74964,1.16304 6.16111,1.88571 7.66016,2.58203 a 3.0003,3.0003 0 0 1 1.45312,1.44727 c 1.40197,2.99321 2.72084,8.2684 4.32422,15.40429 1.60338,7.1359 3.33368,15.8849 4.95312,24.77344 3.0245,16.60037 5.63074,33.33862 6.27735,41.48633 l 238.38867,67.80859 C 453.10312,358.9671 308.84309,135.10953 163.94922,136.2793 Z"
         style="display:inline;opacity:1;fill:#b53147;fill-opacity:1;stroke:none;stroke-width:6;stroke-linecap:round;stroke-linejoin:round;stroke-miterlimit:4;stroke-dasharray:none;stroke-opacity:1" />
    </clipPath>
    <filter
       id="filter1077"
       style="color-interpolation-filters:sRGB"
       inkscape:collect="always">
      <feBlend
         id="feBlend1079"
         in2="BackgroundImage"
         mode="lighten"
         inkscape:collect="always" />
    </filter>
  </defs>
  <sodipodi:namedview
     inkscape:snap-center="true"
     inkscape:object-nodes="true"
     inkscape:object-paths="false"
     inkscape:snap-midpoints="false"
     inkscape:guide-bbox="true"
     showguides="false"
     inkscape:snap-smooth-nodes="false"
     inkscape:snap-global="false"
     borderlayer="true"
     inkscape:document-rotation="0"
     inkscape:window-maximized="1"
     inkscape:window-y="0"
     inkscape:window-x="30"
     inkscape:window-height="1411"
     inkscape:window-width="2408"
     inkscape:pagecheckerboard="true"
     units="px"
     showgrid="false"
     inkscape:current-layer="layer10"
     inkscape:document-units="px"
     inkscape:cy="286.37589"
     inkscape:cx="-447.05695"
     inkscape:zoom="0.49497475"
     inkscape:pageshadow="2"
     inkscape:pageopacity="0.0"
     borderopacity="1.0"
     bordercolor="#666666"
     pagecolor="#ffffff"
     id="base">
    <sodipodi:guide
       id="guide1816"
       orientation="0,-1"
       position="82.969735,220.69035" />
    <sodipodi:guide
       id="guide1818"
       orientation="1,0"
       position="159.16422,296.88482" />
    <sodipodi:guide
       id="guide1835"
       orientation="0.90498154,0.42545084"
       position="128.81431,199.3683" />
    <sodipodi:guide
       id="guide1845"
       orientation="0,-1"
       position="82.969743,296.88482" />
    <sodipodi:guide
       id="guide1847"
       orientation="0.70710676,0.70710681"
       position="159.16422,220.69035" />
  </sodipodi:namedview>
  <metadata
     id="metadata4572">
    <rdf:RDF>
      <cc:Work
         rdf:about="">
        <dc:format>image/svg+xml</dc:format>
        <dc:type
           rdf:resource="http://purl.org/dc/dcmitype/StillImage" />
        <dc:title></dc:title>
      </cc:Work>
    </rdf:RDF>
  </metadata>
  <g
     transform="translate(0,-161.53332)"
     id="layer1"
     inkscape:groupmode="layer"
     inkscape:label="ref"
     style="display:none;opacity:1"
     sodipodi:insensitive="true">
    <image
       sodipodi:absref="/home/melano/Pictures/Dragons/Glax/sketches/phone.jpeg"
       xlink:href="../sketches/phone.jpeg"
       y="-597.69507"
       x="101.22103"
       width="741.14062"
       height="555.85547"
       preserveAspectRatio="none"
       id="image924"
       style="opacity:1;stop-opacity:1"
       transform="rotate(88.347628)" />
  </g>
  <g
     inkscape:label="ref 1"
     id="layer11"
     inkscape:groupmode="layer" />
  <g
     inkscape:label="durg"
     id="layer3"
     inkscape:groupmode="layer"
     style="display:inline">
    <g
       inkscape:label="wing b"
       id="layer4"
       inkscape:groupmode="layer">
      <path
         sodipodi:nodetypes="cccsc"
         inkscape:connector-curvature="0"
         id="path1008"
         d="m 474.78973,420.87569 c -8.16147,-42.61586 -49.69561,-124.77028 -74.23632,-141.94773 -19.81099,6.67431 -9.13616,17.21549 -9.13616,17.21549 22.6222,23.38694 63.38189,88.76524 75.56269,142.17446 12.18081,53.40923 7.80979,-17.44222 7.80979,-17.44222 z"
         style="opacity:1;fill:#3250b0;fill-opacity:1;stroke:#1d2848;stroke-width:6;stroke-linecap:round;stroke-linejoin:round;stroke-miterlimit:4;stroke-dasharray:none;stroke-opacity:1" />
    </g>
    <g
       style="display:inline;opacity:1"
       inkscape:label="arm b"
       id="layer5"
       inkscape:groupmode="layer">
      <path
         sodipodi:nodetypes="ccc"
         inkscape:connector-curvature="0"
         id="path999"
         d="m 123.78,339.19541 c 0.0969,-3.75017 6.81976,-13.65295 9.36904,-14.19962 2.54927,-0.54668 6.29634,12.101 5.47361,15.2873"
         style="display:inline;opacity:1;fill:#3a3c3f;fill-opacity:1;stroke:#292929;stroke-width:4;stroke-linecap:round;stroke-linejoin:round;stroke-miterlimit:4;stroke-dasharray:none;stroke-opacity:1" />
      <path
         sodipodi:nodetypes="ccsssc"
         inkscape:connector-curvature="0"
         id="path985"
         d="m 151.51501,366.4954 c 18.38053,9.81547 86.6994,30.19025 104.54768,45.84285 9.6414,-14.71845 55.51428,-82.37415 68.50714,-84.89403 12.99286,-2.51988 41.77206,12.04857 32.35318,33.63081 -9.41888,21.58224 -65.40279,90.97895 -104.34556,90.38859 -38.37623,-0.58178 -86.31143,-46.61306 -114.95385,-47.92877"
         style="display:inline;opacity:1;fill:#3250b0;fill-opacity:1;stroke:#1d2848;stroke-width:6;stroke-linecap:round;stroke-linejoin:round;stroke-miterlimit:4;stroke-dasharray:none;stroke-opacity:1" />
      <path
         sodipodi:nodetypes="cscc"
         inkscape:connector-curvature="0"
         id="path983"
         d="m 120.64915,348.44288 c 2.39979,-10.1251 9.99361,-14.07 14.34308,-12.33899 4.34947,1.73101 6.55581,8.43691 5.97249,15.89126 -0.58333,7.45434 -16.28817,3.77759 -20.31557,-3.55227 z"
         style="display:inline;opacity:1;fill:#c4d9f5;fill-opacity:1;stroke:#1d2848;stroke-width:6;stroke-linecap:round;stroke-linejoin:round;stroke-miterlimit:4;stroke-dasharray:none;stroke-opacity:1" />
      <path
         sodipodi:nodetypes="ccccc"
         inkscape:connector-curvature="0"
         id="path981"
         d="m 112.4459,341.0421 c 4.92399,1.31125 38.93459,11.13751 42.21267,12.66022 4.27981,9.1374 14.69781,68.62074 15.40707,82.26134 -11.46594,-3.57075 -38.59774,-25.58897 -43.45131,-32.04156 -3.57507,-14.37367 -13.5854,-54.06869 -14.16843,-62.88 z"
         style="display:inline;opacity:1;fill:#202020;fill-opacity:1;stroke:#101010;stroke-width:6;stroke-linecap:round;stroke-linejoin:round;stroke-miterlimit:4;stroke-dasharray:none;stroke-opacity:1" />
      <path
         sodipodi:nodetypes="cssc"
         inkscape:connector-curvature="0"
         id="path967"
         d="m 119.33251,404.69049 c -5.83175,2.89658 -8.623,14.28914 2.088,19.59656 7.65429,3.79275 29.93406,4.39129 30.88051,-4.48896 0.78572,-7.37204 -8.04849,-12.01011 -14.25229,-13.0666"
         style="display:inline;opacity:1;fill:#3250b0;stroke:none;stroke-width:6;stroke-linecap:round;stroke-linejoin:round;stroke-miterlimit:4;stroke-dasharray:none" />
      <path
         sodipodi:nodetypes="cccccc"
         inkscape:connector-curvature="0"
         id="path973"
         d="m 142.83359,425.66537 c 1.99061,-3.94857 0.68357,-10.98942 -3.52425,-13.00652 -4.20783,-2.01711 -4.5192,-3.62161 -4.5192,-3.62161 l 7.26653,-0.18113 9.24914,6.10441 c 0,0 1.10314,10.12806 -8.47222,10.70485 z"
         style="display:inline;opacity:1;fill:#c4d9f5;stroke:none;stroke-width:6;stroke-linecap:round;stroke-linejoin:round;stroke-miterlimit:4;stroke-dasharray:none" />
      <path
         style="display:inline;opacity:1;fill:none;stroke:#1d2848;stroke-width:6;stroke-linecap:round;stroke-linejoin:round;stroke-miterlimit:4;stroke-dasharray:none"
         d="m 119.33251,404.69049 c -5.83175,2.89658 -8.623,14.28914 2.088,19.59656 7.65429,3.79275 29.93406,4.39129 30.88051,-4.48896 0.78572,-7.37204 -8.04849,-12.01011 -14.25229,-13.0666"
         id="path975"
         inkscape:connector-curvature="0"
         sodipodi:nodetypes="cssc" />
      <path
         sodipodi:nodetypes="cssc"
         inkscape:connector-curvature="0"
         id="path937"
         d="m 114.65197,377.56663 c 4.7847,5.21492 28.76067,7.24201 30.61972,19.59848 1.79815,11.95176 -24.63617,15.98929 -36.28811,3.07155 -8.56146,-9.49154 -3.06671,-23.21161 5.66839,-22.67003 z"
         style="display:inline;opacity:1;fill:#3250b0;stroke:none;stroke-width:6;stroke-linecap:round;stroke-linejoin:round;stroke-miterlimit:4;stroke-dasharray:none" />
      <path
         sodipodi:nodetypes="csccc"
         inkscape:connector-curvature="0"
         id="path971"
         d="m 132.3729,407.91929 c 3.73424,-1.91228 5.63325,-8.97632 3.39936,-12.77219 -2.43093,-4.13069 -13.39344,-9.38676 -16.8736,-11.23388 6.58733,0.45512 24.96328,3.80427 25.90553,13.09086 0.94224,9.28658 -12.43129,10.91521 -12.43129,10.91521 z"
         style="display:inline;opacity:1;fill:#c4d9f5;stroke:none;stroke-width:6;stroke-linecap:round;stroke-linejoin:round;stroke-miterlimit:4;stroke-dasharray:none" />
      <path
         style="display:inline;opacity:1;fill:none;stroke:#1d2848;stroke-width:6;stroke-linecap:round;stroke-linejoin:round;stroke-miterlimit:4;stroke-dasharray:none"
         d="m 114.65197,377.56663 c 4.7847,5.21492 28.76067,7.24201 30.61972,19.59848 1.79815,11.95176 -24.63617,15.98929 -36.28811,3.07155 -8.56146,-9.49154 -3.06671,-23.21161 5.66839,-22.67003 z"
         id="path977"
         inkscape:connector-curvature="0"
         sodipodi:nodetypes="cssc" />
      <path
         sodipodi:nodetypes="cssssc"
         inkscape:connector-curvature="0"
         id="path935"
         d="m 110.6409,354.1527 c 2.70566,2.29588 7.29297,4.16178 12.83335,6.35559 4.50714,1.78468 9.29352,2.84832 11.82538,4.65075 5.64413,4.01805 4.27646,13.89132 -0.42839,16.82503 -5.38808,3.35976 -24.4145,3.32713 -30.04502,-10.84086 -2.15659,-5.42659 2.10198,-15.16597 5.81468,-16.99051 z"
         style="display:inline;opacity:1;fill:#3250b0;stroke:none;stroke-width:6;stroke-linecap:round;stroke-linejoin:round;stroke-miterlimit:4;stroke-dasharray:none" />
      <path
         sodipodi:nodetypes="cssscc"
         inkscape:connector-curvature="0"
         id="path969"
         d="m 120.41722,362.08645 c 1.97353,1.55472 9.8108,6.04925 11.1623,8.43393 2.49705,4.40598 -1.15209,11.00536 -5.57339,11.94142 -3.43856,0.728 9.63788,3.05341 11.10462,-2.53268 1.46674,-5.58609 2.18529,-13.18225 -1.45391,-14.28866 -3.6392,-1.1064 -15.23962,-3.55401 -15.23962,-3.55401 z"
         style="display:inline;opacity:1;fill:#c4d9f5;stroke:none;stroke-width:6;stroke-linecap:round;stroke-linejoin:round;stroke-miterlimit:4;stroke-dasharray:none" />
      <path
         style="display:inline;opacity:1;fill:none;stroke:#1d2848;stroke-width:6;stroke-linecap:round;stroke-linejoin:round;stroke-miterlimit:4;stroke-dasharray:none"
         d="m 110.6409,354.1527 c 2.70566,2.29588 7.29297,4.16178 12.83335,6.35559 4.50714,1.78468 9.29352,2.84832 11.82538,4.65075 5.64413,4.01805 4.27646,13.89132 -0.42839,16.82503 -5.38808,3.35976 -24.4145,3.32713 -30.04502,-10.84086 -2.15659,-5.42659 2.10198,-15.16597 5.81468,-16.99051 z"
         id="path979"
         inkscape:connector-curvature="0"
         sodipodi:nodetypes="cssssc" />
      <path
         sodipodi:nodetypes="scss"
         inkscape:connector-curvature="0"
         id="path1002"
         d="m 128.95651,370.48894 c 2.67835,-0.17281 13.02683,3.85251 14.6933,6.35278 -6.30137,4.76745 -14.24419,3.92384 -17.63988,1.25462 -1.4874,-1.16919 -3.35489,-7.20082 2.94658,-7.6074 z"
         style="opacity:1;fill:#3a3c3f;fill-opacity:1;stroke:#292929;stroke-width:4;stroke-linecap:round;stroke-linejoin:round;stroke-miterlimit:4;stroke-dasharray:none;stroke-opacity:1" />
      <path
         sodipodi:nodetypes="ssss"
         inkscape:connector-curvature="0"
         id="path1004"
         d="m 128.72821,394.37278 c 3.45093,-0.82991 15.62054,3.67014 15.62594,6.57008 0.004,1.88967 -7.24833,6.13221 -14.67707,2.92827 -3.76431,-1.62351 -2.79188,-9.05512 -0.94887,-9.49835 z"
         style="opacity:1;fill:#3a3c3f;fill-opacity:1;stroke:#292929;stroke-width:4;stroke-linecap:round;stroke-linejoin:round;stroke-miterlimit:4;stroke-dasharray:none;stroke-opacity:1" />
      <path
         sodipodi:nodetypes="ssss"
         inkscape:connector-curvature="0"
         id="path1006"
         d="m 135.42526,413.70345 c 1.96068,-0.79663 14.50759,3.33492 14.7806,5.54525 0.27301,2.21032 -12.08217,5.07908 -14.68545,2.74511 -2.60326,-2.33398 -1.6626,-7.6535 -0.0951,-8.29036 z"
         style="opacity:1;fill:#3a3c3f;fill-opacity:1;stroke:#292929;stroke-width:4;stroke-linecap:round;stroke-linejoin:round;stroke-miterlimit:4;stroke-dasharray:none;stroke-opacity:1" />
    </g>
    <g
       style="display:inline;opacity:1"
       inkscape:label="body"
       id="layer6"
       inkscape:groupmode="layer">
      <path
         sodipodi:nodetypes="cssssscc"
         inkscape:connector-curvature="0"
         id="path931"
         d="m 310.53879,106.84623 c 49.22959,9.12913 75.87295,49.52314 87.58369,98.56813 15.97605,66.90824 4.87077,122.07227 13.86168,142.4067 9.96576,22.53921 36.13255,160.24806 40.90599,215.03533 4.77344,54.78727 -83.27432,69.35372 -94.26997,44.49055 -10.99564,-24.86317 -52.6526,-164.20161 -52.6526,-173.15148 0,-8.94988 11.41934,-168.44649 11.41934,-168.44649 l -48.24366,-95.7919"
         style="opacity:1;fill:#3250b0;stroke:#1d2848;stroke-width:6;stroke-linecap:round;stroke-linejoin:round;stroke-miterlimit:4;stroke-dasharray:none" />
      <path
         sodipodi:nodetypes="csssssc"
         inkscape:connector-curvature="0"
         id="path904"
         d="m 328.1856,592.98121 c -10.52386,-74.03032 -49.30979,-106.64172 -54.48353,-157.96894 -5.98626,-59.38788 15.26814,-83.24113 14.47376,-147.3078 -0.43837,-35.35469 -24.5888,-64.25969 -16.34914,-75.31181 8.23966,-11.05211 51.86421,-22.20571 62.78042,10.20443 28.38819,84.28428 -12.94734,130.15763 -4.28507,209.69645 8.22127,75.48943 36.57066,105.85582 44.31959,160.87313"
         style="display:inline;opacity:1;fill:#c4d9f5;stroke:#1d2848;stroke-width:6;stroke-linecap:round;stroke-linejoin:round;stroke-miterlimit:4;stroke-dasharray:none" />
    </g>
    <g
       style="opacity:1"
       inkscape:label="head"
       id="layer7"
       inkscape:groupmode="layer">
      <path
         style="fill:#3a3c3f;stroke:#292929;stroke-width:6;stroke-linecap:round;stroke-linejoin:round"
         d="M 243.99229,115.21288 C 252.61613,81.557163 292.81076,9.5321243 313.07907,3.8187376 304.13154,20.426241 286.68797,75.497943 285.13988,110.11743"
         id="path1209"
         inkscape:connector-curvature="0"
         sodipodi:nodetypes="ccc" />
      <path
         id="path1218"
         style="fill:#c4d9f5;stroke:none;stroke-width:6;stroke-linecap:round;stroke-linejoin:round"
         d="m 346.73873,211.08608 c 0.0783,4.15262 -2.58265,13.22077 -12.50936,23.59916 -11.87577,12.41614 -39.01533,27.61507 -46.91997,33.98991 -6.46415,5.21313 -15.30718,22.06071 -28.85608,26.68051 -21.81454,7.43815 -54.67202,-1.0638 -59.96295,-8.55797 -2.15602,-3.05382 -6.09489,-6.96476 -5.95983,-9.85268 0,0 -1.34846,-0.6528 3.26486,-0.40565 5.33732,0.28593 13.59371,-2.28639 21.1671,-1.41816 9.51898,1.09128 22.49298,6.4856 32.20424,6.85496 11.90744,0.45289 20.11668,-6.00515 26.17395,-14.41754 5.44852,-7.56696 4.83704,-21.99122 13.69821,-30.79336 8.64757,-8.58996 27.96082,-13.35635 35.83581,-18.28016 8.76148,-5.47808 17.48046,-12.87489 19.53709,-20.45452 4.35539,-2.43397 4.53933,5.02661 2.32693,13.0555 z"
         inkscape:connector-curvature="0"
         sodipodi:nodetypes="cssssccssssscc" />
      <path
         style="fill:#3250b0;stroke:#1d2848;stroke-width:6;stroke-linecap:round;stroke-linejoin:round"
         d="m 285.06641,90.498047 c -10.26416,-0.223463 -24.6227,1.76489 -34.17383,4.71875 -3.03873,7.426683 -5.43404,14.273453 -6.90039,19.996093 l 41.14843,-5.0957 c 0.26793,-5.99149 1.02155,-12.602419 2.11524,-19.513674 -0.71725,-0.04189 -1.42276,-0.08878 -2.18945,-0.105469 z"
         id="path1225"
         inkscape:connector-curvature="0" />
      <path
         style="fill:#3250b0;stroke:none;stroke-width:6;stroke-linecap:round;stroke-linejoin:round"
         d="m 287.01172,104.44531 c -32.8402,-0.53045 -59.90394,14.59208 -69.8457,33.61328 -12.33499,23.60009 -8.24642,59.58918 -14.58985,83.14453 -1.07586,3.99502 -4.00488,10.28299 -7.44922,15.05274 -9.78805,8.70549 -15.41883,20.93349 -12.32812,30.68164 2.30598,7.2731 8.38277,9.35441 12.99609,9.60156 5.33732,0.28593 13.59458,-2.2862 21.16797,-1.41797 9.51898,1.09128 22.49187,6.48611 32.20313,6.85547 11.90744,0.45289 20.11655,-6.00558 26.17382,-14.41797 5.44852,-7.56696 4.83805,-21.99082 13.69922,-30.79297 8.64757,-8.58996 27.96095,-13.35743 35.83594,-18.28124 8.76148,-5.47808 17.48048,-12.8735 19.53711,-20.45313 l -23.05469,-87.40234 c -11.81002,-4.09105 -23.39897,-6.00678 -34.3457,-6.1836 z"
         id="path1211"
         inkscape:connector-curvature="0"
         sodipodi:nodetypes="ssccscsssssccs" />
      <path
         style="fill:#292f75;stroke:none;stroke-width:6;stroke-linecap:round;stroke-linejoin:round"
         d="m 271.04771,106.74135 c -15.71677,3.43836 -24.36597,30.36286 -10.15221,35.87708 23.30299,9.04038 35.56723,-26.96625 53.28881,-21.79639 12.08402,3.52524 4.72312,-10.07101 4.72312,-10.07101 -17.90421,-5.75704 -34.67843,-6.37422 -47.85972,-4.00968 z"
         id="path1207"
         inkscape:connector-curvature="0"
         sodipodi:nodetypes="csscc" />
      <path
         style="fill:none;stroke:#1d2848;stroke-width:6;stroke-linecap:round;stroke-linejoin:round"
         d="m 193.06465,238.86697 c 4.30052,-4.80691 8.22553,-12.88883 9.51159,-17.6644 6.34343,-23.55535 2.25433,-59.5431 14.58932,-83.14319 13.25568,-25.36161 56.95143,-43.794901 104.19151,-27.43071"
         id="path1205"
         inkscape:connector-curvature="0"
         sodipodi:nodetypes="cssc" />
      <ellipse
         transform="rotate(19.701645)"
         ry="28.198124"
         rx="27.01498"
         cy="67.655495"
         cx="328.9859"
         id="path1874"
         style="fill:#ffffff;stroke:#000000;stroke-width:6;stroke-linecap:round;stroke-linejoin:round;stroke-miterlimit:4;stroke-dasharray:none" />
      <ellipse
         transform="rotate(21.556456)"
         ry="23.831196"
         rx="22.009615"
         cy="78.243729"
         cx="271.73215"
         id="path1872"
         style="fill:#ffffff;stroke:#000000;stroke-width:6;stroke-linecap:round;stroke-linejoin:round;stroke-miterlimit:4;stroke-dasharray:none" />
      <ellipse
         ry="10.064749"
         rx="9.9430265"
         cy="180.20161"
         cx="221.88501"
         id="path1868"
         style="fill:#f01d0a;stroke:none;stroke-width:6;stroke-linecap:round;stroke-linejoin:round" />
      <ellipse
         ry="10.724902"
         rx="10.462238"
         cy="183.207"
         cx="278.48477"
         id="path1870"
         style="fill:#f01d0a;stroke:none;stroke-width:6.4813;stroke-linecap:round;stroke-linejoin:round" />
      <path
         transform="translate(0,-161.53332)"
         style="display:inline;opacity:1;fill:#1d2848;stroke:none;stroke-width:6;stroke-linecap:round;stroke-linejoin:round"
         d="m 195.76244,399.87941 c 3.94287,1.14178 7.65893,6.32381 8.24731,8.85646 0.58837,2.53266 -3.24966,3.32813 -6.42948,1.07326 -3.17983,-2.25485 -4.36665,-6.52152 -5.83971,-7.32769 1.24261,-1.34177 4.02188,-2.60203 4.02188,-2.60203 z"
         id="path1140"
         inkscape:connector-curvature="0"
         sodipodi:nodetypes="ccccc" />
      <path
         transform="translate(0,-161.53332)"
         style="display:inline;opacity:1;fill:#1d2848;fill-rule:nonzero;stroke:none;stroke-width:6;stroke-linecap:round;stroke-linejoin:round"
         d="m 204.21484,394.87385 c 2.97833,-1.72991 5.85647,-3.72438 8.18985,-5.20275 2.32997,-1.4762 4.05372,-2.48531 4.05372,-2.48531 0,0 -1.93572,-0.48882 -4.91019,-0.38804 -3.03997,0.10301 -6.86062,0.85013 -10.35443,2.89216 -15.03867,8.7641 -25.65547,25.8071 -21.25456,39.68769 2.76621,8.72467 10.22963,11.39795 15.69568,11.69078 5.89972,0.31606 13.86813,-2.24938 20.9859,-1.43338 9.1165,1.04514 22.21709,6.4838 32.43191,6.87231 13.3258,0.50684 22.25823,-6.68472 28.72253,-15.66239 6.00779,-8.34369 5.12247,-22.21754 13.37787,-30.41794 8.05216,-7.99852 26.87125,-12.58728 35.31204,-17.86485 3.39944,-2.12548 6.82717,-4.55327 9.90056,-7.18867 3.59443,-2.96486 6.0344,-6.73328 7.20815,-10.21248 1.12143,-3.32411 0.83793,-5.59708 0.83793,-5.59708 0,0 -1.21435,1.93229 -3.38091,4.0533 -2.18426,2.13834 -5.50096,4.45792 -8.57082,7.2015 -2.80008,2.40103 -5.96775,4.65018 -9.17581,6.65601 -7.30919,4.57005 -27.1166,9.51407 -36.35958,18.69547 -9.46694,9.40388 -9.1293,24.37855 -14.01855,31.16878 -5.65024,7.84711 -13.13629,13.57163 -23.62537,13.17269 -9.2077,-0.35021 -22.05511,-5.70019 -31.97657,-6.83761 -8.02901,-0.92046 -16.57338,1.65874 -21.3483,1.40294 -3.76059,-0.20147 -8.45149,-1.69123 -10.29724,-7.51276 -3.24212,-10.22571 5.15387,-24.87989 18.55619,-32.69037 z"
         id="path1142"
         inkscape:connector-curvature="0"
         sodipodi:nodetypes="csssssssc"
         inkscape:path-effect="#path-effect1221"
         inkscape:original-d="m 216.45841,387.18579 c -21.11801,3.5915 -38.62082,25.63692 -33.65947,41.28512 2.30598,7.2731 8.38314,9.35462 12.99646,9.60177 5.33732,0.28593 13.59371,-2.28639 21.1671,-1.41816 9.51898,1.09128 22.49298,6.4856 32.20424,6.85496 11.90744,0.45289 20.11668,-6.00515 26.17395,-14.41754 5.44852,-7.56696 4.83704,-21.99122 13.69821,-30.79336 8.64757,-8.58996 27.96082,-13.35635 35.83581,-18.28016 8.76148,-5.47808 17.48046,-12.87489 19.53709,-20.45452" />
      <path
         style="opacity:1;fill:#1d2848;stroke:none;stroke-width:6;stroke-linecap:round;stroke-linejoin:round"
         d="m 229.23336,251.05415 c 2.56028,-5.83644 10.21534,-9.09319 14.20606,-9.44498 3.99072,-0.35178 3.83703,3.84466 1.37006,5.31881 -3.03382,1.81288 -6.55183,7.52164 -10.79425,8.56634 -4.24243,1.04471 -5.69896,-2.34954 -4.78187,-4.44017 z"
         id="path1138"
         inkscape:connector-curvature="0"
         sodipodi:nodetypes="sssss" />
      <path
         style="fill:#1d2848;stroke:none;stroke-width:6;stroke-linecap:round;stroke-linejoin:round"
         d="m 341.49914,163.37695 c -0.267,1.93919 1.75097,5.45019 4.40302,7.00865 2.65204,1.55846 4.64493,-0.20593 4.56099,-3.39452 -0.0555,-2.10955 -2.36303,-5.52577 -4.81633,-6.32687 -1.9031,-0.62144 -3.91024,0.98819 -4.14768,2.71274 z"
         id="path1147"
         inkscape:connector-curvature="0"
         sodipodi:nodetypes="sssss" />
      <path
         style="fill:#1d2848;fill-rule:nonzero;stroke:none;stroke-width:6;stroke-linecap:round;stroke-linejoin:round"
         d="m 195.53449,277.17462 c -0.004,-0.0418 -0.75618,0.002 -1.50734,-0.0514 -0.75169,-0.0537 -1.49661,-0.17816 -1.49661,-0.17816 0,0 -0.75373,0.0393 -1.50228,0.23277 -0.74668,0.19296 -1.47545,0.56571 -1.43288,0.84945 0.55231,3.84732 4.58493,7.86718 6.44423,10.50071 6.41159,9.08149 40.94503,17.31754 63.38189,9.6672 14.41455,-4.91497 24.01595,-22.54336 29.77118,-27.18477 7.50557,-6.053 34.96251,-21.45232 47.20466,-34.25151 0.96724,-1.01125 1.8704,-2.01278 2.71303,-3.00168 3.71435,-4.33663 6.0612,-9.1888 7.20805,-13.65987 0.7129,-2.70503 0.8921,-4.84754 0.7989,-6.54511 -0.0878,-1.59936 -0.37859,-2.46612 -0.37859,-2.46612 0,0 -0.1667,0.90458 -0.71213,2.29924 -0.6332,1.61909 -1.43157,3.03676 -2.87403,5.37017 -2.43426,3.84054 -5.04056,6.89843 -8.60914,11.11028 -0.76696,0.9001 -1.59301,1.81638 -2.48203,2.74585 -11.50939,12.03309 -38.33157,27.03163 -46.63528,33.72831 -7.17307,5.78485 -15.25773,21.85162 -27.94098,26.17625 -21.19222,7.22596 -52.37374,-1.54189 -56.54401,-7.44874 -2.13425,-3.02298 -5.15357,-6.12999 -5.40664,-7.89282 z"
         id="path1149"
         inkscape:connector-curvature="0"
         sodipodi:nodetypes="cssssc"
         inkscape:path-effect="#path-effect1223"
         inkscape:original-d="m 192.53054,276.94501 c -0.13506,2.88792 3.80381,6.79886 5.95983,9.85268 5.29093,7.49417 38.14841,15.99612 59.96295,8.55797 13.5489,-4.6198 22.39193,-21.46738 28.85608,-26.68051 7.90464,-6.37484 35.0442,-21.57377 46.91997,-33.98991 9.92671,-10.37839 12.58767,-19.44654 12.50936,-23.59916" />
      <path
         style="fill:#3a3c3f;stroke:#292929;stroke-width:6;stroke-linecap:round;stroke-linejoin:round"
         d="M 312.8552,111.81046 C 331.8288,78.238702 374.01757,15.967128 395.07595,15.002811 384.08053,31.122835 359.31537,92.524262 348.99169,124.39204"
         id="path1203"
         inkscape:connector-curvature="0"
         sodipodi:nodetypes="ccc" />
      <path
         style="fill:#3250b0;stroke:none;stroke-width:6;stroke-linecap:round;stroke-linejoin:round"
         d="m 344.83398,138.99219 c 1.02791,-4.90748 3.62477,-13.27364 7.10743,-23.34375 -9.36445,-3.90607 -25.12067,-7.88199 -36.1211,-8.96485 -5.00374,8.56321 -8.87572,15.81867 -10.92383,20.45118"
         id="path1233"
         inkscape:connector-curvature="0"
         sodipodi:nodetypes="cccc" />
      <path
         sodipodi:nodetypes="cccc"
         inkscape:connector-curvature="0"
         id="path1241"
         d="m 343.78641,131.09243 c -0.521,1.78076 -0.29666,3.77317 0.10019,5.31853 0.39492,1.53779 0.94738,2.58123 0.94738,2.58123 0,0 0.9178,-0.74345 1.96484,-1.86242 1.04125,-1.11276 2.247,-2.63625 2.74751,-4.35705 1.29778,-4.44873 3.08906,-9.95232 5.23031,-16.14374 a 607.71042,607.71042 0 0 1 0.90717,-2.60395 65.633207,65.633207 0 0 0 -2.58749,-1.14538 c -9.58241,-3.99698 -25.76441,-8.07738 -36.98212,-9.18163 a 76.987852,76.987852 0 0 0 -1.92307,-0.16499 467.11697,467.11697 0 0 0 -0.96103,1.63702 c -3.02586,5.17834 -5.65246,9.90235 -7.71909,13.87121 -1.79377,3.44116 -0.61453,8.09351 -0.61453,8.09351 0,0 1.06135,-0.55483 2.32854,-1.47549 1.26137,-0.91644 2.76136,-2.2197 3.60775,-3.84693 1.79023,-3.43806 4.02288,-7.47909 6.5993,-11.93246 9.60737,1.17248 22.06969,4.26666 30.7411,7.50747 -1.75393,5.15524 -3.25285,9.81812 -4.38676,13.70507 z"
         style="fill:#1d2848;fill-rule:nonzero;stroke:none;stroke-width:6;stroke-linecap:round;stroke-linejoin:round"
         inkscape:path-effect="#path-effect1243"
         inkscape:original-d="m 344.83398,138.99219 c 1.02791,-4.90748 3.62477,-13.27364 7.10743,-23.34375 -9.36445,-3.90607 -25.12067,-7.88199 -36.1211,-8.96485 -5.00374,8.56321 -8.87572,15.81867 -10.92383,20.45118" />
    </g>
    <g
       style="display:inline;opacity:1"
       inkscape:label="arm f"
       id="layer8"
       inkscape:groupmode="layer">
      <path
         id="path902"
         style="fill:#3250b0;stroke:none;stroke-width:6;stroke-linecap:round;stroke-linejoin:round"
         d="m 260.41811,353.3384 c -3.93137,-7.96212 -11.83946,-13.5679 -20.77045,-13.24851 -5.95966,0.21312 -12.18656,4.14909 -16.67049,12.1044 l 5.96254,2.1244 c -3.63875,0.36872 -14.67222,-5.26427 -23.45169,-3.97675 -17.36902,2.54718 -33.9351,17.0296 -27.33227,25.70761 7.38655,9.70805 27.89728,-1.50244 49.4652,-3.18999 -7.09374,2.19023 -9.89726,11.61769 -8.35263,17.22702 1.31528,4.77646 9.64627,8.93795 13.99997,8.28554 2.85145,-0.42729 5.48452,-1.09978 8.96981,-2.63587 -3.27596,2.17722 -4.96545,6.75052 -4.45355,8.75554 1.463,5.73041 10.48448,9.08763 15.53188,8.77036 10.21172,-0.64189 20.67186,-11.95927 22.94505,-16.049"
         inkscape:connector-curvature="0"
         sodipodi:nodetypes="ccccsscscccsc" />
      <path
         sodipodi:nodetypes="cccsccsssc"
         inkscape:connector-curvature="0"
         d="m 360.15326,352.69381 c -9.92789,21.44505 1.76952,58.89103 0.37971,71.26199 l 4.65271,-4.26264 c -11.31796,-7.07128 -57.79902,-58.53028 -78.73182,-66.4569 -12.36273,-4.6814 -22.99224,-4.62624 -28.27003,-1.65269 -9.5488,7.33138 -6.50816,38.15571 16.32906,47.69211 5.82691,-1.26237 15.64999,-0.59994 23.81536,8.17801 8.73872,9.39433 39.82744,58.26045 54.0733,66.17374 13.60992,7.56004 24.89085,5.51916 35.30793,-5.76989 14.85287,-16.09613 23.12352,-77.7634 10.388,-110.90464"
         style="fill:#3250b0;stroke:none;stroke-width:6;stroke-linecap:round;stroke-linejoin:round"
         id="path1267" />
      <path
         inkscape:connector-curvature="0"
         id="path1253"
         d="m 186.08276,359.74498 c -1.61703,5.77605 1.41407,13.36559 12.40233,12.2339 10.98826,-1.13168 29.00621,-7.09751 42.09007,1.05969 -14.68086,-0.0243 -43.21205,7.52905 -51.00882,7.03766 -7.79678,-0.49139 -14.77356,-6.73365 -12.27148,-11.88878 2.50207,-5.15513 8.7879,-8.44247 8.7879,-8.44247 z"
         style="fill:#c4d9f5;stroke:none;stroke-width:6;stroke-linecap:round;stroke-linejoin:round" />
      <path
         inkscape:original-d="m 230.79334,354.73637 c -3.63875,0.36872 -16.52585,-5.68195 -25.30532,-4.39443 -17.36902,2.54718 -33.9351,17.0296 -27.33227,25.70761 10.12926,13.31276 44.84482,-11.3598 75.41102,2.0642"
         inkscape:path-effect="#path-effect1272"
         sodipodi:nodetypes="cssc"
         inkscape:connector-curvature="0"
         id="path1210"
         d="m 218.02449,354.75333 c 2.51742,0.65551 5.20343,0.90278 7.53423,0.87262 1.59408,-0.007 2.70638,-0.0426 3.82509,-0.32776 0.95238,-0.24276 1.40953,-0.56182 1.40953,-0.56182 0,0 -0.53797,-0.16526 -1.27618,-0.5986 -0.7425,-0.43587 -1.63544,-1.22567 -3.00542,-1.98784 -1.87583,-1.16603 -4.30475,-2.50523 -6.97284,-3.20233 -4.54259,-1.18492 -9.88788,-2.24826 -14.48618,-1.57391 -18.56626,2.72276 -38.05875,18.9605 -29.28446,30.49242 9.93804,13.06144 36.82895,-2.93266 61.99152,-0.65779 2.87113,0.26266 8.54214,0.46302 10.6545,0.57449 3.00657,0.15866 5.15249,0.33094 5.15249,0.33094 0,0 -1.50358,-1.53937 -4.25452,-3.19157 -2.81344,-1.68973 -6.67198,-3.30128 -11.01223,-3.68949 -26.75901,-2.4192 -50.88177,12.03604 -57.75678,3.0003 -4.39328,-5.77403 9.2293,-18.55428 25.38008,-20.9228 3.40101,-0.49876 7.76004,0.31077 12.10117,1.44314 z"
         style="fill:#1d2848;fill-rule:nonzero;stroke:none;stroke-width:6;stroke-linecap:round;stroke-linejoin:round" />
      <path
         inkscape:original-d="m 260.55296,352.9295 c -3.93137,-7.96212 -11.97431,-13.159 -20.9053,-12.83961 -5.95966,0.21312 -12.18656,4.14909 -16.67049,12.1044"
         inkscape:path-effect="#path-effect1270"
         sodipodi:nodetypes="csc"
         inkscape:connector-curvature="0"
         id="path1212"
         d="m 255.53309,350.56689 c 0.65493,0.82918 1.90623,1.35283 2.9838,1.73487 1.0879,0.3857 2.03607,0.62774 2.03607,0.62774 0,0 0.41032,-0.88674 0.56175,-2.12828 0.15213,-1.2473 0.0215,-2.81973 -0.87247,-3.95238 -4.91764,-6.22852 -12.46003,-10.05178 -20.70179,-9.75703 -7.02579,0.25124 -13.88785,4.71234 -18.7353,12.86685 -0.24006,0.40384 2.17202,2.23563 2.17202,2.23563 0,0 2.81066,1.12441 2.98552,0.83027 4.05102,-6.81474 9.25496,-9.77433 13.79219,-9.93659 6.22506,-0.22262 11.98442,2.67384 15.77821,7.47892 z"
         style="fill:#1d2848;fill-rule:nonzero;stroke:none;stroke-width:6;stroke-linecap:round;stroke-linejoin:round" />
      <path
         inkscape:original-d="m 226.76987,372.74908 c -6.24266,2.30071 -8.55893,10.17563 -7.0143,15.78496 1.31528,4.77646 9.15902,10.49049 13.51272,9.83808 5.11743,-0.76685 12.44436,-5.65742 19.76051,-6.13723"
         inkscape:path-effect="#path-effect1274"
         sodipodi:nodetypes="cssc"
         inkscape:connector-curvature="0"
         id="path1214"
         d="m 225.73917,376.76006 c 0.42827,-0.35505 0.5639,-1.34117 0.71695,-2.24473 0.15475,-0.91368 0.31375,-1.76625 0.31375,-1.76625 0,0 -0.64768,-0.57422 -1.6475,-0.92048 -1.00179,-0.34695 -2.3266,-0.42322 -3.21477,0.31421 -5.00045,4.14956 -6.59973,11.53941 -5.04437,17.18769 1.67972,6.09994 10.77404,12.91893 16.84965,12.00849 2.08318,-0.31216 4.33379,-1.15232 6.51251,-2.0356 3.19681,-1.25808 6.68591,-3.64008 8.70861,-4.85955 2.29215,-1.38192 4.0948,-2.20895 4.0948,-2.20895 0,0 -1.86663,-0.68305 -4.86148,-0.67543 -3.14589,0.008 -6.7425,0.74005 -10.19619,2.18351 -2.0953,0.84946 -3.78767,1.45852 -5.14743,1.66228 -2.63179,0.39438 -9.22495,-4.21469 -10.17579,-7.66767 -0.98704,-3.58445 0.10122,-8.49627 3.09126,-10.97752 z"
         style="fill:#1d2848;fill-rule:nonzero;stroke:none;stroke-width:6;stroke-linecap:round;stroke-linejoin:round" />
      <path
         inkscape:path-effect="#path-effect1276"
         inkscape:original-d="m 241.79079,394.68413 c -3.55946,1.74444 -4.51814,7.80264 -4.00624,9.80766 1.463,5.73041 10.48448,9.08763 15.53188,8.77036 10.21172,-0.64189 21.25765,-13.02379 23.53084,-17.11352"
         sodipodi:nodetypes="cssc"
         inkscape:connector-curvature="0"
         id="path1216"
         d="m 242.07758,398.3496 c 0.27416,-0.35428 -0.0385,-1.14867 -0.17164,-1.98726 -0.13294,-0.83733 -0.11515,-1.67821 -0.11515,-1.67821 0,0 -0.64701,-0.53599 -1.67867,-0.71597 -1.03048,-0.17978 -2.35183,0.0439 -2.95365,0.94599 -2.19,3.1358 -2.94001,7.7373 -2.28068,10.31975 1.91795,7.5124 12.5167,11.40641 18.62684,11.02234 9.06694,-0.56993 17.89461,-8.56195 22.61438,-14.07076 0.86928,-0.99649 1.15776,-2.55195 1.12157,-3.84085 -0.036,-1.28082 -0.39331,-2.196 -0.39331,-2.196 0,0 -0.96394,0.19883 -2.07312,0.49243 -1.10246,0.29182 -2.42528,0.70536 -3.21152,1.64065 -4.28906,5.0061 -11.96416,11.57964 -18.4344,11.98635 -3.98466,0.25047 -11.42887,-2.56996 -12.43692,-6.51839 -0.11244,-0.44041 0.0371,-3.46825 1.38627,-5.40007 z"
         style="fill:#1d2848;fill-rule:nonzero;stroke:none;stroke-width:6;stroke-linecap:round;stroke-linejoin:round" />
      <path
         inkscape:original-d="m 365.18568,419.69316 c -11.31796,-7.07128 -57.79902,-58.53028 -78.73182,-66.4569 -12.36273,-4.6814 -24.79925,-4.88014 -30.07704,-1.90659"
         inkscape:path-effect="#path-effect896"
         sodipodi:nodetypes="csc"
         inkscape:connector-curvature="0"
         id="path1219"
         d="m 357.44314,417.39625 c 1.38692,1.22832 3.3194,1.91277 4.95237,2.18698 1.61447,0.27112 2.79017,0.10993 2.79017,0.10993 0,0 -0.392,-1.12068 -0.98375,-2.5023 -0.58418,-1.36392 -1.42459,-3.11039 -2.80422,-4.30696 -16.67094,-14.61019 -54.98321,-55.29703 -73.88146,-62.45323 -10.24828,-3.88072 -20.84374,-4.89117 -27.7893,-3.42968 -1.19696,0.2365 -2.18355,1.32434 -2.73113,2.37158 -0.54496,1.04222 -0.619,1.9571 -0.619,1.9571 0,0 0.83002,0.38193 1.75332,0.81556 0.91117,0.42795 1.95818,0.92558 2.83228,0.72718 5.6176,-1.18206 14.89697,-0.44008 24.42905,3.16944 17.74047,6.71778 55.20118,46.58686 72.05167,61.3544 z"
         style="fill:#1d2848;fill-rule:nonzero;stroke:none;stroke-width:6;stroke-linecap:round;stroke-linejoin:round;stroke-miterlimit:4;stroke-dasharray:none" />
      <path
         inkscape:original-d="m 360.15326,352.69381 c -8.32973,17.99289 -1.43612,47.2498 0.17829,63.50967"
         inkscape:path-effect="#path-effect898"
         sodipodi:nodetypes="csc"
         inkscape:connector-curvature="0"
         id="path1221"
         d="m 359.92893,364.1373 c 0.41261,-2.53795 0.35168,-5.57248 0.31309,-7.63654 -0.0409,-2.18675 -0.0888,-3.80695 -0.0888,-3.80695 0,0 -1.30642,0.95818 -2.7466,2.83446 -1.46694,1.91116 -2.92314,4.60997 -3.40267,7.66293 -2.79326,17.49272 1.85732,39.37399 3.26183,52.52896 0.0407,0.38101 3.06573,0.48332 3.06573,0.48332 0,0 2.94526,-0.6998 2.90036,-1.1203 -1.44073,-13.49424 -5.95199,-34.35655 -3.30298,-50.94588 z"
         style="fill:#1d2848;fill-rule:nonzero;stroke:none;stroke-width:6;stroke-linecap:round;stroke-linejoin:round;stroke-miterlimit:4;stroke-dasharray:none" />
      <path
         inkscape:original-d="m 271.70377,401.87037 c 4.68703,-5.46419 18.45911,-3.19463 26.62448,5.58332 8.73872,9.39433 39.82744,58.26045 54.0733,66.17374 13.60992,7.56004 24.89085,5.51916 35.30793,-5.76989 14.85287,-16.09613 23.12352,-77.7634 10.388,-110.90464"
         inkscape:path-effect="#path-effect1278"
         sodipodi:nodetypes="csssc"
         inkscape:connector-curvature="0"
         id="path1223"
         d="m 272.30198,397.61229 c -0.82516,0.44497 -1.10038,1.598 -1.03665,2.563 0.0637,0.96512 0.43844,1.69508 0.43844,1.69508 0,0 0.79044,0.22643 1.5797,0.52162 0.78986,0.29541 1.53666,0.68847 1.89976,0.48322 4.29533,-2.35153 14.39739,-0.42075 20.94844,6.62177 8.4595,9.09417 39.82638,58.42818 54.8131,66.75301 14.83322,8.23955 27.63766,5.92236 38.96947,-6.35799 13.78014,-14.93361 21.57333,-63.88186 15.21281,-98.49697 -0.73193,-4.00267 -2.3914,-7.61329 -4.01486,-10.28978 -1.59319,-2.62659 -3.01471,-4.15235 -3.01471,-4.15235 0,0 0.0262,2.08575 0.14793,5.03288 0.11547,2.79651 0.32291,6.93333 0.98044,10.49359 6.18939,33.68381 -1.85209,80.48117 -13.72113,93.34371 -9.50235,10.29775 -19.25977,12.06232 -31.64639,5.18179 -13.505,-7.50175 -44.31556,-55.89998 -53.3335,-65.59447 -7.83276,-8.42038 -20.81359,-11.85441 -28.22285,-7.79811 z"
         style="fill:#1d2848;fill-rule:nonzero;stroke:none;stroke-width:6;stroke-linecap:round;stroke-linejoin:round" />
      <path
         sodipodi:nodetypes="ssss"
         inkscape:connector-curvature="0"
         id="path900"
         d="m 189.08508,357.41745 c 4.41397,-0.43449 9.24671,1.69926 7.00223,6.68594 -2.24448,4.98667 -19.37356,12.48681 -26.43264,12.72719 -7.05908,0.24039 10.03316,-18.4881 19.43041,-19.41313 z"
         style="fill:#3a3c3f;stroke:#292929;stroke-width:4;stroke-linecap:round;stroke-linejoin:round;stroke-miterlimit:4;stroke-dasharray:none" />
    </g>
    <g
       inkscape:label="wing f"
       id="layer9"
       inkscape:groupmode="layer"
       style="display:inline;opacity:1">
      <path
         inkscape:connector-curvature="0"
         id="path933"
         d="m 412.89202,418.9903 c 5.96258,28.57035 32.96825,159.6311 57.46704,170.74808 24.49879,11.11698 -14.75579,-157.57772 -14.75579,-157.57772 z"
         style="opacity:1;fill:#292f75;stroke:none;stroke-width:6;stroke-linecap:round;stroke-linejoin:round;stroke-miterlimit:4;stroke-dasharray:none" />
      <path
         style="fill:#3250b0;stroke:none;stroke-width:6;stroke-linecap:round;stroke-linejoin:round"
         d="m 389.01422,354.58632 c 1.8034,37.0466 48.08472,113.47715 59.47372,118.02271 11.389,4.54556 -14.42969,-116.44052 -20.93021,-126.61245"
         id="path1364"
         inkscape:connector-curvature="0" />
      <path
         inkscape:original-d="m 389.01422,354.58632 c 1.8034,37.0466 48.08472,113.47715 59.47372,118.02271 11.389,4.54556 -14.42969,-116.44052 -20.93021,-126.61245"
         inkscape:path-effect="#path-effect1208"
         inkscape:connector-curvature="0"
         id="path1206"
         d="m 397.63931,379.6855 c -1.8503,-5.49652 -4.34428,-11.56992 -6.19457,-17.06644 -1.59167,-4.69847 -2.43052,-8.03274 -2.43052,-8.03274 0,0 -0.66889,3.37396 -0.51897,8.55404 0.15678,5.41733 1.18146,11.81431 3.46274,18.47455 13.18336,38.81957 44.87974,89.57442 55.4179,93.7804 2.77968,1.10942 5.04023,-0.67986 5.93248,-2.83862 4.65623,-11.26555 -8.45612,-77.34081 -17.08493,-109.82031 -1.11095,-4.18575 -2.85917,-8.05663 -4.59484,-11.1225 -1.07705,-1.91168 -1.78598,-3.0959 -2.71384,-4.22537 -0.79105,-0.96292 -1.35703,-1.39193 -1.35703,-1.39193 0,0 0.20571,0.68381 0.37924,1.83694 0.17394,1.15584 0.23345,2.78882 0.49624,4.82507 0.36459,3.24997 0.93274,7.63743 1.99138,11.61837 7.6285,28.71424 18.47947,83.48765 17.90553,101.74693 -0.0717,2.28241 -0.2458,3.46434 -0.56678,4.24095 -0.018,0.0437 -0.0321,0.073 -0.0412,0.0907 0,0 -0.007,0.0136 -0.007,0.0136 0,0 0.0307,-0.0429 0.0307,-0.0429 0,0 0.0689,-0.0792 0.0689,-0.0792 0,0 1.57397,-0.48447 1.57397,-0.48447 0,0 0.12184,0.0294 0.12184,0.0294 0,0 0.0895,0.0306 0.0895,0.0306 -7.68424,-3.06692 -38.87243,-51.59775 -51.96068,-90.13725 z"
         style="fill:#1d2848;fill-rule:nonzero;stroke:none;stroke-width:6;stroke-linecap:round;stroke-linejoin:round" />
      <path
         style="fill:#292f75;stroke:none;stroke-width:6;stroke-linecap:round;stroke-linejoin:round"
         d="m 431.35829,635.54016 c 27.9528,-25.92076 50.05363,-41.44261 85.36892,-29.33036 0.49517,-37.8989 -9.82527,-178.51728 -104.29025,-277.51185 32.61161,109.56909 30.48488,243.76491 18.92133,306.84221 z"
         id="path1362"
         inkscape:connector-curvature="0" />
      <path
         style="fill:#3250b0;stroke:#1d2848;stroke-width:6;stroke-linecap:round;stroke-linejoin:round"
         d="m 412.45492,317.36118 c -6.09011,-13.79414 -15.98142,-25.11201 -24.04596,-25.36455 -8.06455,-0.25253 -1.93704,18.46077 11.81377,29.57422"
         id="path1358"
         inkscape:connector-curvature="0" />
      <path
         style="fill:#3250b0;stroke:#1d2848;stroke-width:6;stroke-linecap:round;stroke-linejoin:round"
         d="m 431.43677,631.69383 c 14.48887,-52.37353 15.27193,-117.55574 10.50919,-174.44799 -3.88665,-46.42714 -13.44051,-87.32681 -21.9348,-111.25349 37.0677,48.34267 89.1921,144.24596 95.97098,274.69517 5.91649,-7.19326 10.87038,-29.08837 10.23588,-33.50897 -9.25251,-107.22416 -65.23773,-225.30441 -115.65192,-269.88906 -9.93659,-8.78759 -15.04365,-1.11218 -5.91417,23.80116 11.72332,31.99163 42.2978,151.31681 15.94281,289.71344 -4.08778,12.58362 7.35289,7.28337 10.84203,0.88974 z"
         id="path1356"
         inkscape:connector-curvature="0"
         sodipodi:nodetypes="cscccsscc" />
      <path
         style="fill:#3a3c3f;stroke:#292929;stroke-width:6;stroke-linecap:round;stroke-linejoin:round"
         d="m 399.87376,299.37957 c -8.14559,2.61888 -21.54731,-12.71127 -29.68732,-15.59659 10.4168,-5.98913 32.80792,6.09863 29.68732,15.59659 z"
         id="path1360"
         inkscape:connector-curvature="0" />
    </g>
  </g>
  <g
     style="display:inline;filter:url(#filter1077)"
     inkscape:label="glow"
     id="layer10"
     inkscape:groupmode="layer">
    <path
       clip-path="url(#clipPath1073)"
       sodipodi:nodetypes="cccc"
       inkscape:connector-curvature="0"
       id="path1010"
       d="m 114.86136,345.3213 42.18915,-208.81515 c 147.16676,-8.52377 296.71673,220.19221 254.26872,365.39627 L 168.16729,432.7412"
       style="display:inline;opacity:0.23350851;fill:url(#radialGradient1024);fill-opacity:1;stroke:none;stroke-width:6;stroke-linecap:round;stroke-linejoin:round;stroke-miterlimit:4;stroke-dasharray:none;stroke-opacity:1;filter:url(#filter1035)" />
  </g>
  <g
     style="display:inline"
     inkscape:label="telegram"
     id="layer2"
     inkscape:groupmode="layer">
    <path
       sodipodi:nodetypes="ccccccc"
       inkscape:connector-curvature="0"
       d="m 131.79766,305.06194 c -1.46292,4.10398 -5.94458,6.23018 -10.04856,4.76727 L 57.386027,286.88614 11.19877,189.53147 l 97.35467,-46.18727 46.18727,97.35469 z"
       style="fill:url(#linearGradient1859);fill-opacity:1;stroke:none;stroke-width:6;stroke-linecap:round;stroke-linejoin:round"
       id="rect1849" />
    <path
       d="m 159.16422,376.6485 c 0,42.09744 -34.09704,76.19447 -76.194485,76.19447 -42.097449,0 -76.1944681,-34.09703 -76.1944681,-76.19447 0,-42.09745 34.0970191,-76.19448 76.1944681,-76.19448 42.097445,0 76.194485,34.09703 76.194485,76.19448 z"
       class="st0"
       id="path2995-1-0-0"
       inkscape:connector-curvature="0"
       style="opacity:1;fill:url(#linearGradient1777);fill-opacity:1;stroke-width:0.634956;stop-opacity:1"
       transform="translate(0,-161.53332)" />
    <path
       d="m 67.653955,414.93796 c -2.71508,0 -2.22776,-1.04426 -3.2024,-3.62009 l -7.93637,-26.17607 49.289015,-30.77081 5.77821,1.53157 -4.80357,13.08804 z"
       class="st1"
       id="path2993-6"
       inkscape:connector-curvature="0"
       style="opacity:1;fill:#c8daea;fill-opacity:1;stroke-width:0.696174;stop-opacity:1"
       transform="translate(0,-161.53332)" />
    <path
       d="m 67.653955,414.93796 c 2.08852,0 2.99353,-0.97463 4.17703,-2.08852 1.81004,-1.74042 25.06218,-24.36602 25.06218,-24.36602 l -14.27152,-3.48086 -13.22727,8.35407 -1.74042,20.88517 z"
       class="st2"
       id="path2989-2"
       inkscape:connector-curvature="0"
       style="opacity:1;fill:#a9c9dd;fill-opacity:1;stroke-width:0.696174;stop-opacity:1"
       transform="translate(0,-161.53332)" />
    <path
       style="opacity:1;fill:#eff7fc;fill-opacity:1;stroke-width:0.696174;stop-opacity:1"
       d="m 69.046285,393.63509 33.694735,24.85335 c 3.82897,2.08851 6.61363,1.04425 7.5883,-3.55048 l 13.71457,-64.60477 c 1.39235,-5.639 -2.15813,-8.14522 -5.84784,-6.4744 l -80.477505,31.04928 c -5.49976,2.22774 -5.43014,5.2909 -0.97465,6.61362 l 20.67632,6.47441 47.827055,-30.14425 c 2.22773,-1.39235 4.31623,-0.62656 2.64544,0.90502 z"
       class="st3"
       id="path2991-6"
       inkscape:connector-curvature="0"
       transform="translate(0,-161.53332)" />
  </g>
</svg>
