<?xml version="1.0" encoding="UTF-8" standalone="no"?>
<svg
   xmlns:dc="http://purl.org/dc/elements/1.1/"
   xmlns:cc="http://creativecommons.org/ns#"
   xmlns:rdf="http://www.w3.org/1999/02/22-rdf-syntax-ns#"
   xmlns:svg="http://www.w3.org/2000/svg"
   xmlns="http://www.w3.org/2000/svg"
   xmlns:xlink="http://www.w3.org/1999/xlink"
   xmlns:sodipodi="http://sodipodi.sourceforge.net/DTD/sodipodi-0.dtd"
   xmlns:inkscape="http://www.inkscape.org/namespaces/inkscape"
   width="1571.4286"
   height="1571.4286"
   viewBox="0 0 415.7738 415.77383"
   version="1.1"
   id="svg4613"
   inkscape:version="0.92+devel (unknown)"
   sodipodi:docname="bored.svg"
   inkscape:export-filename="/home/melano/Pictures/Dragons/Glax/stickers/bored.png"
   inkscape:export-xdpi="31.278545"
   inkscape:export-ydpi="31.278545">
  <defs
     id="defs4607">
    <inkscape:path-effect
       end_linecap_type="butt"
       miter_limit="4"
       linejoin_type="extrp_arc"
       start_linecap_type="zerowidth"
       interpolator_beta="0.2"
       interpolator_type="CubicBezierSmooth"
       sort_points="true"
       offset_points="0.33074382,1.7085843"
       is_visible="true"
       id="path-effect4574"
       effect="powerstroke" />
    <inkscape:path-effect
       effect="powerstroke"
       id="path-effect4941"
       is_visible="true"
       offset_points="0.21670232,1.1752618 | 1.5,1.5875 | 2.7951958,1.4485412"
       sort_points="true"
       interpolator_type="CubicBezierSmooth"
       interpolator_beta="0.2"
       start_linecap_type="zerowidth"
       linejoin_type="extrp_arc"
       miter_limit="4"
       end_linecap_type="zerowidth" />
    <inkscape:path-effect
       effect="powerstroke"
       id="path-effect4929"
       is_visible="true"
       offset_points="0.33074382,1.7085843"
       sort_points="true"
       interpolator_type="CubicBezierSmooth"
       interpolator_beta="0.2"
       start_linecap_type="zerowidth"
       linejoin_type="extrp_arc"
       miter_limit="4"
       end_linecap_type="butt" />
    <inkscape:path-effect
       effect="powerstroke"
       id="path-effect4923"
       is_visible="true"
       offset_points="0.20259023,1.8923887 | 1.786907,2.0850127"
       sort_points="true"
       interpolator_type="CubicBezierSmooth"
       interpolator_beta="0.2"
       start_linecap_type="zerowidth"
       linejoin_type="extrp_arc"
       miter_limit="4"
       end_linecap_type="butt" />
    <inkscape:path-effect
       effect="powerstroke"
       id="path-effect4915"
       is_visible="true"
       offset_points="0.49843293,1.8182794 | 1.5,1.5875 | 2.8,1.5875"
       sort_points="true"
       interpolator_type="CubicBezierSmooth"
       interpolator_beta="0.2"
       start_linecap_type="zerowidth"
       linejoin_type="extrp_arc"
       miter_limit="4"
       end_linecap_type="butt" />
    <inkscape:path-effect
       end_linecap_type="butt"
       miter_limit="4"
       linejoin_type="extrp_arc"
       start_linecap_type="zerowidth"
       interpolator_beta="0.2"
       interpolator_type="CubicBezierSmooth"
       sort_points="true"
       offset_points="1.0444858,1.7118731 | 2,1.5875 | 3.8,1.5875"
       is_visible="true"
       id="path-effect4913"
       effect="powerstroke" />
    <inkscape:path-effect
       end_linecap_type="zerowidth"
       miter_limit="4"
       linejoin_type="extrp_arc"
       start_linecap_type="zerowidth"
       interpolator_beta="0.2"
       interpolator_type="CubicBezierSmooth"
       sort_points="true"
       offset_points="0.64252002,1.7391317 | 3.5,1.5875 | 6.8,1.5875"
       is_visible="true"
       id="path-effect4900"
       effect="powerstroke" />
    <inkscape:path-effect
       effect="powerstroke"
       id="path-effect4896"
       is_visible="true"
       offset_points="0.78336435,1.7118731 | 1.5,1.5875 | 2.85,1.5875"
       sort_points="true"
       interpolator_type="CubicBezierSmooth"
       interpolator_beta="0.2"
       start_linecap_type="zerowidth"
       linejoin_type="round"
       miter_limit="4"
       end_linecap_type="butt" />
    <inkscape:path-effect
       effect="powerstroke"
       id="path-effect4888"
       is_visible="true"
       offset_points="0.50524476,1.6444162 | 2,1.5875 | 3.8857142,1.5875"
       sort_points="true"
       interpolator_type="CubicBezierSmooth"
       interpolator_beta="0.2"
       start_linecap_type="zerowidth"
       linejoin_type="round"
       miter_limit="4"
       end_linecap_type="zerowidth" />
    <inkscape:path-effect
       effect="powerstroke"
       id="path-effect5296"
       is_visible="true"
       offset_points="1.1993707,1.8368701"
       sort_points="true"
       interpolator_type="CubicBezierSmooth"
       interpolator_beta="0.2"
       start_linecap_type="zerowidth"
       linejoin_type="extrp_arc"
       miter_limit="4"
       end_linecap_type="butt" />
    <inkscape:path-effect
       end_linecap_type="zerowidth"
       miter_limit="4"
       linejoin_type="round"
       start_linecap_type="zerowidth"
       interpolator_beta="0.2"
       interpolator_type="CubicBezierSmooth"
       sort_points="true"
       offset_points="0.2,1.5875 | 1.5,1.5875 | 2.8,1.5875"
       is_visible="true"
       id="path-effect5290"
       effect="powerstroke" />
    <inkscape:path-effect
       effect="powerstroke"
       id="path-effect5284"
       is_visible="true"
       offset_points="0.36442451,1.9709244 | 2.5960642,1.5092541"
       sort_points="true"
       interpolator_type="CubicBezierSmooth"
       interpolator_beta="0.2"
       start_linecap_type="zerowidth"
       linejoin_type="round"
       miter_limit="4"
       end_linecap_type="zerowidth" />
    <inkscape:path-effect
       effect="powerstroke"
       id="path-effect5268"
       is_visible="true"
       offset_points="1.036766,1.6900219 | 2.6661135,1.7260082"
       sort_points="true"
       interpolator_type="CubicBezierSmooth"
       interpolator_beta="0.2"
       start_linecap_type="zerowidth"
       linejoin_type="extrp_arc"
       miter_limit="4"
       end_linecap_type="zerowidth" />
    <inkscape:path-effect
       effect="powerstroke"
       id="path-effect5264"
       is_visible="true"
       offset_points="0.43711719,1.6190711 | 1.2685736,1.5098036"
       sort_points="true"
       interpolator_type="CubicBezierSmooth"
       interpolator_beta="0.2"
       start_linecap_type="zerowidth"
       linejoin_type="extrp_arc"
       miter_limit="4"
       end_linecap_type="zerowidth" />
    <inkscape:path-effect
       effect="powerstroke"
       id="path-effect5257"
       is_visible="true"
       offset_points="0.20506204,1.7239421"
       sort_points="true"
       interpolator_type="CubicBezierSmooth"
       interpolator_beta="0.2"
       start_linecap_type="zerowidth"
       linejoin_type="extrp_arc"
       miter_limit="4"
       end_linecap_type="butt" />
    <linearGradient
       inkscape:collect="always"
       id="linearGradient5267">
      <stop
         style="stop-color:#ebeff1;stop-opacity:0.42352942"
         offset="0"
         id="stop5263" />
      <stop
         style="stop-color:#c7e7ff;stop-opacity:0"
         offset="1"
         id="stop5265" />
    </linearGradient>
    <radialGradient
       inkscape:collect="always"
       xlink:href="#linearGradient5267"
       id="radialGradient5269"
       cx="66.856239"
       cy="128.92767"
       fx="66.856239"
       fy="128.92767"
       r="122.61296"
       gradientTransform="matrix(1.0957917,-0.2448527,0.20486488,0.91683374,-34.552004,43.183732)"
       gradientUnits="userSpaceOnUse" />
    <inkscape:path-effect
       effect="powerstroke"
       id="path-effect5392"
       is_visible="true"
       offset_points="0.5271698,1.9621815 | 5.5,2.0352301 | 10.8,2.0352301"
       sort_points="true"
       interpolator_type="CubicBezierSmooth"
       interpolator_beta="0.2"
       start_linecap_type="zerowidth"
       linejoin_type="extrp_arc"
       miter_limit="4"
       end_linecap_type="butt" />
    <inkscape:path-effect
       effect="powerstroke"
       id="path-effect5465"
       is_visible="true"
       offset_points="0.3979927,1.2091636 | 2,1.3229166 | 3.8,1.3229166"
       sort_points="true"
       interpolator_type="CubicBezierSmooth"
       interpolator_beta="0.2"
       start_linecap_type="zerowidth"
       linejoin_type="round"
       miter_limit="4"
       end_linecap_type="butt" />
  </defs>
  <sodipodi:namedview
     id="base"
     pagecolor="#ffffff"
     bordercolor="#666666"
     borderopacity="1.0"
     inkscape:pageopacity="0.0"
     inkscape:pageshadow="2"
     inkscape:zoom="0.73539105"
     inkscape:cx="783.3073"
     inkscape:cy="695.03267"
     inkscape:document-units="mm"
     inkscape:current-layer="layer3"
     showgrid="false"
     units="px"
     borderlayer="true"
     fit-margin-top="0"
     fit-margin-left="0"
     fit-margin-right="0"
     fit-margin-bottom="0"
     inkscape:snap-global="false"
     inkscape:window-width="2416"
     inkscape:window-height="1411"
     inkscape:window-x="30"
     inkscape:window-y="0"
     inkscape:window-maximized="1"
     showguides="false"
     inkscape:document-rotation="0" />
  <metadata
     id="metadata4610">
    <rdf:RDF>
      <cc:Work
         rdf:about="">
        <dc:format>image/svg+xml</dc:format>
        <dc:type
           rdf:resource="http://purl.org/dc/dcmitype/StillImage" />
        <dc:title />
      </cc:Work>
    </rdf:RDF>
  </metadata>
  <g
     inkscape:label="ref"
     inkscape:groupmode="layer"
     id="layer1"
     transform="translate(242.66072,18.988094)"
     sodipodi:insensitive="true"
     style="display:none">
    <image
       sodipodi:absref="/home/melano/Pictures/Dragons/Glax/vector/20170514_220040.jpg"
       xlink:href="20170514_220040.jpg"
       y="-63.690079"
       x="-253.76343"
       id="image5220"
       preserveAspectRatio="none"
       height="508"
       width="903.11108"
       transform="rotate(2.6154833)"
       inkscape:transform-center-x="-436.85407"
       inkscape:transform-center-y="-60.820836" />
  </g>
  <g
     inkscape:groupmode="layer"
     id="layer11"
     inkscape:label="dragon">
    <g
       inkscape:groupmode="layer"
       id="layer7"
       inkscape:label="arm b">
      <path
         inkscape:transform-center-y="0.16098357"
         inkscape:transform-center-x="5.870312"
         sodipodi:nodetypes="cccsc"
         inkscape:connector-curvature="0"
         id="path4979"
         d="m 352.3416,339.43592 c 3.45128,-5.17583 12.75982,-6.31421 15.76518,-3.96943 3.00537,2.3448 1.67844,6.83346 -0.26207,8.3614 -1.94048,1.52795 -6.11302,0.19663 -7.5869,-1.06105 -1.47389,-1.25761 -4.294,-3.67686 -7.9162,-3.33096 z"
         style="display:inline;opacity:1;fill:#3a3c3f;fill-opacity:1;stroke:#292929;stroke-width:3.17499995;stroke-linecap:round;stroke-linejoin:round;stroke-miterlimit:4;stroke-dasharray:none;stroke-opacity:1" />
      <path
         style="display:inline;opacity:1;fill:#3250b0;fill-opacity:1;stroke:#1d2848;stroke-width:3.17499995;stroke-linecap:round;stroke-linejoin:round;stroke-miterlimit:4;stroke-dasharray:none;stroke-opacity:1"
         d="m 385.92753,345.41701 c -1.74793,0.58882 -13.16639,2.35475 -17.10014,-1.3536 -3.93374,-3.70836 -6.87007,-3.65881 -10.90775,-2.09732 -2.90693,1.09846 -4.69588,11.00256 -2.67251,12.21922 2.02337,1.21665 12.24333,3.94324 16.10332,1.31416"
         id="path4966"
         inkscape:connector-curvature="0" />
      <path
         style="display:inline;opacity:1;fill:#3a3c3f;fill-opacity:1;stroke:#292929;stroke-width:3.17499995;stroke-linecap:round;stroke-linejoin:round;stroke-miterlimit:4;stroke-dasharray:none;stroke-opacity:1"
         d="m 342.72055,349.26189 c 2.68525,-5.61159 11.73952,-8.05393 15.04606,-6.15736 3.30656,1.89659 2.62723,6.52771 0.9221,8.31453 -1.70509,1.78683 -6.02389,1.05848 -7.6607,0.0217 -1.63681,-1.03672 -4.77049,-3.03319 -8.30746,-2.17891 z"
         id="path4961"
         inkscape:connector-curvature="0"
         sodipodi:nodetypes="cccsc"
         inkscape:transform-center-x="5.770361"
         inkscape:transform-center-y="0.48125727" />
      <path
         id="path4974"
         style="opacity:1;fill:#3250b0;fill-opacity:1;stroke:#1d2848;stroke-width:3.17499995;stroke-linecap:round;stroke-linejoin:round;stroke-miterlimit:4;stroke-dasharray:none;stroke-opacity:1"
         d="m 363.45256,361.57856 c -3.30801,3.32912 -10.29671,0.31428 -9.67559,-0.43187 l 1.75753,-9.86588 c 2.04677,-1.49485 4.27157,-2.50807 8.37464,-2.48086 4.1031,0.0272 8.92418,-1.34505 10.20959,-1.91232 5.87794,-3.06995 20.13978,3.0779 21.60422,7.42514 1.46443,4.34724 -8.66216,4.15184 -14.68457,6.56024 -6.02243,2.40839 -12.44283,2.27981 -17.58582,0.70555 z"
         inkscape:connector-curvature="0"
         sodipodi:nodetypes="cccccscc" />
      <path
         style="display:inline;opacity:1;fill:#3a3c3f;fill-opacity:1;stroke:#292929;stroke-width:3.17499995;stroke-linecap:round;stroke-linejoin:round;stroke-miterlimit:4;stroke-dasharray:none;stroke-opacity:1"
         d="m 344.77803,361.20464 c 1.11408,-3.72303 4.74144,-10.6952 10.87794,-10.71625 6.13653,-0.0211 5.23434,6.20529 3.53518,8.0523 -1.69918,1.84704 -5.38152,1.71237 -7.35927,1.57186 -1.97777,-0.1405 -7.05385,1.09209 -7.05385,1.09209 z"
         id="path4959"
         inkscape:connector-curvature="0"
         sodipodi:nodetypes="csssc" />
      <path
         style="display:inline;opacity:1;fill:#3a3c3f;fill-opacity:1;stroke:#292929;stroke-width:3.17499995;stroke-linecap:round;stroke-linejoin:round;stroke-miterlimit:4;stroke-dasharray:none;stroke-opacity:1"
         d="m 375.28499,364.27869 c -2.12119,5.48581 -9.1529,3.7495 -13.48085,6.6745 -1.8183,-2.67727 1.25103,-13.68561 6.07269,-13.79196 4.01249,-0.0885 8.86536,3.34885 7.40816,7.11746 z"
         id="path4964"
         inkscape:connector-curvature="0"
         sodipodi:nodetypes="scss" />
    </g>
    <g
       inkscape:groupmode="layer"
       id="layer5"
       inkscape:label="body"
       style="display:inline;opacity:1">
      <path
         style="opacity:1;fill:#3250b0;fill-opacity:1;stroke:none;stroke-width:3.17499995;stroke-linecap:round;stroke-linejoin:round;stroke-miterlimit:4;stroke-dasharray:none;stroke-opacity:1"
         d="m 256.47847,152.17724 c 34.62491,10.08369 144.97585,78.38824 168.1269,101.03046 13.99238,0.50882 54.1887,9.66747 75.55888,9.66747 21.37021,0 24.0438,117.63963 -6.89779,120.87768 -44.25365,-6.11634 -107.57598,-21.22736 -121.24785,-51.80914 -13.67184,-30.58182 -61.88316,-63.32234 -80.23225,-73.03655 -18.34907,-9.71422 -41.73516,-15.4708 -54.32767,-20.5078 -26.62415,-21.22737 -36.07635,-71.16451 19.01978,-86.22212 z"
         id="path4950"
         inkscape:connector-curvature="0"
         sodipodi:nodetypes="ccsccscc" />
      <path
         style="opacity:1;fill:#292f75;fill-opacity:1;stroke:none;stroke-width:12;stroke-linecap:round;stroke-linejoin:round;stroke-miterlimit:4;stroke-dasharray:none;stroke-opacity:1"
         d="m 1042.0625,604.24023 c -3.0741,16.05731 -18.4978,28.32418 -7.7868,47.16078 70.2785,15.21955 195.5377,96.90908 292.148,181.18198 119.4676,104.21124 186.2094,191.70191 249.7024,199.44231 81.7307,16.3462 103.6825,-35.59609 78.6825,-69.24991 -0.017,-0.0309 -0.04,-0.0665 -0.057,-0.0977 -20.4702,-3.06385 -37.8256,-5.23122 -49.9434,-5.67187 -74.8753,-73.22965 -422.7887,-311.27234 -562.7461,-352.76563 z"
         transform="scale(0.26458333)"
         id="path4952"
         inkscape:connector-curvature="0"
         sodipodi:nodetypes="ccscccccc" />
      <path
         sodipodi:nodetypes="ccsccscc"
         inkscape:connector-curvature="0"
         id="path4957"
         d="m 248.33744,149.37876 c 46.58205,9.57488 153.11688,81.18672 176.26793,103.82894 13.99238,0.50882 54.1887,9.66747 75.55888,9.66747 21.37021,0 24.0438,117.63963 -6.89779,120.87768 -44.25365,-6.11634 -107.57598,-21.22736 -121.24785,-51.80914 -13.67184,-30.58182 -61.88316,-63.32234 -80.23225,-73.03655 -18.34907,-9.71422 -41.73516,-15.4708 -54.32767,-20.5078 -26.62415,-21.22737 -44.21738,-73.96299 10.87875,-89.0206 z"
         style="opacity:1;fill:none;fill-opacity:1;stroke:#1d2848;stroke-width:3.17499995;stroke-linecap:round;stroke-linejoin:round;stroke-miterlimit:4;stroke-dasharray:none;stroke-opacity:1" />
      <path
         id="path4947"
         style="opacity:1;fill:#c4d9f5;fill-opacity:1;stroke:#1d2848;stroke-width:3.17499995;stroke-linecap:round;stroke-linejoin:round;stroke-miterlimit:4;stroke-dasharray:none;stroke-opacity:1"
         d="m 415.55272,373.31907 c -27.16384,3.23806 -45.65986,-24.17124 -58.3833,-45.3157 -13.99238,-21.879 -58.16133,-52.9603 -76.81285,-60.54886 -15.93556,-6.48354 -32.3066,-13.58148 -48.96651,-15.58057 -1.59244,-7.6833 4.16398,-15.224 32.38109,-11.92627 45.12356,5.8183 89.46308,41.5931 111.22484,72.53688 0.6834,10.95228 10.18906,37.17429 32.06806,40.48158 14.42513,2.2737 19.64203,-3.75271 19.64203,-3.75271 l -3.23808,24.10566 z"
         inkscape:connector-curvature="0"
         sodipodi:nodetypes="ccsccccccc" />
    </g>
    <g
       inkscape:groupmode="layer"
       id="layer3"
       inkscape:label="head"
       style="display:inline;opacity:1">
      <path
         style="opacity:1;fill:#3a3c3f;fill-opacity:1;stroke:#292929;stroke-width:3.17499995;stroke-linecap:round;stroke-linejoin:round;stroke-miterlimit:4;stroke-dasharray:none;stroke-opacity:1"
         d="m 258.00559,138.54559 c 10.58471,-5.91866 52.63537,-27.79725 88.41106,-25.36315 -20.13506,7.44029 -69.2287,31.94552 -73.43308,38.46904"
         id="path5306"
         inkscape:connector-curvature="0"
         sodipodi:nodetypes="ccc"
         inkscape:transform-center-x="-60.600219"
         inkscape:transform-center-y="-18.780815" />
      <path
         style="opacity:1;fill:#3250b0;fill-opacity:1;stroke:#1d2848;stroke-width:3.17499995;stroke-linecap:round;stroke-linejoin:round;stroke-miterlimit:4;stroke-dasharray:none;stroke-opacity:1"
         d="m 237.2469,149.87384 c 3.72766,-3.77826 14.94266,-11.83343 21.0572,-12.66148 3.23954,0.60738 17.83216,10.23165 18.5655,13.16497 -2.07411,3.79513 -7.03958,10.26037 -7.03958,10.26037"
         id="path5304"
         inkscape:connector-curvature="0"
         sodipodi:nodetypes="cccc"
         inkscape:transform-center-x="-15.447347"
         inkscape:transform-center-y="-2.1786623" />
      <path
         sodipodi:nodetypes="csssscssscscc"
         inkscape:connector-curvature="0"
         id="path5294"
         d="m 228.07592,227.25819 c -1.65365,0.82682 -5.48808,1.27907 -9.15866,0.89042 -10.8123,-1.14483 -26.58563,-9.53871 -40.19631,-10.43068 -15.63491,-1.02463 -34.92918,9.60576 -46.7473,8.45903 -8.57248,-0.83179 -11.75729,-7.95287 -14.04695,-8.46169 -2.28966,-0.50881 -4.90074,1.49109 -7.13243,0.89308 -1.71725,-10.5579 5.19839,-28.1588 19.93479,-32.64579 9.40895,-2.86487 17.0957,2.02012 26.81547,-0.0636 16.4616,-3.52901 37.76183,-30.54538 64.15655,-35.50632 24.16665,-4.54216 44.09068,3.2783 49.81485,8.68445 10.13147,9.72474 3.3605,51.61875 -0.95693,60.43351 -4.31743,8.81475 -34.35956,10.61368 -42.48308,7.74758 z"
         style="opacity:1;fill:#3250b0;fill-opacity:1;stroke:none;stroke-width:3.17499995;stroke-linecap:round;stroke-linejoin:round;stroke-miterlimit:4;stroke-dasharray:none;stroke-opacity:1" />
      <path
         style="opacity:1;fill:#292f75;fill-opacity:1;stroke:none;stroke-width:3.17499995;stroke-linecap:round;stroke-linejoin:round;stroke-miterlimit:4;stroke-dasharray:none;stroke-opacity:1"
         d="m 239.65124,158.20193 c 3.00975,0.65784 4.58046,1.39001 6.66718,2.43874 2.74665,1.3804 12.81737,-5.98144 11.64807,-8.58989 -8.90471,-3.95765 -40.06944,-7.86148 -57.85811,7.79668 6.36396,4.8072 22.34526,-5.40445 39.54286,-1.64553 z"
         id="path5302"
         inkscape:connector-curvature="0"
         sodipodi:nodetypes="ssccs" />
      <path
         sodipodi:nodetypes="cssscssssc"
         inkscape:connector-curvature="0"
         id="path5300"
         d="m 112.0663,219.11716 c 2.28966,16.28205 17.31951,22.508 40.83233,24.42307 14.056,1.14484 19.15046,-3.01829 31.67368,-1.27203 11.34176,1.58151 29.27666,13.20977 49.10056,11.57553 18.55962,-1.53001 43.12198,-14.1196 41.84995,-31.67368 -1.09429,-6.92906 -4.75056,-10.1873 -9.64275,-11.07555 -11.51979,-2.09158 -27.88067,12.30416 -37.80415,16.16374 -13.90898,5.40968 -33.12049,-9.76405 -49.9819,-10.26614 -17.33486,-0.51619 -34.9193,11.20208 -44.61345,9.53433 -11.04215,-1.89965 -12.32308,-15.40546 -21.41427,-7.40927 z"
         style="opacity:1;fill:#c4d9f5;fill-opacity:1;stroke:none;stroke-width:3.17499995;stroke-linecap:round;stroke-linejoin:round;stroke-miterlimit:4;stroke-dasharray:none;stroke-opacity:1" />
      <path
         style="opacity:1;fill:none;fill-opacity:1;stroke:#1d2848;stroke-width:3.17499995;stroke-linecap:round;stroke-linejoin:round;stroke-miterlimit:4;stroke-dasharray:none;stroke-opacity:1"
         d="m 112.0663,219.11716 c 2.28966,16.28205 17.31951,22.508 40.83233,24.42307 14.056,1.14484 19.15046,-3.01829 31.67368,-1.27203 11.34176,1.58151 29.27666,13.20977 49.10056,11.57553 18.55962,-1.53001 43.12198,-14.1196 41.84995,-31.67368"
         id="path5298"
         inkscape:connector-curvature="0"
         sodipodi:nodetypes="csssc" />
      <path
         style="opacity:1;fill:#1d2848;fill-opacity:1;fill-rule:nonzero;stroke:none;stroke-width:3.17499995;stroke-linecap:round;stroke-linejoin:round;stroke-miterlimit:4;stroke-dasharray:none;stroke-opacity:1"
         d="m 228.07592,227.25819 c 0,0 -0.50133,-0.19614 -1.81558,-0.3216 -0.57259,-0.0547 -1.17356,-0.0911 -2.14903,-0.14794 -1.08924,-0.0634 -3.09772,-0.17168 -5.00397,-0.4352 -1.92029,-0.2242 -4.11526,-0.69405 -6.70387,-1.40788 -0.61968,-0.17088 -1.24916,-0.35284 -1.88736,-0.54396 -3.17886,-0.95196 -6.59767,-2.13901 -10.06204,-3.3042 -3.55209,-1.19469 -7.16274,-2.37033 -10.76674,-3.31163 -3.67068,-0.95871 -7.31776,-1.66955 -10.84626,-1.90079 -4.17005,-0.27328 -8.65695,0.27179 -13.08535,1.13557 -4.51458,0.8806 -9.17119,2.13627 -13.49743,3.30005 -4.50625,1.2122 -8.66654,2.32789 -12.46266,3.03014 -1.91506,0.35428 -3.6876,0.59312 -5.30727,0.68351 -1.64121,0.0916 -3.08724,0.0284 -4.33931,-0.20321 -1.94258,-0.35933 -3.38762,-0.94379 -4.49615,-1.58367 -1.13706,-0.65636 -1.98463,-1.40881 -2.67368,-2.13874 -0.35533,-0.3764 -0.67323,-0.75187 -0.97646,-1.12039 -0.29425,-0.3576 -0.61128,-0.75451 -0.9033,-1.09165 -0.30024,-0.34662 -0.64601,-0.71617 -1.04102,-1.02825 -0.20445,-0.16152 -0.43398,-0.31737 -0.69108,-0.45057 -0.26097,-0.1352 -0.54825,-0.24595 -0.86227,-0.31574 -0.88035,-0.19562 -1.73309,-0.14884 -2.45688,-0.0438 -0.73418,0.10651 -1.47605,0.2973 -2.06624,0.44528 -0.66055,0.16562 -1.17798,0.29034 -1.65985,0.35228 -0.23668,0.0304 -0.43879,0.0417 -0.61405,0.0366 -0.17683,-0.005 -0.31987,-0.0266 -0.43836,-0.0583 l 1.3376,1.47938 c -0.39511,-2.42923 -0.28532,-5.17015 0.27304,-7.98505 0.58004,-2.92422 1.63464,-5.88603 3.07283,-8.666 1.50007,-2.89957 3.40129,-5.57297 5.61012,-7.84893 2.31004,-2.38026 4.93285,-4.30341 7.78996,-5.64957 2.03281,-0.95778 4.10594,-1.41117 6.15185,-1.58512 2.15735,-0.18343 4.33359,-0.0589 6.42819,0.15473 2.08869,0.21298 4.33842,0.55171 6.42711,0.76469 2.17874,0.22463 4.24816,0.32285 6.1897,0.0614 3.76394,-0.50684 7.28374,-1.52268 10.59929,-2.8467 3.43646,-1.37231 6.70036,-3.09518 9.80781,-4.96535 6.3005,-3.79187 13.04246,-8.91517 18.79871,-12.98745 6.78159,-4.79766 13.18898,-8.90611 20.26274,-11.96006 7.82002,-3.37613 15.8727,-5.18102 24.69514,-5.11637 10.51765,0.0771 17.2843,2.02422 21.17897,3.46671 2.95644,1.09499 5.19588,2.26826 6.64255,3.08855 3.72884,2.11434 4.83116,3.08684 4.83116,3.08684 l 2.09782,-3.01588 c 0,0 -1.0982,-0.988 -5.11692,-3.26671 -1.56172,-0.88553 -3.98468,-2.15488 -7.17866,-3.33784 -4.2428,-1.57143 -11.43194,-3.61473 -22.428,-3.69531 -9.37184,-0.0687 -17.92786,1.85526 -26.17821,5.41718 -7.42521,3.20567 -14.07804,7.48753 -20.92831,12.33378 -5.92064,4.18858 -12.42574,9.14025 -18.57133,12.83888 -2.99231,1.80088 -6.07468,3.42289 -9.27591,4.70127 -3.08377,1.23146 -6.30982,2.15742 -9.7271,2.61758 -1.50881,0.20317 -3.23627,0.14021 -5.32268,-0.0749 -2.1913,-0.22593 -4.23991,-0.53918 -6.43121,-0.76511 -2.1888,-0.22319 -4.62423,-0.37201 -7.11209,-0.16048 -2.378,0.20219 -4.89509,0.73907 -7.40643,1.92232 -3.29434,1.55216 -6.27258,3.7478 -8.86047,6.41436 -2.47275,2.5479 -4.58072,5.51839 -6.23675,8.71942 -1.58665,3.06694 -2.76195,6.355 -3.41342,9.63927 -0.62496,3.15069 -0.77501,6.34207 -0.29558,9.28962 0.0554,0.3404 0.11942,0.67932 0.19212,1.01644 0.36151,0.20048 0.74619,0.35595 1.14548,0.46294 0.43481,0.11652 0.8662,0.17002 1.2837,0.18202 0.40887,0.0118 0.80765,-0.0162 1.18801,-0.0651 0.72981,-0.0938 1.45191,-0.27389 2.08488,-0.4326 0.64214,-0.161 1.18844,-0.2988 1.70023,-0.37304 0.49152,-0.0713 0.85386,-0.0675 1.13248,-0.006 -0.0264,-0.006 -0.0417,-0.0143 -0.0307,-0.009 0.0116,0.006 0.0454,0.0253 0.10361,0.0713 0.12531,0.099 0.29405,0.2651 0.54158,0.55088 0.252,0.29092 0.49632,0.59887 0.84335,1.02062 0.32356,0.39323 0.70242,0.84251 1.14184,1.308 0.86648,0.91788 1.98782,1.92078 3.50855,2.7986 1.48465,0.85699 3.32704,1.58204 5.66452,2.01442 1.61868,0.29941 3.37166,0.3615 5.2122,0.25878 1.82125,-0.10164 3.75582,-0.36632 5.77088,-0.73909 3.96803,-0.73406 8.27691,-1.89203 12.74867,-3.09496 4.35199,-1.1707 8.88113,-2.3904 13.24647,-3.24189 4.29087,-0.83696 8.42494,-1.31906 12.14174,-1.07548 3.21684,0.21081 6.62003,0.86532 10.15817,1.78941 3.47357,0.90723 6.98303,2.04826 10.52397,3.2392 3.41185,1.14753 6.92295,2.3663 10.17926,3.34146 0.66008,0.19767 1.31556,0.38719 1.96467,0.56619 2.69847,0.74412 5.11082,1.24554 7.30033,1.45664 2.36064,0.18468 4.34703,-0.0827 5.66738,-0.41402 1.01443,-0.25453 1.75241,-0.5697 2.27193,-0.86477 1.3604,-0.77265 1.40942,-1.40679 1.40942,-1.40679 z"
         id="path5292"
         inkscape:connector-curvature="0"
         sodipodi:nodetypes="csssscsssc"
         inkscape:path-effect="#path-effect5296"
         inkscape:original-d="m 228.07592,227.25819 c -1.65365,0.82682 -5.48808,1.27907 -9.15866,0.89042 -10.8123,-1.14483 -26.58563,-9.53871 -40.19631,-10.43068 -15.63491,-1.02463 -37.35774,10.05549 -48.90601,7.91935 -8.46907,-1.56657 -9.41868,-7.23329 -11.70834,-7.74211 -2.28966,-0.50881 -5.08064,1.31119 -7.31233,0.71318 -1.71725,-10.5579 5.19839,-26.17998 17.77608,-32.10611 8.89731,-4.19208 18.65592,0.19013 25.73463,-0.76306 28.25595,-3.80484 45.97684,-38.17403 84.42228,-37.89231 18.80754,0.13782 28.10571,6.08787 33.68813,9.97098" />
      <path
         style="opacity:1;fill:#3a3c3f;fill-opacity:1;stroke:#292929;stroke-width:3.17499995;stroke-linecap:round;stroke-linejoin:round;stroke-miterlimit:4;stroke-dasharray:none;stroke-opacity:1"
         d="m 262.35262,144.08064 c 13.396,-6.96659 68.58375,-30.43926 108.90807,-26.50832 -29.81238,6.80842 -78.28356,37.30151 -87.14746,48.65354"
         id="path5286"
         inkscape:connector-curvature="0"
         sodipodi:nodetypes="ccc" />
      <path
         style="opacity:1;fill:#ffffff;fill-opacity:1;stroke:none;stroke-width:3.17499995;stroke-linecap:round;stroke-linejoin:round;stroke-miterlimit:4;stroke-dasharray:none;stroke-opacity:1"
         d="m 202.88962,185.34463 c -1.30742,3.43582 0.85185,11.65136 2.79848,14.11959 4.58945,2.65531 13.90799,0.98522 21.8354,-1.13892 1.34732,-0.36101 1.95923,-0.98681 2.12072,-2.04358 0.59415,-3.88801 -0.37145,-9.17799 -1.07305,-10.754 -15.9933,-5.11007 -20.74984,-2.44544 -25.68155,-0.18309 z"
         id="path4568"
         inkscape:connector-curvature="0"
         sodipodi:nodetypes="ccssc" />
      <path
         sodipodi:nodetypes="ccscc"
         inkscape:connector-curvature="0"
         id="path5274"
         d="m 205.05208,184.83582 c -2.0253,3.72297 1.40816,13.43865 4.32492,15.51883 4.58945,2.65531 12.66909,-0.69822 13.14382,-1.65606 1.61178,-3.252 -1.77069,-13.24851 -3.87152,-14.95172 -15.9933,-5.11007 -8.66551,-1.1734 -13.59722,1.08895 z"
         style="opacity:1;fill:#f01d0a;fill-opacity:1;stroke:none;stroke-width:3.17499995;stroke-linecap:round;stroke-linejoin:round;stroke-miterlimit:4;stroke-dasharray:none;stroke-opacity:1" />
      <path
         style="opacity:1;fill:#000000;fill-opacity:1;stroke:none;stroke-width:2.11666656;stroke-linecap:round;stroke-linejoin:round;stroke-miterlimit:4;stroke-dasharray:none;stroke-opacity:1"
         d="m 207.40534,183.24577 c -0.76322,4.57932 2.96294,15.32615 6.20663,16.8526 1.78085,0.50881 3.9324,-0.38161 4.69562,-0.95403 0.75682,-3.59443 -2.44321,-14.05412 -6.45012,-16.28018 -2.67128,-0.25441 -4.45213,0.38161 -4.45213,0.38161 z"
         id="path5270"
         inkscape:connector-curvature="0"
         sodipodi:nodetypes="ccccc" />
      <path
         style="opacity:1;fill:#1d2848;fill-opacity:1;fill-rule:nonzero;stroke:none;stroke-width:2.11666656;stroke-linecap:round;stroke-linejoin:round;stroke-miterlimit:4;stroke-dasharray:none;stroke-opacity:1"
         d="m 202.33459,176.65292 c 0,0 0.40915,-0.41422 0.91145,-1.0305 0.21888,-0.26855 0.40152,-0.51304 0.699,-0.92286 0.2553,-0.35173 0.68296,-0.95212 1.15789,-1.49891 0.12342,-0.14209 0.28363,-0.3147 0.48242,-0.49858 0.55059,-0.50931 1.41958,-1.12819 2.69345,-1.44264 1.12917,-0.27872 2.51788,-0.3015 4.18401,0.13343 1.86354,0.48285 3.0822,0.74798 3.86516,0.91604 1.08209,0.23227 1.94963,0.34528 2.67249,0.38655 1.88847,0.10781 2.9885,-0.27414 3.58997,-0.57601 0.62917,-0.31577 0.85579,-0.60701 0.85579,-0.60701 0,0 -0.26746,-0.24842 -0.86871,-0.55112 -0.62607,-0.3152 -1.48793,-0.64866 -3.17471,-1.05782 -0.65584,-0.15909 -1.40359,-0.32425 -2.44111,-0.54695 -0.72041,-0.15464 -1.91114,-0.43996 -3.69835,-0.93914 -2.09322,-0.57656 -4.00746,-0.62144 -5.70678,-0.23681 -1.9225,0.43515 -3.28236,1.35345 -4.14647,2.13191 -0.31083,0.28004 -0.56057,0.54447 -0.75189,0.76474 -0.79376,0.91387 -1.1864,1.84624 -1.34661,2.58406 -0.15568,0.71698 -0.10927,1.30551 0.008,1.73561 0.32201,1.17886 1.01479,1.25601 1.01479,1.25601 z"
         id="path5262"
         inkscape:connector-curvature="0"
         sodipodi:nodetypes="csc"
         inkscape:path-effect="#path-effect5264"
         inkscape:original-d="m 202.33459,176.65292 c -0.66999,-2.67998 2.92884,-8.79244 10.52849,-6.74779 5.35158,1.43981 8.02351,1.74266 10.58314,1.6073" />
      <path
         style="opacity:1;fill:#1d2848;fill-opacity:1;fill-rule:nonzero;stroke:none;stroke-width:2.11666656;stroke-linecap:round;stroke-linejoin:round;stroke-miterlimit:4;stroke-dasharray:none;stroke-opacity:1"
         d="m 194.68499,183.56378 c 0,0 -0.47625,0.60182 0.30328,1.90093 0.28553,0.47585 0.76145,1.01852 1.48999,1.50566 0.53029,0.35459 1.21057,0.68792 2.00567,0.89598 0.64046,0.1676 1.40822,0.26593 2.20203,0.17115 0.17269,-0.0211 0.34293,-0.0495 0.511,-0.085 0.35278,-0.0746 0.72402,-0.18466 1.11697,-0.3461 0.45174,-0.18558 0.87553,-0.41519 1.31497,-0.68922 0.7136,-0.44498 1.3835,-0.95835 2.21572,-1.43323 0.72566,-0.41406 1.63933,-0.83376 2.92526,-1.1241 1.27188,-0.28718 2.93252,-0.45401 5.17827,-0.3575 4.26646,0.18137 7.62016,0.80115 10.31168,1.53516 3.0263,0.82531 5.46132,1.87172 7.23799,2.6788 1.63484,0.74264 2.92341,1.36861 3.93978,1.81856 0.6981,0.30906 1.33797,0.54631 1.94388,0.72434 1.18778,0.349 2.18528,0.45098 3.0198,0.41657 2.26253,-0.0933 3.00266,-0.99741 3.00266,-0.99741 0,0 -0.89924,-0.57301 -2.54513,-1.39744 -0.58697,-0.29401 -1.38994,-0.68866 -2.32033,-1.12508 -0.48027,-0.22529 -1.06755,-0.49598 -1.70348,-0.7775 -0.95074,-0.42089 -2.2146,-1.03365 -3.91299,-1.80258 -1.84256,-0.8342 -4.47208,-1.96328 -7.76013,-2.85516 -2.93077,-0.79498 -6.53884,-1.45167 -11.07017,-1.63946 -2.48645,-0.10206 -4.45712,0.0818 -6.0788,0.45333 -1.66757,0.38202 -2.89402,0.94692 -3.85898,1.503 -1.07216,0.61787 -1.78421,1.17209 -2.32146,1.51019 -0.328,0.20641 -0.57891,0.33806 -0.80651,0.43234 -0.1955,0.081 -0.36924,0.13193 -0.52841,0.16559 -0.0771,0.0163 -0.1562,0.0302 -0.23801,0.0414 -0.34563,0.0506 -0.74883,0.0551 -1.17947,0.0227 -0.5128,-0.0386 -1.01435,-0.12518 -1.44885,-0.21824 -0.56535,-0.12107 -1.0888,-0.2696 -1.44039,-0.37645 -0.95745,-0.29099 -1.50584,-0.55126 -1.50584,-0.55126 z"
         id="path5266"
         inkscape:connector-curvature="0"
         inkscape:path-effect="#path-effect5268"
         inkscape:original-d="m 194.68499,183.56378 c 0.69962,1.78084 3.69046,3.06541 5.78776,2.79848 3.4981,-0.44522 4.05691,-4.46874 13.54718,-4.07052 17.02375,0.71433 21.6882,8.26823 29.38401,7.88662"
         sodipodi:nodetypes="cssc" />
      <path
         style="opacity:1;fill:none;fill-opacity:1;stroke:#1d2848;stroke-width:3.17499995;stroke-linecap:round;stroke-linejoin:round;stroke-miterlimit:4;stroke-dasharray:none;stroke-opacity:1"
         d="m 202.88962,185.34463 c -1.30742,3.43582 0.85185,11.65136 2.79848,14.11959 4.58945,2.65531 13.90799,0.98522 21.8354,-1.13892 1.34732,-0.36101 1.95923,-0.98681 2.12072,-2.04358 0.59415,-3.88801 -0.37145,-9.17799 -1.07305,-10.754"
         id="path5272"
         inkscape:connector-curvature="0"
         sodipodi:nodetypes="ccssc" />
      <path
         style="opacity:1;fill:#1d2848;fill-opacity:1;stroke:none;stroke-width:3.17499995;stroke-linecap:round;stroke-linejoin:round;stroke-miterlimit:4;stroke-dasharray:none;stroke-opacity:1"
         d="m 265.97561,193.77429 c 2.98031,2.93825 4.71915,10.4523 4.19375,12.30414 -0.52544,1.85185 -2.24498,2.63092 -4.30027,0.40511 -2.0553,-2.22582 -5.40244,-10.61558 -4.50847,-12.34975 0.89396,-1.73417 3.5285,-1.28814 4.61499,-0.3595 z"
         id="path5278"
         inkscape:connector-curvature="0" />
      <path
         style="opacity:1;fill:#1d2848;fill-opacity:1;stroke:none;stroke-width:3.17499995;stroke-linecap:round;stroke-linejoin:round;stroke-miterlimit:4;stroke-dasharray:none;stroke-opacity:1"
         d="m 146.84875,199.06079 c -2.0173,-1.4559 -6.14208,-0.43202 -8.71344,1.27204 -2.26462,1.50078 -6.10938,2.31572 -6.55098,5.02453 -0.52619,3.22768 1.96947,5.23824 5.15173,5.08815 2.67615,-0.12622 4.03171,-3.02727 5.34256,-4.86648 1.45512,-2.04164 3.60667,-2.21515 5.0059,-3.42358 0.67562,-0.58349 0.42422,-2.61834 -0.23577,-3.09466 z"
         id="path5280"
         inkscape:connector-curvature="0"
         sodipodi:nodetypes="sssssss" />
      <path
         sodipodi:nodetypes="cccc"
         inkscape:connector-curvature="0"
         id="path5288"
         d="m 236.33247,159.38194 c 3.22604,-4.19733 20.06976,-16.11609 25.55567,-16.4023 9.93744,2.95017 21.1262,12.69859 24.362,20.78693 -1.78674,4.31499 -6.88518,10.72776 -10.59366,13.19133"
         style="opacity:1;fill:#3250b0;fill-opacity:1;fill-rule:nonzero;stroke:none;stroke-width:0.84005207;stroke-linecap:round;stroke-linejoin:round;stroke-miterlimit:4;stroke-dasharray:none;stroke-opacity:1" />
      <path
         style="opacity:1;fill:#1d2848;fill-opacity:1;fill-rule:nonzero;stroke:none;stroke-width:3.17499995;stroke-linecap:round;stroke-linejoin:round;stroke-miterlimit:4;stroke-dasharray:none;stroke-opacity:1"
         d="m 236.33247,159.38194 c 0,0 0.46728,0.0285 1.358,-0.30333 0.35297,-0.13149 0.78736,-0.32568 1.34356,-0.62829 0.75892,-0.4129 1.71299,-1.00919 3.03965,-1.92814 0.90153,-0.62447 1.93466,-1.36951 3.17251,-2.28266 1.11731,-0.82424 2.51418,-1.82381 4.10592,-2.89468 2.25881,-1.51967 4.99839,-3.24007 7.55284,-4.56302 1.11391,-0.57689 2.16683,-1.06421 3.08974,-1.41103 0.44022,-0.16543 0.83608,-0.29327 1.18348,-0.38334 0.20845,-0.054 0.38839,-0.0916 0.54178,-0.11626 2.15482,0.65612 4.45861,1.67411 6.8061,3.01819 2.39,1.36842 4.74815,3.03132 6.92574,4.87305 2.18403,1.84717 4.12846,3.82513 5.71377,5.79539 1.47607,1.8345 2.59183,3.60042 3.33426,5.21845 -0.38831,0.8659 -0.89459,1.79029 -1.45143,2.69543 -0.8308,1.35045 -1.74871,2.61713 -2.55693,3.63829 -0.39938,0.50459 -0.77349,0.95187 -1.10872,1.33685 -0.69555,0.79876 -1.25158,1.46166 -1.71466,2.04884 -1.81461,2.30088 -2.0116,3.46222 -2.0116,3.46222 0,0 1.30232,0.53525 3.92543,-1.52511 0.63293,-0.49715 1.33655,-1.15309 2.07724,-2.0037 0.3603,-0.41376 0.76415,-0.89055 1.19731,-1.42604 0.87404,-1.08053 1.87806,-2.41425 2.82036,-3.87143 0.77395,-1.19682 1.52105,-2.50116 2.06023,-3.74935 a 1.6557164,1.5268819 47.66267 0 0 0.007,-1.21347 c -0.83832,-2.14669 -2.19185,-4.41662 -3.95806,-6.6842 -1.69874,-2.18096 -3.76673,-4.34437 -6.07357,-6.35445 -2.3006,-2.00463 -4.8078,-3.82969 -7.37471,-5.34997 -2.65815,-1.57433 -5.34074,-2.79898 -7.92011,-3.58499 a 1.5162013,2.048188 60.262915 0 0 -0.62674,-0.0744 c -0.49613,0.0209 -1.0055,0.10455 -1.50427,0.22161 -0.51434,0.12072 -1.04812,0.2843 -1.58697,0.47575 -1.12305,0.39901 -2.3326,0.94218 -3.53615,1.54607 -2.75922,1.38445 -5.65696,3.17153 -7.99017,4.71923 -1.65685,1.09905 -3.10749,2.12829 -4.26746,2.98399 -1.27441,0.94013 -2.31684,1.81163 -3.14967,2.58759 -1.23016,1.14614 -2.0204,2.09857 -2.52694,2.8623 -0.3764,0.56753 -0.60232,1.0398 -0.73833,1.42247 -0.35109,0.98784 -0.15873,1.44219 -0.15873,1.44219 z"
         id="path5282"
         inkscape:connector-curvature="0"
         inkscape:path-effect="#path-effect5284"
         inkscape:original-d="m 236.33247,159.38194 c 3.22604,-4.19733 20.06976,-16.11609 25.55567,-16.4023 9.93744,2.95017 21.1262,12.69859 24.362,20.78693 -1.78674,4.31499 -6.88518,10.72776 -10.59366,13.19133"
         sodipodi:nodetypes="cccc" />
      <ellipse
         style="opacity:1;fill:#ffffff;fill-opacity:1;stroke:none;stroke-width:2.64583325;stroke-linecap:round;stroke-linejoin:round;stroke-miterlimit:4;stroke-dasharray:none;stroke-opacity:1"
         id="path4566"
         cx="130.61725"
         cy="253.3763"
         rx="2.0237956"
         ry="2.5634744"
         transform="rotate(-21.362651)" />
    </g>
    <g
       inkscape:groupmode="layer"
       id="layer4"
       inkscape:label="arm f"
       style="display:inline;opacity:1">
      <path
         inkscape:connector-curvature="0"
         id="path4572"
         d="m 393.42589,339.4992 c 2.51849,5.39679 11.87294,12.41261 23.38607,15.11102 11.51316,2.69838 29.14266,2.69838 35.97859,5.75656 l 4.85711,-23.02629 -26.98394,-9.71422"
         style="opacity:1;fill:#3250b0;fill-opacity:1;fill-rule:nonzero;stroke:none;stroke-width:0.90412587;stroke-linecap:round;stroke-linejoin:round;stroke-miterlimit:4;stroke-dasharray:none;stroke-opacity:1" />
      <path
         style="opacity:1;fill:#3250b0;fill-opacity:1;stroke:#1d2848;stroke-width:3.17499995;stroke-linecap:round;stroke-linejoin:round;stroke-miterlimit:4;stroke-dasharray:none;stroke-opacity:1"
         d="m 323.76806,361.95098 c 1.38193,-2.45332 0.98625,-3.30641 6.22445,-3.99382 6.87233,-0.90186 12.23178,4.75455 17.7527,4.33743 2.27208,0.31034 -3.97354,15.45538 -6.41632,13.4153 -3.73631,-3.12037 -14.32311,-3.88185 -16.69169,-7.70912 -1.18424,-1.91367 -0.86914,-6.04979 -0.86914,-6.04979 z"
         id="path4919"
         inkscape:connector-curvature="0"
         sodipodi:nodetypes="cscscc" />
      <path
         style="opacity:1;fill:#3a3c3f;fill-opacity:1;stroke:#292929;stroke-width:3.17499995;stroke-linecap:round;stroke-linejoin:round;stroke-miterlimit:4;stroke-dasharray:none;stroke-opacity:1"
         d="m 313.28352,364.75912 c 3.30836,-5.24717 13.24152,-8.61776 16.75771,-6.07081 1.48152,3.35791 -0.62588,6.96931 -2.35696,7.99327 -1.7311,1.02396 -12.30733,-0.88007 -14.40075,-1.92246 z"
         id="path4917"
         inkscape:connector-curvature="0"
         sodipodi:nodetypes="cccc" />
      <path
         style="opacity:1;fill:#3250b0;fill-opacity:1;stroke:#1d2848;stroke-width:3.17499995;stroke-linecap:round;stroke-linejoin:round;stroke-miterlimit:4;stroke-dasharray:none;stroke-opacity:1"
         d="m 338.10698,366.16445 c -7.878,0.81311 -39.34755,-10.76202 -39.32132,1.99269 0.0183,8.89018 3.56168,9.03145 4.70651,9.03145 6.64327,0.44792 12.30991,0.0881 14.64851,-2.25048 6.47615,4.13754 10.88352,5.2169 17.53956,4.13754"
         id="path4904"
         inkscape:connector-curvature="0"
         sodipodi:nodetypes="csccc" />
      <path
         style="display:inline;opacity:1;fill:#3a3c3f;fill-opacity:1;stroke:#292929;stroke-width:3.17499995;stroke-linecap:round;stroke-linejoin:round;stroke-miterlimit:4;stroke-dasharray:none;stroke-opacity:1"
         d="m 284.97754,375.6094 c 1.55856,-5.86093 9.04712,-13.7341 15.97325,-13.37367 9.62693,0.50097 5.13447,14.89511 -3.13623,12.3682 -2.72909,-0.83379 -9.27414,-0.16232 -12.83702,1.00547 z"
         id="path4902-7"
         inkscape:connector-curvature="0"
         sodipodi:nodetypes="cssc" />
      <path
         id="path4908"
         style="opacity:1;fill:#3250b0;fill-opacity:1;stroke:none;stroke-width:3.17499995;stroke-linecap:round;stroke-linejoin:round;stroke-miterlimit:4;stroke-dasharray:none;stroke-opacity:1"
         d="m 468.36337,328.51219 c 23.15105,3.05287 61.74468,34.83285 62.07533,56.98718 0.2544,17.04527 -33.07291,26.96715 -46.30208,26.20393 -13.22917,-0.76322 -45.53887,-13.73797 -65.89144,-17.29967 -18.25245,-3.19418 -56.98716,-7.63224 -65.63701,-3.05289 -25.1015,7.2506 -43.96725,-9.78104 -24.55028,-24.04146 4.69798,-0.0518 12.04014,-4.34074 17.5759,-5.259 6.44696,-1.0694 69.88699,-1.17195 95.50803,8.94788 15.77324,-1.78085 44.52123,-4.83372 62.58415,12.21156"
         inkscape:connector-curvature="0"
         sodipodi:nodetypes="csssccccc" />
      <path
         style="opacity:1;fill:none;fill-opacity:1;stroke:#1d2848;stroke-width:3.17499995;stroke-linecap:round;stroke-linejoin:round;stroke-miterlimit:4;stroke-dasharray:none;stroke-opacity:1"
         d="m 468.36337,328.51219 c 23.15105,3.05287 61.74468,34.83285 62.07533,56.98718 0.2544,17.04527 -33.07291,26.96715 -46.30208,26.20393 -13.22917,-0.76322 -45.53887,-13.73797 -65.89144,-17.29967 -18.25245,-3.19418 -56.98716,-7.63224 -65.63701,-3.05289"
         id="path4890"
         inkscape:connector-curvature="0"
         sodipodi:nodetypes="csssc" />
      <path
         sodipodi:nodetypes="csscc"
         inkscape:connector-curvature="0"
         id="path4911"
         d="m 332.1284,372.52461 c -4.19771,0.12721 -13.34268,-0.88975 -16.48906,-0.59235 -6.15748,0.58202 -29.60578,1.01703 -28.43715,12.18969 1.13873,10.88676 30.61582,4.68472 32.65107,3.15827 6.48738,2.22607 13.35637,0.31801 17.55409,-1.71724"
         style="opacity:1;fill:#3250b0;fill-opacity:1;fill-rule:nonzero;stroke:none;stroke-width:0.84005207;stroke-linecap:round;stroke-linejoin:round;stroke-miterlimit:4;stroke-dasharray:none;stroke-opacity:1" />
      <path
         style="opacity:1;fill:#1d2848;fill-opacity:1;fill-rule:nonzero;stroke:none;stroke-width:3.17499995;stroke-linecap:round;stroke-linejoin:round;stroke-miterlimit:4;stroke-dasharray:none;stroke-opacity:1"
         d="m 339.15497,375.64709 c 0,0 -0.50463,-0.58786 -2.54323,-1.46752 -0.79284,-0.34211 -1.83326,-0.72716 -3.19395,-1.125 -1.84382,-0.53911 -4.24107,-1.08961 -7.16237,-1.55192 -2.11559,-0.3348 -4.45452,-0.61244 -6.61985,-0.75373 -0.25262,-0.0165 -0.50192,-0.031 -0.74666,-0.0434 -0.51242,-0.026 -1.16348,-0.0501 -1.81023,-0.0549 -0.34362,-0.003 -0.68776,3e-4 -1.00971,0.0114 -0.24805,0.009 -0.49133,0.0223 -0.71646,0.0436 -0.31491,-0.0155 -0.69362,-0.0289 -1.12888,-0.0379 -0.49635,-0.0103 -1.06948,-0.015 -1.70502,-0.0107 -1.28667,0.009 -2.78625,0.0544 -4.39907,0.15905 -4.51254,0.29278 -8.01711,0.91605 -10.64123,1.59891 -1.40522,0.36567 -3.26457,0.93555 -5.05747,1.80318 -1.40736,0.68105 -2.8971,1.60374 -4.10382,2.86126 -0.55047,0.57365 -1.05034,1.22555 -1.45509,1.96498 -0.38774,0.70835 -0.68425,1.49004 -0.85518,2.34772 -0.16516,0.82879 -0.20977,1.71206 -0.11717,2.64936 0.0901,0.91245 0.30942,1.86764 0.66649,2.86765 0.26256,0.73531 0.62226,1.40144 1.07613,1.99316 0.44873,0.58504 0.97703,1.08108 1.56721,1.49446 1.17211,0.82099 2.55428,1.29336 3.99507,1.53427 1.46173,0.24441 3.02532,0.25772 4.5766,0.13179 1.62022,-0.13153 3.2595,-0.41769 4.80795,-0.77474 3.57887,-0.82523 6.794,-2.05131 8.82962,-2.93845 1.14537,-0.49916 2.03292,-0.93928 2.67192,-1.27945 0.19395,-0.10325 0.37875,-0.20459 0.55397,-0.30368 0.44587,-0.25214 0.83845,-0.49464 1.16765,-0.72292 0.16941,-0.11747 0.32857,-0.23569 0.47351,-0.35403 0.14541,-0.11872 0.29078,-0.24915 0.42251,-0.39027 l -1.91398,0.31405 c 0.74661,0.4026 1.6452,0.73266 2.55929,1.00422 1.00617,0.29892 2.10873,0.54966 3.21043,0.75691 2.57662,0.48471 5.30124,0.76309 7.57959,0.90046 3.14046,0.18934 5.64505,0.13561 7.46223,-0.003 1.33563,-0.10194 2.3359,-0.25278 3.08113,-0.40606 1.87329,-0.38528 2.44911,-0.81062 2.44911,-0.81062 l -1.49722,-2.7998 c 0,0 -0.11453,0.19674 -1.59152,0.50052 -0.59808,0.12301 -1.46415,0.25713 -2.68312,0.35017 -1.63462,0.12476 -4.02348,0.18087 -7.02953,-3.7e-4 -2.21233,-0.13339 -4.77365,-0.39811 -7.18369,-0.85149 -1.02988,-0.19374 -2.02086,-0.42101 -2.89323,-0.68017 -0.81162,-0.24112 -1.47968,-0.49814 -1.95651,-0.75527 a 1.5875035,1.5874999 35.681638 0 0 -1.91398,0.31405 c -0.003,0.003 -0.0424,0.0426 -0.10954,0.0974 -0.0673,0.055 -0.15771,0.12318 -0.27469,0.2043 -0.22878,0.15864 -0.53468,0.34967 -0.92134,0.56832 -0.15011,0.0849 -0.31118,0.17326 -0.48305,0.26476 -0.56554,0.30107 -1.37862,0.70524 -2.4484,1.17145 -1.9706,0.85881 -4.9355,1.98532 -8.27455,2.75525 -1.439,0.33181 -2.92167,0.58789 -4.35146,0.70396 -1.37634,0.11173 -2.66497,0.0904 -3.79608,-0.0987 -1.11639,-0.18667 -2.01584,-0.52603 -2.69718,-1.00327 -0.33925,-0.23763 -0.62827,-0.51183 -0.86945,-0.82627 -0.24377,-0.31781 -0.4486,-0.68966 -0.6053,-1.12851 -0.28023,-0.78478 -0.43513,-1.48621 -0.49697,-2.11212 -0.0633,-0.64027 -0.0299,-1.20872 0.0713,-1.71668 0.10471,-0.52539 0.28553,-1.00359 0.52647,-1.44376 0.25332,-0.46278 0.57727,-0.89137 0.9609,-1.29116 0.85493,-0.89093 1.98562,-1.6159 3.19598,-2.20163 1.53042,-0.74061 3.168,-1.2486 4.47401,-1.58845 2.38092,-0.61957 5.73177,-1.19231 10.03496,-1.42444 1.54446,-0.0833 2.98011,-0.10918 4.20473,-0.0996 0.60508,0.005 1.14508,0.0181 1.60747,0.0361 0.47613,0.0186 0.86442,0.0421 1.157,0.066 a 0.06210804,0.6141752 83.507314 0 0 0.26772,-0.003 c 0.15045,-0.009 0.34568,-0.0155 0.5929,-0.017 0.26754,-0.002 0.56607,0.002 0.88092,0.0104 0.59417,0.0153 1.19824,0.044 1.69191,0.069 0.23308,0.0118 0.47145,0.0245 0.71403,0.0379 2.07946,0.11491 4.37755,0.27892 6.45769,0.44224 2.7975,0.21964 5.34107,0.4489 7.11879,0.60866 1.41318,0.12699 2.39708,0.2151 3.27341,0.28601 2.12959,0.17233 2.87556,0.14746 2.87556,0.14746 z"
         id="path4894"
         inkscape:connector-curvature="0"
         sodipodi:nodetypes="ccscc"
         inkscape:path-effect="#path-effect4896"
         inkscape:original-d="m 339.15497,375.64709 c -6.32608,-2.28377 -20.64365,-3.54587 -23.76006,-3.25736 -5.20678,-0.35063 -32.39013,-0.14693 -27.34379,13.98559 3.37749,9.45881 25.25022,0.23661 27.48659,-2.15926 4.71718,2.5437 20.84658,3.57458 24.83969,1.43922"
         inkscape:transform-center-x="20.201693"
         inkscape:transform-center-y="8.2798973" />
      <path
         sodipodi:nodetypes="ccscc"
         inkscape:connector-curvature="0"
         id="path4898"
         d="m 339.0982,380.60473 c -4.85709,-0.35978 -14.67943,4.02493 -17.8094,4.58728 -3.83921,0.68979 -18.72585,0.45657 -20.86758,13.40202 -1.54009,9.30891 17.02294,5.85608 25.10413,-0.25969 4.31741,0.80952 33.72087,-4.50748 28.05423,-11.43334"
         style="opacity:1;fill:#3250b0;fill-opacity:1;fill-rule:nonzero;stroke:none;stroke-width:0.84005207;stroke-linecap:round;stroke-linejoin:round;stroke-miterlimit:4;stroke-dasharray:none;stroke-opacity:1" />
      <path
         style="display:inline;opacity:1;fill:#3a3c3f;fill-opacity:1;stroke:#292929;stroke-width:3.17499995;stroke-linecap:round;stroke-linejoin:round;stroke-miterlimit:4;stroke-dasharray:none;stroke-opacity:1"
         d="m 276.15452,393.67025 c -1.11004,-7.66736 7.9616,-20.5499 15.65923,-20.63385 7.6976,-0.084 7.13573,10.053 4.69132,12.55815 -2.44439,2.50515 -4.42033,4.59298 -7.87648,3.43982 -3.04754,-1.01682 -9.94229,2.35828 -12.47407,4.63588 z"
         id="path4902-3"
         inkscape:connector-curvature="0"
         sodipodi:nodetypes="csssc" />
      <path
         style="opacity:1;fill:#1d2848;fill-opacity:1;fill-rule:nonzero;stroke:none;stroke-width:3.17499995;stroke-linecap:round;stroke-linejoin:round;stroke-miterlimit:4;stroke-dasharray:none;stroke-opacity:1"
         d="m 339.72783,380.155 c 0,0 -0.41252,-0.57381 -2.18149,-0.86052 -0.67559,-0.1095 -1.56418,-0.17018 -2.71058,-0.10978 -1.52278,0.0802 -3.55901,0.38239 -5.9233,1.05652 -0.0408,0.0116 -0.0817,0.0234 -0.12269,0.0352 -1.38548,0.40082 -3.39566,1.04232 -5.2397,1.84352 -0.73019,0.31725 -1.45259,0.66795 -2.07998,1.03927 -0.29605,0.17522 -0.58301,0.36213 -0.84524,0.55975 -0.022,0.0166 -0.044,0.0333 -0.0659,0.0503 -0.95447,-0.0683 -2.02245,-0.041 -3.15744,0.0657 -1.43205,0.13472 -2.9987,0.3989 -4.60936,0.77572 -3.2683,0.76463 -6.66356,1.97885 -9.49076,3.49549 -1.48681,0.79759 -2.81096,1.67509 -3.90134,2.62084 -1.17303,1.01742 -2.08693,2.12348 -2.65033,3.31571 -0.30735,0.65042 -0.50601,1.31753 -0.58815,1.99527 -0.0892,0.73614 -0.037,1.45209 0.13184,2.13681 0.18774,0.76131 0.51282,1.45735 0.91228,2.0845 0.47015,0.73812 1.04738,1.38728 1.63806,1.94669 0.73144,0.69273 1.64732,1.40669 2.78131,2.01365 0.91704,0.49084 1.95419,0.89969 3.12588,1.17909 2.00673,0.47852 4.28841,0.54901 6.87174,0.12858 2.30265,-0.37475 4.76174,-1.12595 7.35877,-2.22841 2.30554,-0.97873 4.6689,-2.21276 7.05187,-3.64336 0.35598,0.0768 0.72817,0.13742 1.11086,0.18448 0.65465,0.0805 1.36032,0.12379 2.09877,0.13591 1.49925,0.0246 3.16994,-0.0786 4.89062,-0.27822 3.67964,-0.42678 7.55381,-1.28547 10.84991,-2.34352 1.82858,-0.58698 3.46884,-1.23045 4.87326,-1.90705 1.57891,-0.76066 2.8504,-1.55688 3.81536,-2.38728 0.54995,-0.47326 1.00418,-0.96128 1.35967,-1.46604 0.40929,-0.58114 0.68318,-1.17837 0.82228,-1.78551 0.0262,-0.11429 0.0474,-0.22794 0.0637,-0.34083 0.095,-0.65501 -0.0729,-1.23581 -0.32485,-1.63766 -0.40446,-0.64504 -0.97475,-0.86366 -1.36883,-0.93135 -0.39471,-0.0678 -0.6445,0.002 -0.6445,0.002 0,0 -0.0941,0.24302 -0.2046,0.58515 -0.12918,0.39994 -0.23397,0.71729 -0.40765,1.0648 -0.0946,0.1892 -0.16895,0.30415 -0.19167,0.46077 -0.004,0.0277 -0.009,0.0569 -0.0165,0.0877 -0.0361,0.15737 -0.12145,0.37977 -0.32328,0.66635 -0.17851,0.25345 -0.44472,0.55194 -0.83486,0.88768 -0.69065,0.59434 -1.70813,1.25215 -3.12239,1.93349 -1.2485,0.60149 -2.74869,1.1932 -4.46563,1.74434 -3.10317,0.99612 -6.77518,1.81025 -10.24531,2.21274 -1.6203,0.18793 -3.14698,0.27926 -4.47271,0.2575 -0.65122,-0.0107 -1.24227,-0.0485 -1.76334,-0.1126 -0.52073,-0.064 -0.95063,-0.15178 -1.29029,-0.25501 a 1.5875,1.5875001 37.704775 0 0 -1.29104,0.16528 c -2.47415,1.51596 -4.89215,2.79352 -7.2096,3.7773 -2.41775,1.02636 -4.62935,1.69192 -6.62812,2.01721 -2.23349,0.3635 -4.08615,0.2838 -5.62527,-0.0832 -0.89963,-0.21453 -1.68128,-0.52449 -2.36406,-0.88994 -0.84568,-0.45264 -1.53539,-0.98836 -2.09637,-1.51964 -0.45633,-0.43218 -0.84742,-0.88363 -1.14149,-1.34658 -0.24751,-0.38963 -0.4147,-0.76907 -0.50477,-1.13814 -0.0798,-0.32702 -0.10153,-0.65508 -0.0596,-0.99192 0.0389,-0.31237 0.1347,-0.65037 0.30901,-1.01628 0.32546,-0.68318 0.91826,-1.44848 1.86222,-2.26275 0.87229,-0.75245 1.98937,-1.49863 3.32262,-2.20963 2.54332,-1.35631 5.66869,-2.47328 8.70973,-3.1767 1.49056,-0.34478 2.91144,-0.57832 4.17632,-0.69362 1.30119,-0.11861 2.37646,-0.10653 3.18127,0.009 a 1.6107503,1.6950338 26.501405 0 0 1.43493,-0.52111 c 0.0399,-0.0425 0.12013,-0.11774 0.26315,-0.2237 0.14343,-0.10626 0.32535,-0.2252 0.54655,-0.35434 0.47314,-0.27623 1.06495,-0.56389 1.72346,-0.84693 1.66536,-0.71581 3.52736,-1.30835 4.85343,-1.69197 5e-4,-1.5e-4 0.11519,-0.0333 0.11569,-0.0334 2.21792,-0.64056 4.0814,-1.1544 5.46063,-1.56099 1.04334,-0.30757 1.79677,-0.54678 2.40839,-0.76264 1.52713,-0.53898 2.03939,-0.92367 2.03939,-0.92367 z"
         id="path4886"
         inkscape:connector-curvature="0"
         inkscape:path-effect="#path-effect4888"
         inkscape:original-d="m 339.72783,380.155 c -4.85709,-0.35978 -16.56831,3.03552 -18.61893,5.30684 -7.8868,-1.10913 -30.52408,6.73608 -21.17357,15.59162 6.05986,5.73908 15.8115,3.04665 25.84442,-3.10073 7.18292,2.18319 33.46647,-4.1259 27.79983,-11.05176"
         sodipodi:nodetypes="ccscc" />
      <path
         style="opacity:1;fill:#1d2848;fill-opacity:1;fill-rule:nonzero;stroke:none;stroke-width:3.17499995;stroke-linecap:round;stroke-linejoin:round;stroke-miterlimit:4;stroke-dasharray:none;stroke-opacity:1"
         d="m 328.05789,367.30928 c 0,0 0.46221,0.58907 2.06111,0.77835 0.60496,0.0716 1.36505,0.0755 2.31294,-0.0553 1.29009,-0.17797 2.80785,-0.58572 4.72083,-1.31846 1e-5,0 0.0295,-0.0113 0.0295,-0.0113 1.07971,-0.41408 2.77227,-1.11239 4.60924,-1.77521 1.41299,-0.50984 2.83,-0.95771 4.12092,-1.1974 0.15084,-0.0282 0.37054,-0.0595 0.65977,-0.0917 0.28779,-0.0321 0.63236,-0.0636 1.03131,-0.0942 0.80684,-0.0618 1.8148,-0.11778 2.99349,-0.16551 2.47332,-0.10015 5.59434,-0.16015 9.0772,-0.17144 9.62671,-0.0312 19.16344,0.30155 26.43512,0.70622 6.71035,0.37342 18.41537,1.16453 29.97972,2.83819 4.56252,0.66031 9.18316,1.46901 13.50226,2.46011 4.04454,0.92809 7.79149,2.00865 10.96734,3.26305 0.12176,0.0481 0.24332,0.0967 0.36467,0.1458 0,0 0.39663,-0.0448 0.39663,-0.0448 3.90815,-0.44125 8.63988,-0.96403 13.79738,-1.23236 5.47112,-0.28464 10.94067,-0.25694 16.29956,0.28044 6.74121,0.676 12.15904,2.04659 16.56426,3.72051 1.16747,0.44363 2.21613,0.89053 3.14956,1.32083 9.33924,4.30529 11.50574,7.69924 11.50574,7.69924 l 2.17908,-2.30916 c 0,0 -0.67294,-0.70843 -2.52141,-2.20335 -1.72531,-1.39532 -4.98752,-3.83583 -9.83421,-6.07011 -0.99571,-0.45901 -2.11155,-0.93443 -3.35099,-1.4054 -4.68139,-1.77887 -10.37338,-3.20958 -17.37524,-3.91172 -5.55769,-0.55732 -11.19378,-0.58269 -16.78131,-0.29199 -5.08907,0.26477 -9.76049,0.7718 -13.59862,1.20412 -3.28815,-1.26925 -7.06567,-2.34484 -11.05233,-3.25965 -4.42718,-1.0159 -9.13729,-1.83913 -13.7576,-2.50781 -11.70279,-1.69369 -23.51691,-2.49088 -30.25806,-2.86602 -7.39119,-0.41131 -16.84031,-0.77566 -26.61239,-0.80204 -3.51065,-0.009 -6.66889,0.028 -9.1948,0.1056 -1.20236,0.0369 -2.25038,0.0827 -3.10738,0.1359 -0.42407,0.0263 -0.80584,0.0548 -1.13882,0.0854 -0.32862,0.0302 -0.62629,0.0639 -0.87718,0.10255 -1.58191,0.23739 -3.22806,0.71189 -4.72105,1.20626 -1.73623,0.57491 -3.93823,1.41804 -4.75304,1.72997 2e-5,0 -0.0291,0.0111 -0.0291,0.0111 -1.78999,0.68563 -3.2986,1.36766 -4.2687,1.83938 -0.77512,0.3769 -1.36817,0.69638 -1.83253,0.96725 -1.20008,0.70001 -1.69288,1.18471 -1.69288,1.18471 z"
         id="path4882"
         inkscape:connector-curvature="0"
         sodipodi:nodetypes="cscc"
         inkscape:path-effect="#path-effect4915"
         inkscape:original-d="m 328.05789,367.30928 c 4.69798,-0.0518 12.04014,-4.34074 17.5759,-5.259 6.44696,-1.0694 69.88699,-1.17195 95.50803,8.94788 15.77324,-1.78085 44.52123,-4.83372 62.58415,12.21156" />
      <path
         style="opacity:1;fill:#3a3c3f;fill-opacity:1;stroke:#292929;stroke-width:3.17499995;stroke-linecap:round;stroke-linejoin:round;stroke-miterlimit:4;stroke-dasharray:none;stroke-opacity:1"
         d="m 289.10075,409.91185 c -0.65784,-4.7235 2.8783,-19.33848 9.98406,-20.95752 7.10578,-1.61904 11.43072,6.34282 10.16397,10.2539 -0.93637,2.89101 -4.17357,2.50552 -6.46919,2.49155 -5.67433,-0.0345 -11.43017,8.21207 -13.67884,8.21207 z"
         id="path4884"
         inkscape:connector-curvature="0"
         sodipodi:nodetypes="csssc" />
      <path
         style="opacity:1;fill:#1d2848;fill-opacity:1;fill-rule:nonzero;stroke:none;stroke-width:3.17499995;stroke-linecap:round;stroke-linejoin:round;stroke-miterlimit:4;stroke-dasharray:none;stroke-opacity:1"
         d="m 393.42589,339.4992 c 0,0 -1.18126,1.75261 1.91633,5.40091 0.41573,0.48963 0.91746,1.00907 1.51999,1.54605 1.20365,1.07268 2.52928,2.09143 3.92702,3.03606 4.82803,3.2629 10.34358,5.55183 15.63284,6.7915 3.15314,0.73902 6.64227,1.25359 9.693,1.63937 3.42098,0.4326 7.69757,0.86439 10.25772,1.1393 4.16348,0.44709 6.88343,0.78952 9.2465,1.18891 1.62751,0.27507 2.81332,0.53513 3.70938,0.76553 2.20966,0.56816 2.76415,0.91958 2.76415,0.91958 l 1.39546,-3.11926 c 0,0 -0.81401,-0.4684 -3.30864,-1.10984 -1.00179,-0.25758 -2.28269,-0.53669 -3.99088,-0.82539 -2.46734,-0.41702 -5.26954,-0.76814 -9.45112,-1.21716 -2.60047,-0.27925 -6.81541,-0.70462 -10.19386,-1.13184 -3.01696,-0.38151 -6.36527,-0.87855 -9.34193,-1.57621 -4.91333,-1.15157 -10.03961,-3.28182 -14.49921,-6.29572 -1.28601,-0.86912 -2.48921,-1.79551 -3.5669,-2.75594 -0.46594,-0.41523 -0.9652,-0.86471 -1.43113,-1.27995 -1.62793,-1.45128 -2.42733,-2.0814 -3.19053,-2.5616 -0.67506,-0.42475 -1.08819,-0.5543 -1.08819,-0.5543 z"
         id="path4927"
         inkscape:connector-curvature="0"
         inkscape:path-effect="#path-effect4929"
         inkscape:original-d="m 393.42589,339.4992 c 2.51849,5.39679 11.87294,12.41261 23.38607,15.11102 11.51316,2.69838 29.14266,2.69838 35.97859,5.75656" />
    </g>
    <g
       inkscape:groupmode="layer"
       id="layer6"
       inkscape:label="wing f"
       style="display:inline">
      <path
         id="path4938"
         style="opacity:1;fill:#3250b0;fill-opacity:1;stroke:#1d2848;stroke-width:3.17499995;stroke-linecap:round;stroke-linejoin:round;stroke-miterlimit:4;stroke-dasharray:none;stroke-opacity:1"
         d="m 590.98759,285.7718 c -42.99481,-18.57172 -221.33415,-21.879 -223.3694,-21.879 -2.03525,0 -8.90426,-2.03526 -14.7556,-3.30729 -5.85137,-1.27204 -10.37426,5.18074 -12.24241,7.50126 l 1.0485,7.38154 c 6.48737,1.65365 9.03144,-1.14482 12.84756,-0.89042 3.81608,0.25442 27.58519,4.20515 35.7227,5.1532 19.54352,2.27688 85.50225,26.13888 113.74142,27.91971"
         inkscape:connector-curvature="0"
         sodipodi:nodetypes="csscccsc" />
      <path
         style="opacity:1;fill:#3a3c3f;fill-opacity:1;stroke:#292929;stroke-width:3.17499995;stroke-linecap:round;stroke-linejoin:round;stroke-miterlimit:4;stroke-dasharray:none;stroke-opacity:1"
         d="m 320.17128,282.0829 c 1.14483,-4.57933 10.43713,-19.50551 22.76944,-18.95332 4.71723,0.21122 6.68623,5.40718 3.56168,10.17627 -2.41686,3.68891 -8.01382,4.70653 -11.70273,4.70654 -3.47197,1e-5 -11.95713,1.78086 -14.62839,4.07051 z"
         id="path4932"
         inkscape:connector-curvature="0"
         sodipodi:nodetypes="csssc" />
      <path
         style="opacity:1;fill:#1d2848;fill-opacity:1;fill-rule:nonzero;stroke:none;stroke-width:3.17499995;stroke-linecap:round;stroke-linejoin:round;stroke-miterlimit:4;stroke-dasharray:none;stroke-opacity:1"
         d="m 371.88666,271.67139 c 0,0 0.26144,0.14925 1.13806,0.32916 0.35397,0.0727 0.82527,0.15457 1.49785,0.25018 0.92364,0.1313 2.17048,0.28126 4.11413,0.49056 2.08347,0.22436 4.58779,0.47739 8.45802,0.87158 1.09335,0.11135 2.3178,0.24169 3.68416,0.39426 7.46925,0.83404 19.12779,2.3336 34.59856,4.70366 12.01422,1.84053 25.60934,4.10181 38.36523,6.49553 6.0162,1.12898 11.7295,2.26602 16.87246,3.37314 5.16651,1.11219 9.67475,2.17641 13.32947,3.16164 0.14955,0.0403 0.29903,0.0809 0.44846,0.12165 0.15557,-0.0595 0.31078,-0.1199 0.46561,-0.18129 1.32059,-0.52365 2.39738,-1.03145 3.27817,-1.52598 0.94042,-0.52801 1.66844,-1.04706 2.23286,-1.56251 0.64137,-0.5857 1.07597,-1.17139 1.35711,-1.75202 0.36254,-0.74873 0.43805,-1.4257 0.41963,-1.93558 -0.0192,-0.53027 -0.142,-1.09294 -0.40105,-1.69278 -0.19797,-0.45842 -0.45299,-0.88794 -0.73789,-1.30532 -0.25029,-0.36668 -0.51068,-0.70529 -0.74396,-1.01621 -0.22614,-0.3014 -0.39097,-0.5304 -0.50772,-0.72798 -0.11,-0.18615 -0.19937,-0.38374 -0.26654,-0.58926 -0.2489,-0.0561 -0.49799,-0.11135 -0.74726,-0.16576 -3.1916,-0.69659 -7.36956,-1.46254 -12.3082,-2.27152 -4.91564,-0.80521 -10.5298,-1.644 -16.55029,-2.48393 -12.74537,-1.77812 -26.74102,-3.48358 -39.42828,-4.88187 -16.14817,-1.77972 -28.61584,-2.8981 -37.07502,-3.53167 -2.07491,-0.15541 -3.88139,-0.27993 -5.44802,-0.38046 -3.48818,-0.22385 -6.13668,-0.29218 -8.17848,-0.27017 -2.23415,0.0241 -3.78067,0.15697 -4.88749,0.32267 -0.82021,0.1228 -1.41774,0.2667 -1.85946,0.40398 -1.12364,0.34921 -1.39259,0.6769 -1.39259,0.6769 0,0 0.34815,0.20809 1.45231,0.43512 0.44094,0.0907 1.01905,0.18849 1.82116,0.29246 1.09317,0.1417 2.5694,0.29117 4.77769,0.46701 2.02806,0.1615 4.59459,0.33941 8.08133,0.56316 1.55548,0.0998 3.35151,0.22438 5.41599,0.38048 8.4066,0.63561 20.86342,1.76925 36.96783,3.56771 12.65936,1.41374 26.6308,3.13824 39.33461,4.9341 6.00242,0.84852 11.59009,1.69477 16.47357,2.50605 4.58354,0.76145 8.47366,1.47998 11.50283,2.13362 0.10682,0.16069 0.21335,0.31237 0.3103,0.44915 0.25825,0.36433 0.45066,0.62661 0.64689,0.92905 0.20926,0.3225 0.34568,0.57706 0.43567,0.79761 0.11043,0.27067 0.13485,0.45381 0.13914,0.57247 0.004,0.10671 0.001,0.27487 -0.0896,0.49661 -0.0758,0.18444 -0.23886,0.47313 -0.61763,0.85177 -0.33918,0.33907 -0.85025,0.74912 -1.62342,1.21752 -0.63605,0.38534 -1.43749,0.80296 -2.44786,1.24947 -3.63412,-0.93441 -8.0294,-1.93388 -13.0043,-2.9717 -5.17903,-1.08041 -10.92258,-2.1891 -16.96154,-3.28877 -12.81266,-2.33314 -26.42787,-4.53159 -38.48065,-6.32294 -15.54027,-2.30966 -27.17316,-3.75737 -34.71051,-4.58491 -1.3734,-0.15078 -2.60466,-0.28051 -3.7051,-0.39259 -3.79339,-0.38636 -6.53993,-0.55053 -8.56573,-0.59111 -1.96523,-0.0394 -3.29759,0.0368 -4.23433,0.1519 -0.6939,0.0852 -1.18945,0.1944 -1.54966,0.30081 -0.91081,0.26904 -1.09651,0.53535 -1.09651,0.53535 z"
         id="path4936"
         inkscape:connector-curvature="0"
         sodipodi:nodetypes="cccc"
         inkscape:path-effect="#path-effect4941"
         inkscape:original-d="m 371.88666,271.67139 c 9.66748,-1.52643 92.6606,10.79312 122.42623,18.67974 9.92187,-4.07051 5.37077,-7.15161 4.09874,-9.44129 -25.4407,-5.59694 -113.94349,-15.56512 -126.79744,-13.91785" />
    </g>
  </g>
  <g
     inkscape:groupmode="layer"
     id="layer2"
     inkscape:label="mouse"
     style="display:inline">
    <path
       style="opacity:1;fill:#1d1d1d;fill-opacity:1;fill-rule:nonzero;stroke:none;stroke-width:2.11666656;stroke-linecap:round;stroke-linejoin:round;stroke-miterlimit:4;stroke-dasharray:none;stroke-opacity:1"
       d="m 266.20752,139.13571 c 0,0 1.36901,1.28869 4.55047,2.08904 0.33512,0.0843 0.66858,0.18071 0.99947,0.28877 1.94635,0.63565 3.77557,1.66398 5.3692,2.99627 1.76162,1.47272 3.21366,3.29533 4.30252,5.38393 1.22734,2.35423 1.97828,5.01331 2.25492,7.89826 0.15022,1.56667 0.12525,3.5013 -0.0217,5.64468 -0.15877,2.31617 -0.45933,4.86971 -0.82951,7.46114 -0.84062,5.88469 -2.14149,12.62337 -3.21346,17.98849 -1.50815,7.54822 -2.82361,13.80944 -3.73845,18.51717 -0.67909,3.49462 -1.14135,6.07447 -1.48555,8.1685 -0.84137,5.11881 -0.92062,6.79077 -0.92062,6.79077 l 3.4328,0.32216 c 0,0 0.0666,-1.54387 0.89005,-6.5537 0.33751,-2.05337 0.79346,-4.5994 1.46789,-8.07001 0.90859,-4.67556 2.22103,-10.92234 3.73494,-18.49934 1.07237,-5.36717 2.39023,-12.18824 3.24564,-18.17647 0.37697,-2.63899 0.68949,-5.2827 0.85608,-7.71292 0.15286,-2.23005 0.18988,-4.37542 0.014,-6.20957 -0.3141,-3.27562 -1.17472,-6.37217 -2.62971,-9.16306 -1.29088,-2.47612 -3.0254,-4.66043 -5.14841,-6.43529 -1.91676,-1.60242 -4.13035,-2.85129 -6.51027,-3.62853 -0.40541,-0.1324 -0.81531,-0.25096 -1.2287,-0.35496 -4.32848,-1.08889 -5.39163,1.25467 -5.39163,1.25467 z"
       id="path4506"
       inkscape:connector-curvature="0"
       sodipodi:nodetypes="ccc"
       inkscape:path-effect="#path-effect5257"
       inkscape:original-d="m 266.20752,139.13571 c 7.73538,-0.71957 17.93339,5.35953 19.19265,18.49172 1.25923,13.13218 -8.7634,49.49339 -10.20893,64.89638" />
    <path
       style="opacity:1;fill:#1d1d1d;fill-opacity:1;stroke:#3e3e3e;stroke-width:2.11666656;stroke-linecap:round;stroke-linejoin:round;stroke-miterlimit:4;stroke-dasharray:none;stroke-opacity:1"
       d="m 265.61194,220.8598 c 7.10644,-1.97646 18.59899,0.70463 21.85699,3.14813 2.51849,1.88887 3.46286,4.48473 3.54969,7.7817 0.12466,4.73321 -3.75813,33.98203 -9.12637,39.35026 -5.57669,5.57668 -19.96812,4.0476 -24.10566,-2.06878 -4.13753,-6.11636 -0.77899,-37.35295 0.71958,-41.93048 0.92783,-2.83416 4.90912,-5.66989 7.10577,-6.28083 z"
       id="path4508"
       inkscape:connector-curvature="0"
       sodipodi:nodetypes="sssssss" />
    <path
       style="opacity:1;fill:none;fill-opacity:1;stroke:#3e3e3e;stroke-width:2.11666656;stroke-linecap:round;stroke-linejoin:round;stroke-miterlimit:4;stroke-dasharray:none;stroke-opacity:1"
       d="m 255.98767,244.87551 c 8.54491,-4.40737 23.57126,-4.5391 33.12212,2.75373"
       id="path4510"
       inkscape:connector-curvature="0"
       sodipodi:nodetypes="cc" />
    <path
       style="opacity:1;fill:none;fill-opacity:1;stroke:#3e3e3e;stroke-width:2.11666656;stroke-linecap:round;stroke-linejoin:round;stroke-miterlimit:4;stroke-dasharray:none;stroke-opacity:1"
       d="m 269.83489,220.65356 c -0.80952,2.96824 -1.99423,21.15286 -1.99423,21.15286"
       id="path4512"
       inkscape:connector-curvature="0"
       sodipodi:nodetypes="cc" />
    <path
       style="opacity:1;fill:none;fill-opacity:1;stroke:#3e3e3e;stroke-width:2.11666656;stroke-linecap:round;stroke-linejoin:round;stroke-miterlimit:4;stroke-dasharray:none;stroke-opacity:1"
       d="m 276.49547,242.35701 c 0.66562,-5.47774 2.46872,-19.9131 2.42855,-21.31731"
       id="path4514"
       inkscape:connector-curvature="0"
       sodipodi:nodetypes="cc" />
  </g>
  <g
     inkscape:groupmode="layer"
     id="layer10"
     inkscape:label="desk"
     style="display:inline"
     sodipodi:insensitive="true">
    <path
       style="opacity:1;fill:url(#radialGradient5269);fill-opacity:1;stroke:none;stroke-width:2.11666656;stroke-linecap:round;stroke-linejoin:round;stroke-miterlimit:4;stroke-dasharray:none;stroke-opacity:1"
       d="M 41.015591,45.718128 109.7347,-32.715198 C 175.21574,-47.106635 333.16174,165.16704 272.71771,269.50495 L 83.830114,239.64272 C 62.094459,241.52256 41.015591,45.718128 41.015591,45.718128 Z"
       id="path5261"
       inkscape:connector-curvature="0"
       sodipodi:nodetypes="ccccc" />
    <path
       style="opacity:1;fill:#1d1d1d;fill-opacity:1;stroke:#3e3e3e;stroke-width:2.11666656;stroke-linecap:round;stroke-linejoin:round;stroke-miterlimit:4;stroke-dasharray:none;stroke-opacity:1"
       d="m 135.17373,265.02671 -5.42613,12.99658 6.64541,0.45883 5.14265,-12.7131"
       id="path5259"
       inkscape:connector-curvature="0"
       sodipodi:nodetypes="cccc" />
    <path
       style="opacity:1;fill:#1d1d1d;fill-opacity:1;stroke:#3e3e3e;stroke-width:3.70416665;stroke-linecap:round;stroke-linejoin:round;stroke-miterlimit:4;stroke-dasharray:none;stroke-opacity:1"
       d="m 37.379146,236.35376 -3.207234,34.6114 16.83798,2.53907 -0.267269,-36.61593 z"
       id="path5236"
       inkscape:connector-curvature="0" />
    <path
       style="opacity:1;fill:#1d1d1d;fill-opacity:1;stroke:#3e3e3e;stroke-width:3.70416665;stroke-linecap:round;stroke-linejoin:round;stroke-miterlimit:4;stroke-dasharray:none;stroke-opacity:1"
       d="m 35.726021,83.649043 c 2.64583,29.293147 -1.32292,126.622017 -2.07887,139.473207 -0.36136,6.14309 0.31285,11.48755 3.78735,13.62571 3.47451,2.13815 18.02448,11.1834 26.93887,9.09388 9.05165,-2.12169 9.75533,-9.48807 9.75533,-9.48807"
       id="path5230"
       inkscape:connector-curvature="0"
       sodipodi:nodetypes="cscsc" />
    <path
       style="opacity:1;fill:#1d1d1d;fill-opacity:1;stroke:#3e3e3e;stroke-width:3.70416665;stroke-linecap:round;stroke-linejoin:round;stroke-miterlimit:4;stroke-dasharray:none;stroke-opacity:1"
       d="m 41.773641,45.756929 c 1.22842,3.779761 41.97677,190.329571 42.37767,193.937711 -5.07812,3.60813 -10.50033,5.19095 -13.25949,5.73008 -3.87408,0.75698 -7.18663,-2.25558 -8.25571,-8.40278 -1.06907,-6.1472 -33.29798,-174.468858 -34.09978,-178.878806 -0.80181,-4.409945 2.71577,-8.462582 4.08593,-9.129084 1.9897,-0.967869 9.15138,-3.257121 9.15138,-3.257121 z"
       id="path5228"
       inkscape:connector-curvature="0"
       sodipodi:nodetypes="ccsccsc" />
    <path
       style="opacity:1;fill:#1d1d1d;fill-opacity:1;stroke:#3e3e3e;stroke-width:3.70416665;stroke-linecap:round;stroke-linejoin:round;stroke-miterlimit:4;stroke-dasharray:none;stroke-opacity:1"
       d="m 8.9149417,278.18143 c 2.6726953,-1.87088 13.8980153,-9.35442 17.3725193,-10.0226 3.474503,-0.66818 31.270535,-0.4009 33.007786,0.66818 1.737252,1.06907 10.557145,8.28535 10.690781,9.48806"
       id="path5234"
       inkscape:connector-curvature="0"
       sodipodi:nodetypes="cscc" />
    <path
       style="opacity:1;fill:#97693d;fill-opacity:1;stroke:#494433;stroke-width:3.70416665;stroke-linecap:round;stroke-linejoin:round;stroke-miterlimit:4;stroke-dasharray:none;stroke-opacity:1"
       d="M -0.30585694,278.18143 C 13.47867,278.03831 222.74399,278.99473 229.8132,279.51779 c 4.81085,4.54358 5.87993,31.27052 5.34539,37.685 -17.90706,1.06908 -218.626467,-2.67269 -235.99898604,-1.60361"
       id="path5226"
       inkscape:connector-curvature="0"
       sodipodi:nodetypes="cccc" />
    <path
       style="opacity:1;fill:#1d1d1d;fill-opacity:1;stroke:#3e3e3e;stroke-width:3.17499995;stroke-linecap:round;stroke-linejoin:round;stroke-miterlimit:4;stroke-dasharray:none;stroke-opacity:1"
       d="m 135.52447,253.67375 c 2.86532,-0.0836 77.52023,8.63729 80.33448,9.93643 4.52818,2.09032 5.49409,4.90024 6.21762,7.89359 0.31397,1.29894 -2.44538,4.46892 -5.47116,4.72471 -1.89256,0.16 -86.39078,-8.62958 -87.7137,-10.14148 -1.32291,-1.51191 0.49019,-8.96128 1.10487,-10.00366 1.10307,-1.87058 3.40102,-2.34756 5.52789,-2.40959 z"
       id="path5257"
       inkscape:connector-curvature="0"
       sodipodi:nodetypes="sssssss" />
  </g>
</svg>
