<?xml version="1.0" encoding="UTF-8" standalone="no"?>
<svg
   xmlns:dc="http://purl.org/dc/elements/1.1/"
   xmlns:cc="http://creativecommons.org/ns#"
   xmlns:rdf="http://www.w3.org/1999/02/22-rdf-syntax-ns#"
   xmlns:svg="http://www.w3.org/2000/svg"
   xmlns="http://www.w3.org/2000/svg"
   xmlns:xlink="http://www.w3.org/1999/xlink"
   xmlns:sodipodi="http://sodipodi.sourceforge.net/DTD/sodipodi-0.dtd"
   xmlns:inkscape="http://www.inkscape.org/namespaces/inkscape"
   inkscape:export-ydpi="96"
   inkscape:export-xdpi="96"
   inkscape:export-filename="../stickers/pattern.png"
   width="512"
   height="512"
   viewBox="0 0 512 512"
   version="1.1"
   id="svg4575"
   inkscape:version="1.0 (1.0+r73+1)"
   sodipodi:docname="pattern.svg">
  <defs
     id="defs4569">
    <clipPath
       clipPathUnits="userSpaceOnUse"
       id="clipPath1538">
      <rect
         y="296.36224"
         x="-418.07742"
         height="332.8324"
         width="332.8324"
         id="rect1540"
         style="fill:none;stroke:#000000;stroke-width:5;stroke-linecap:round;stroke-linejoin:round" />
    </clipPath>
    <clipPath
       clipPathUnits="userSpaceOnUse"
       id="clipPath1576">
      <rect
         y="-631.526"
         x="90.733032"
         height="332.8324"
         width="332.8324"
         id="rect1578"
         style="fill:none;stroke:#000000;stroke-width:5;stroke-linecap:round;stroke-linejoin:round"
         transform="scale(-1)" />
    </clipPath>
    <clipPath
       clipPathUnits="userSpaceOnUse"
       id="clipPath1702">
      <use
         height="100%"
         width="100%"
         id="use1704"
         xlink:href="#rect1460"
         y="0"
         x="0" />
    </clipPath>
    <clipPath
       clipPathUnits="userSpaceOnUse"
       id="clipPath1709">
      <use
         height="100%"
         width="100%"
         transform="rotate(-180,-587.23762,302.41081)"
         id="use1711"
         xlink:href="#rect1460"
         y="0"
         x="0" />
    </clipPath>
  </defs>
  <sodipodi:namedview
     id="base"
     pagecolor="#ffffff"
     bordercolor="#666666"
     borderopacity="1.0"
     inkscape:pageopacity="0.0"
     inkscape:pageshadow="2"
     inkscape:zoom="0.22809343"
     inkscape:cx="-1079.0616"
     inkscape:cy="-276.74282"
     inkscape:document-units="px"
     inkscape:current-layer="layer3"
     showgrid="false"
     units="px"
     inkscape:pagecheckerboard="true"
     inkscape:window-width="2408"
     inkscape:window-height="1411"
     inkscape:window-x="30"
     inkscape:window-y="0"
     inkscape:window-maximized="1"
     inkscape:document-rotation="0"
     borderlayer="true"
     inkscape:snap-global="false"
     inkscape:snap-page="true" />
  <metadata
     id="metadata4572">
    <rdf:RDF>
      <cc:Work
         rdf:about="">
        <dc:format>image/svg+xml</dc:format>
        <dc:type
           rdf:resource="http://purl.org/dc/dcmitype/StillImage" />
        <dc:title />
      </cc:Work>
    </rdf:RDF>
  </metadata>
  <g
     inkscape:label="pattern"
     inkscape:groupmode="layer"
     id="layer1"
     transform="translate(0,-161.53332)">
    <use
       x="0"
       y="0"
       xlink:href="#rect1460"
       id="use1618"
       transform="matrix(1.5383116,0,0,1.5383116,1155.1333,-45.875588)"
       width="100%"
       height="100%" />
    <use
       height="100%"
       width="100%"
       transform="matrix(-1.5383116,0,0,-1.5383116,-651.5756,884.52851)"
       id="use1478"
       xlink:href="#path3165"
       y="0"
       x="0"
       clip-path="url(#clipPath1709)" />
    <use
       x="0"
       y="0"
       xlink:href="#path3165"
       id="use1546"
       transform="matrix(1.5383116,0,0,1.5383116,1155.1333,-45.875603)"
       width="100%"
       height="100%"
       clip-path="url(#clipPath1702)" />
    <use
       x="0"
       y="0"
       xlink:href="#path3165"
       id="use1532"
       transform="matrix(1.5383116,0,0,1.5383116,643.13336,-45.875603)"
       width="100%"
       height="100%"
       clip-path="url(#clipPath1538)" />
    <use
       x="0"
       y="0"
       xlink:href="#path3165"
       id="use1570"
       transform="matrix(-1.5383116,0,0,-1.5383116,-139.57566,884.52851)"
       width="100%"
       height="100%"
       clip-path="url(#clipPath1576)" />
  </g>
  <g
     inkscape:groupmode="layer"
     id="layer3"
     inkscape:label="editable"
     style="display:none">
    <rect
       transform="translate(0,-161.53332)"
       style="fill:#ffffff;stroke:none;stroke-width:5;stroke-linecap:round;stroke-linejoin:round"
       id="rect1460"
       width="332.8324"
       height="332.8324"
       x="-750.90979"
       y="296.36224" />
    <path
       sodipodi:nodetypes="cccsccccccccccccccccccsccccccccscccsscccccsccscccccccsssscccscc"
       id="path3165"
       style="display:inline;fill:#3250b0;fill-opacity:1;stroke:none;stroke-width:4.34088;stroke-linecap:round;stroke-linejoin:round;stroke-miterlimit:4;stroke-dasharray:none;stroke-dashoffset:0;stroke-opacity:1"
       d="m -618.89949,534.27653 c 17.98578,-9.51534 82.73487,-86.25172 35.37213,-111.1143 31.17542,2.60902 45.56417,17.64932 56.15581,18.26323 7.59403,10.28271 2.12787,38.57472 -8.79307,50.33911 -21.94512,23.63994 -60.35253,40.20983 -74.34149,43.27934 -6.59481,0.30701 -8.39338,-0.76738 -8.39338,-0.76738 z m 159.77346,-60.5565 c 0.84786,-6.18573 8.3373,-14.86749 8.3373,-14.86749 0,0 -8.6199,2.60452 -19.21818,1.19371 -11.3048,0.75968 -44.30635,12.82471 -47.4802,21.92141 28.12073,-11.82888 39.56686,-11.72034 58.36108,-8.24763 z m 5.65243,42.97456 c 2.26098,-2.17044 7.91332,-3.68976 15.5441,-4.55793 -2.82621,-1.30225 -9.04381,-4.34087 -15.82672,-11.28622 -9.3265,-4.12384 -44.65405,-13.89077 -63.87224,-13.23965 39.28425,7.59649 54.54574,17.14644 64.15486,29.0838 z m -16.54302,26.94377 c -4.16076,-7.7658 -25.57991,-40.97722 -51.55945,-51.87379 15.98741,12.89168 33.9733,49.41822 31.97482,57.70577 5.76552,-0.96243 17.51846,1.39188 21.91622,2.85398 -0.94168,-1.90531 -2.15049,-5.59837 -2.33159,-8.68596 z m -151.08123,-4.91115 c 34.56349,-3.76683 78.76486,-30.94036 88.82375,-45.25101 7.11947,-10.12873 25.52599,-38.87918 -0.73255,-65.3701 22.38242,2.1486 50.69148,42.92344 93.91292,24.36412 -26.91435,23.15831 -25.61478,47.25707 17.37064,63.37602 -59.15338,0.92083 -42.69772,31.47548 -36.30273,43.75329 -35.97173,-11.97084 -49.06145,-0.46025 -49.06145,-0.46025 -27.97798,-13.42886 -63.05033,-21.25601 -114.01035,-20.4119 z m -73.451,-30.49728 c 2.11961,0.10825 7.77205,-0.65113 5.79369,-3.4727 -1.97834,-2.82158 -10.68925,-4.05895 -15.12019,-3.14711 2.40229,4.23233 7.20686,6.51126 9.3265,6.61981 z m -35.89281,-26.47933 c 5.08711,2.17046 18.93559,11.06926 22.89229,11.06926 3.95661,0 25.64386,-2.46164 41.82782,4.34081 18.07313,7.59651 39.1562,23.84931 41.05707,34.27113 -8.19595,-4.7749 -22.28219,-13.19464 -27.4913,-13.43495 4.10383,6.09008 8.61575,19.13213 10.17428,25.177 10.45703,-2.38748 107.61551,-0.45608 141.58872,25.94102 33.9733,26.39728 58.46908,42.69594 92.32736,42.97238 38.37825,0.31351 50.53627,-15.1404 41.36752,-26.16712 -2.81643,-3.38722 -19.78445,-7.90384 -25.77972,4.68092 -4.01696,-20.12488 28.27479,-21.7631 37.97011,-10.1292 11.92201,14.30569 3.57988,41.24136 -48.81844,43.13677 -22.11844,0.80009 -61.49479,-3.23383 -90.27212,-20.11588 3.99682,8.90148 6.82606,19.72552 4.24502,19.75733 -33.77794,0.41706 -131.7448,-0.11301 -131.7448,-0.11301 6.5003,-23.84016 44.81189,-27.79323 63.55003,-23.02092 -8.39337,-8.90141 -41.16761,-8.59446 -52.75848,-5.21805 -2.37798,-12.28427 12.39029,-27.01126 26.37925,-34.37792 -24.7805,7.98058 -45.96387,20.56535 -63.94966,34.68483 -12.2933,0.5679 -31.75252,-8.91041 -37.9702,-22.40702 -3.59934,-7.81299 0.58543,-22.69215 -5.40994,-27.91026 -5.9953,-5.21804 -22.16842,-8.00236 -29.36276,-15.36907 -7.19431,-7.36673 -27.57828,-24.55564 -29.57673,-36.21957 -1.09991,-6.4197 14.66749,-13.71911 19.75468,-11.54867 z m 64.17937,141.54018 c 2.19534,-6.29209 26.72349,-33.1657 45.92558,-26.7372 8.82011,2.95284 -11.75248,27.0441 -11.75248,27.0441 z"
       inkscape:connector-curvature="0"
       transform="translate(0,-161.53332)" />
  </g>
</svg>
