<?xml version="1.0" encoding="UTF-8" standalone="no"?>
<svg
   xmlns:dc="http://purl.org/dc/elements/1.1/"
   xmlns:cc="http://creativecommons.org/ns#"
   xmlns:rdf="http://www.w3.org/1999/02/22-rdf-syntax-ns#"
   xmlns:svg="http://www.w3.org/2000/svg"
   xmlns="http://www.w3.org/2000/svg"
   xmlns:xlink="http://www.w3.org/1999/xlink"
   xmlns:sodipodi="http://sodipodi.sourceforge.net/DTD/sodipodi-0.dtd"
   xmlns:inkscape="http://www.inkscape.org/namespaces/inkscape"
   inkscape:export-ydpi="96"
   inkscape:export-xdpi="96"
   inkscape:export-filename="/home/melano/Pictures/Dragons/Glax/stickers/clock-sleepy.png"
   sodipodi:docname="clock.svg"
   inkscape:version="0.92+devel (unknown)"
   id="svg4575"
   version="1.1"
   viewBox="0 0 512 512"
   height="512"
   width="512">
  <defs
     id="defs4569">
    <inkscape:path-effect
       miter_limit="100"
       jointype="extrapolated"
       smoothing="0.5"
       end_offset="1.25894"
       attach_start="0.45810531"
       stroke_width="4"
       is_visible="true"
       id="path-effect1112"
       effect="taper_stroke" />
    <inkscape:path-effect
       miter_limit="100"
       jointype="round"
       smoothing="0.5"
       end_offset="0.2"
       attach_start="0.35498283"
       stroke_width="4"
       is_visible="true"
       id="path-effect870"
       effect="taper_stroke" />
    <inkscape:path-effect
       miter_limit="100"
       jointype="extrapolated"
       smoothing="0.5"
       end_offset="0.043838663"
       attach_start="0.16935635"
       stroke_width="4"
       is_visible="true"
       id="path-effect873"
       effect="taper_stroke" />
    <inkscape:path-effect
       miter_limit="100"
       jointype="extrapolated"
       smoothing="0.5"
       end_offset="0.024734455"
       attach_start="0.44947854"
       stroke_width="4"
       is_visible="true"
       id="path-effect871"
       effect="taper_stroke" />
    <inkscape:path-effect
       miter_limit="100"
       jointype="round"
       smoothing="0.5"
       end_offset="0.2"
       attach_start="0.64707752"
       stroke_width="4"
       is_visible="true"
       id="path-effect869"
       effect="taper_stroke" />
    <inkscape:path-effect
       miter_limit="100"
       jointype="extrapolated"
       smoothing="0.5"
       end_offset="0.25182319"
       attach_start="0.2"
       stroke_width="4"
       is_visible="true"
       id="path-effect855"
       effect="taper_stroke" />
    <inkscape:path-effect
       miter_limit="100"
       jointype="extrapolated"
       smoothing="0.5"
       end_offset="0.044417553"
       attach_start="0.2661236"
       stroke_width="4"
       is_visible="true"
       id="path-effect851"
       effect="taper_stroke" />
    <inkscape:path-effect
       miter_limit="100"
       jointype="extrapolated"
       smoothing="0.5"
       end_offset="0.57213531"
       attach_start="0.38489577"
       stroke_width="4"
       is_visible="true"
       id="path-effect1570"
       effect="taper_stroke" />
    <inkscape:path-effect
       miter_limit="100"
       jointype="round"
       smoothing="0.5"
       end_offset="0.74399924"
       attach_start="0.2"
       stroke_width="4"
       is_visible="true"
       id="path-effect1566"
       effect="taper_stroke" />
    <inkscape:path-effect
       miter_limit="100"
       jointype="extrapolated"
       smoothing="0.5"
       end_offset="0.66871233"
       attach_start="0.37908295"
       stroke_width="1.0583333"
       is_visible="false"
       id="path-effect1556"
       effect="taper_stroke" />
    <inkscape:path-effect
       miter_limit="100"
       jointype="extrapolated"
       smoothing="0.5"
       end_offset="1.128637"
       attach_start="0.030268527"
       stroke_width="4"
       is_visible="true"
       id="path-effect1554"
       effect="taper_stroke" />
    <inkscape:path-effect
       miter_limit="100"
       jointype="extrapolated"
       smoothing="0.5"
       end_offset="0.2"
       attach_start="0.35740416"
       stroke_width="1.0583333"
       is_visible="true"
       id="path-effect1546"
       effect="taper_stroke" />
    <inkscape:path-effect
       miter_limit="100"
       jointype="extrapolated"
       smoothing="0.5"
       end_offset="0.57213531"
       attach_start="0.38489577"
       stroke_width="1.0583333"
       is_visible="true"
       id="path-effect1570-3"
       effect="taper_stroke" />
  </defs>
  <sodipodi:namedview
     inkscape:snap-center="false"
     inkscape:bbox-paths="true"
     inkscape:snap-bbox-midpoints="true"
     inkscape:snap-bbox="false"
     inkscape:snap-nodes="true"
     inkscape:snap-global="false"
     borderlayer="true"
     inkscape:document-rotation="0"
     inkscape:window-maximized="1"
     inkscape:window-y="0"
     inkscape:window-x="30"
     inkscape:window-height="1411"
     inkscape:window-width="2408"
     inkscape:pagecheckerboard="true"
     units="px"
     showgrid="false"
     inkscape:current-layer="durg"
     inkscape:document-units="px"
     inkscape:cy="325.93144"
     inkscape:cx="157.43892"
     inkscape:zoom="1.979899"
     inkscape:pageshadow="2"
     inkscape:pageopacity="0.0"
     borderopacity="1.0"
     bordercolor="#666666"
     pagecolor="#ffffff"
     id="base" />
  <metadata
     id="metadata4572">
    <rdf:RDF>
      <cc:Work
         rdf:about="">
        <dc:format>image/svg+xml</dc:format>
        <dc:type
           rdf:resource="http://purl.org/dc/dcmitype/StillImage" />
        <dc:title />
      </cc:Work>
    </rdf:RDF>
  </metadata>
  <g
     style="display:none"
     transform="translate(0,-161.53332)"
     id="layer1"
     inkscape:groupmode="layer"
     inkscape:label="ref">
    <image
       sodipodi:absref="/home/melano/Pictures/Dragons/Glax/sketches/clock-thumb.jpeg"
       xlink:href="../sketches/clock-thumb.jpeg"
       y="-32.125023"
       x="-306.745"
       width="146.1936"
       height="179.61742"
       preserveAspectRatio="none"
       id="image1486"
       transform="rotate(-90)" />
    <image
       sodipodi:absref="/home/melano/Pictures/Dragons/Glax/sketches/clock.jpeg"
       xlink:href="../sketches/clock.jpeg"
       y="147.4924"
       x="-306.745"
       width="75.183998"
       height="78.718826"
       preserveAspectRatio="none"
       id="image1472"
       transform="rotate(-90)" />
  </g>
  <g
     style="display:inline"
     inkscape:label="clock"
     id="layer2"
     inkscape:groupmode="layer">
    <path
       inkscape:connector-curvature="0"
       id="path1121"
       d="M 181.00199,149.9015 C 81.139793,149.9015 4.0294515e-7,231.05616 0,330.94669 1.0073629e-5,430.83716 81.139796,512 181.00199,512 c 99.86218,0 181.00197,-81.16284 181.00199,-181.05331 0,-99.89053 -81.1398,-181.04519 -181.00199,-181.04519 z"
       style="color:#000000;font-style:normal;font-variant:normal;font-weight:normal;font-stretch:normal;font-size:medium;line-height:normal;font-family:sans-serif;font-variant-ligatures:normal;font-variant-position:normal;font-variant-caps:normal;font-variant-numeric:normal;font-variant-alternates:normal;font-variant-east-asian:normal;font-feature-settings:normal;font-variation-settings:normal;text-indent:0;text-align:start;text-decoration:none;text-decoration-line:none;text-decoration-style:solid;text-decoration-color:#000000;letter-spacing:normal;word-spacing:normal;text-transform:none;writing-mode:lr-tb;direction:ltr;text-orientation:mixed;dominant-baseline:auto;baseline-shift:baseline;text-anchor:start;white-space:normal;shape-padding:0;shape-margin:0;inline-size:0;clip-rule:nonzero;display:inline;overflow:visible;visibility:visible;isolation:auto;mix-blend-mode:normal;color-interpolation:sRGB;color-interpolation-filters:linearRGB;solid-color:#000000;solid-opacity:1;vector-effect:none;fill:#292929;fill-opacity:1;fill-rule:nonzero;stroke:none;stroke-width:15.92035866px;stroke-linecap:butt;stroke-linejoin:miter;stroke-miterlimit:4;stroke-dasharray:none;stroke-dashoffset:0;stroke-opacity:1;color-rendering:auto;image-rendering:auto;shape-rendering:auto;text-rendering:auto;enable-background:accumulate" />
    <path
       inkscape:connector-curvature="0"
       id="path1133"
       d="m 181.00199,168.20986 c 89.9504,0 162.69081,72.76105 162.69081,162.73697 -10e-6,89.97594 -72.74041,162.73697 -162.69081,162.73697 -89.950409,0 -162.690805,-72.76103 -162.690814,-162.73697 0,-89.97593 72.740397,-162.73697 162.690814,-162.73697 z"
       style="color:#000000;font-style:normal;font-variant:normal;font-weight:normal;font-stretch:normal;font-size:medium;line-height:normal;font-family:sans-serif;font-variant-ligatures:normal;font-variant-position:normal;font-variant-caps:normal;font-variant-numeric:normal;font-variant-alternates:normal;font-variant-east-asian:normal;font-feature-settings:normal;font-variation-settings:normal;text-indent:0;text-align:start;text-decoration:none;text-decoration-line:none;text-decoration-style:solid;text-decoration-color:#000000;letter-spacing:normal;word-spacing:normal;text-transform:none;writing-mode:lr-tb;direction:ltr;text-orientation:mixed;dominant-baseline:auto;baseline-shift:baseline;text-anchor:start;white-space:normal;shape-padding:0;shape-margin:0;inline-size:0;clip-rule:nonzero;display:inline;overflow:visible;visibility:visible;isolation:auto;mix-blend-mode:normal;color-interpolation:sRGB;color-interpolation-filters:linearRGB;solid-color:#000000;solid-opacity:1;vector-effect:none;fill:#c4d9f5;fill-opacity:1;fill-rule:nonzero;stroke:none;stroke-width:15.79023266px;stroke-linecap:butt;stroke-linejoin:miter;stroke-miterlimit:4;stroke-dasharray:none;stroke-dashoffset:0;stroke-opacity:1;color-rendering:auto;image-rendering:auto;shape-rendering:auto;text-rendering:auto;enable-background:accumulate" />
    <ellipse
       ry="10.909749"
       rx="10.906654"
       id="circle1000"
       style="fill:#292f75;stroke-width:0.63955551"
       cy="330.94791"
       cx="322.78802" />
    <ellipse
       ry="10.909749"
       rx="10.906654"
       id="circle1002"
       style="fill:#292f75;stroke-width:0.63955551"
       cy="401.86127"
       cx="303.79224" />
    <ellipse
       ry="10.909749"
       rx="10.906654"
       id="circle1004"
       style="fill:#292f75;stroke-width:0.63955551"
       cy="453.77341"
       cx="251.89479" />
    <ellipse
       ry="10.909749"
       rx="10.906654"
       id="circle1006"
       style="fill:#292f75;stroke-width:0.63955551"
       cy="472.7746"
       cx="181.00151" />
    <ellipse
       ry="10.909749"
       rx="10.906654"
       id="circle1008"
       style="fill:#292f75;stroke-width:0.63955551"
       cy="453.77341"
       cx="110.10826" />
    <ellipse
       ry="10.909749"
       rx="10.906654"
       id="circle1010"
       style="fill:#292f75;stroke-width:0.63955551"
       cy="401.86127"
       cx="58.210793" />
    <ellipse
       ry="10.909749"
       rx="10.906654"
       id="circle1012"
       style="fill:#292f75;stroke-width:0.63955551"
       cy="330.94791"
       cx="39.214993" />
    <ellipse
       ry="10.909749"
       rx="10.906654"
       id="circle1014"
       style="fill:#292f75;stroke-width:0.63955551"
       cy="260.03458"
       cx="58.210793" />
    <ellipse
       ry="10.909749"
       rx="10.906654"
       id="circle1016"
       style="fill:#292f75;stroke-width:0.63955551"
       cy="208.12239"
       cx="110.10826" />
    <ellipse
       ry="10.909749"
       rx="10.906654"
       id="circle1018"
       style="fill:#292f75;stroke-width:0.63955551"
       cy="189.12122"
       cx="181.00151" />
    <ellipse
       ry="10.909749"
       rx="10.906654"
       id="circle1020"
       style="fill:#292f75;stroke-width:0.63955551"
       cy="208.12239"
       cx="251.89479" />
    <ellipse
       ry="10.909749"
       rx="10.906654"
       id="circle1022"
       style="fill:#292f75;stroke-width:0.63955551"
       cy="260.03458"
       cx="303.79227" />
    <g
       id="text1137"
       style="font-style:normal;font-variant:normal;font-weight:normal;font-stretch:normal;font-size:9.02542019px;line-height:60.00000238%;font-family:'TeX Gyre Bonum';-inkscape-font-specification:'TeX Gyre Bonum';text-align:center;writing-mode:lr-tb;text-anchor:middle;fill:#292f75;stroke:none;stroke-width:0.34664583;stroke-linecap:round;stroke-linejoin:round;stroke-miterlimit:4;stroke-dasharray:none"
       transform="matrix(3.7799926,0,0,3.781065,0,-0.13551916)"
       aria-label="RAWRLEX">
      <path
         inkscape:connector-curvature="0"
         id="path907"
         style="font-style:normal;font-variant:normal;font-weight:bold;font-stretch:normal;font-family:'TeX Gyre Bonum';-inkscape-font-specification:'TeX Gyre Bonum Bold';text-align:center;text-anchor:middle;fill:#292f75;stroke:none;stroke-width:0.34664583"
         d="M 30.893676,74.133064 V 73.39298 c -0.478347,0 -0.640805,-0.153432 -1.064999,-0.622754 l -1.137203,-1.471144 c 0.938643,-0.21661 1.507245,-0.839364 1.507245,-1.669702 0,-1.317712 -1.173305,-1.642627 -2.68055,-1.642627 h -3.510888 v 0.740085 l 0.180508,0.01805 c 0.505424,0.05415 0.613729,0.180509 0.613729,0.758136 v 3.11377 c 0,0.577627 -0.108305,0.703982 -0.613729,0.758135 l -0.180508,0.01805 v 0.740084 h 3.167922 V 73.39298 l -0.180508,-0.01805 c -0.505424,-0.05415 -0.613729,-0.180508 -0.613729,-0.758135 v -1.128178 h 0.469322 l 1.949491,2.644448 z m -2.536143,-4.41343 c 0,0.361017 -0.189534,0.911567 -1.335762,0.911567 h -0.640805 v -1.407965 c 0,-0.19856 0,-0.397119 0.694958,-0.397119 0.523474,0 1.281609,0.0722 1.281609,0.893517 z" />
      <path
         inkscape:connector-curvature="0"
         id="path909"
         style="font-style:normal;font-variant:normal;font-weight:bold;font-stretch:normal;font-family:'TeX Gyre Bonum';-inkscape-font-specification:'TeX Gyre Bonum Bold';text-align:center;text-anchor:middle;fill:#292f75;stroke:none;stroke-width:0.34664583"
         d="M 37.746649,74.133064 V 73.39298 l -0.144406,-0.01805 c -0.478348,-0.09025 -0.550551,-0.261737 -0.893517,-0.983771 l -1.768982,-4.404405 h -1.39894 l -1.787034,4.287075 c -0.351991,0.839364 -0.55055,1.037923 -1.055974,1.101101 l -0.144406,0.01805 v 0.740084 h 2.788854 V 73.39298 l -0.144406,-0.01805 c -0.424195,-0.05415 -0.667881,-0.11733 -0.667881,-0.379068 0,-0.0722 0.0361,-0.153432 0.08123,-0.270762 l 0.288814,-0.776186 h 1.940465 l 0.270763,0.76716 c 0.05415,0.162458 0.08123,0.270763 0.09025,0.370043 0,0.180508 -0.135381,0.261737 -0.523474,0.288813 l -0.225636,0.01805 v 0.740084 z m -3.204024,-2.951312 h -1.353813 l 0.685932,-1.759957 z" />
      <path
         inkscape:connector-curvature="0"
         id="path911"
         style="font-style:normal;font-variant:normal;font-weight:bold;font-stretch:normal;font-family:'TeX Gyre Bonum';-inkscape-font-specification:'TeX Gyre Bonum Bold';text-align:center;text-anchor:middle;fill:#292f75;stroke:none;stroke-width:0.34664583"
         d="m 45.703826,68.726838 v -0.740085 h -2.716651 v 0.740085 l 0.11733,0.01805 c 0.41517,0 0.667881,0.126356 0.667881,0.433221 0,0.04513 0,0.09025 -0.009,0.135381 l -0.875466,2.960338 -0.830338,-2.987414 c -0.02708,-0.09928 -0.0361,-0.180509 -0.0361,-0.243687 0,-0.189534 0.108305,-0.252711 0.406144,-0.288813 l 0.21661,-0.02708 v -0.740085 h -2.815931 v 0.740085 c 0.324915,0.009 0.43322,0.108305 0.577627,0.496398 l 0.297839,0.821313 -0.703983,2.166101 -0.785212,-2.951313 c -0.02708,-0.09928 -0.04513,-0.189533 -0.04513,-0.261737 0,-0.162457 0.09025,-0.252712 0.379068,-0.270762 v -0.740085 h -2.716652 v 0.740085 c 0.424195,0.01805 0.586653,0.198559 0.758136,0.740084 l 1.480169,4.666142 h 1.164279 l 0.893516,-2.806905 0.839364,2.806905 h 1.182331 l 1.407965,-4.332201 c 0.279788,-0.857415 0.397119,-0.974746 1.001822,-1.055975 z" />
      <path
         inkscape:connector-curvature="0"
         id="path913"
         style="font-style:normal;font-variant:normal;font-weight:bold;font-stretch:normal;font-family:'TeX Gyre Bonum';-inkscape-font-specification:'TeX Gyre Bonum Bold';text-align:center;text-anchor:middle;fill:#292f75;stroke:none;stroke-width:0.34664583"
         d="M 52.55821,74.133064 V 73.39298 c -0.478347,0 -0.640805,-0.153432 -1.065,-0.622754 l -1.137203,-1.471144 c 0.938644,-0.21661 1.507246,-0.839364 1.507246,-1.669702 0,-1.317712 -1.173305,-1.642627 -2.68055,-1.642627 h -3.510889 v 0.740085 l 0.180509,0.01805 c 0.505423,0.05415 0.613728,0.180509 0.613728,0.758136 v 3.11377 c 0,0.577627 -0.108305,0.703982 -0.613728,0.758135 l -0.180509,0.01805 v 0.740084 h 3.167923 V 73.39298 L 48.659228,73.37493 C 48.153805,73.320776 48.0455,73.194421 48.0455,72.616794 v -1.128178 h 0.469322 l 1.94949,2.644448 z m -2.536143,-4.41343 c 0,0.361017 -0.189534,0.911567 -1.335762,0.911567 H 48.0455 v -1.407965 c 0,-0.19856 0,-0.397119 0.694957,-0.397119 0.523475,0 1.28161,0.0722 1.28161,0.893517 z" />
      <path
         inkscape:connector-curvature="0"
         id="path915"
         style="font-style:normal;font-variant:normal;font-weight:bold;font-stretch:normal;font-family:'TeX Gyre Bonum';-inkscape-font-specification:'TeX Gyre Bonum Bold';text-align:center;text-anchor:middle;fill:#292f75;stroke:none;stroke-width:0.34664583"
         d="m 58.553768,71.985014 -0.622754,-0.33394 c -0.613728,1.092076 -1.407965,1.669702 -2.301482,1.669702 -0.550551,0 -0.550551,-0.108305 -0.550551,-0.821313 v -2.996439 c 0,-0.577627 0.108305,-0.703983 0.613729,-0.758136 l 0.180508,-0.01805 v -0.740085 h -3.167922 v 0.740085 l 0.180508,0.01805 c 0.505424,0.05415 0.613729,0.180509 0.613729,0.758136 v 3.11377 c 0,0.577627 -0.108305,0.703982 -0.613729,0.758135 l -0.180508,0.01805 v 0.740084 h 4.909828 z" />
      <path
         inkscape:connector-curvature="0"
         id="path917"
         style="font-style:normal;font-variant:normal;font-weight:bold;font-stretch:normal;font-family:'TeX Gyre Bonum';-inkscape-font-specification:'TeX Gyre Bonum Bold';text-align:center;text-anchor:middle;fill:#292f75;stroke:none;stroke-width:0.34664583"
         d="m 64.841104,72.003065 -0.63178,-0.297839 c -0.785211,1.128178 -1.570423,1.61555 -2.599321,1.61555 -0.74911,0 -0.74911,-0.108305 -0.74911,-1.019872 v -1.065 h 0.252712 c 0.523474,0 0.812288,0.08123 0.929618,0.992797 h 0.703983 v -2.806906 h -0.703983 c -0.01805,0.956694 -0.261737,0.983771 -0.920593,0.983771 h -0.261737 v -0.767161 c 0,-0.631779 0,-0.839364 0.956695,-0.839364 0.794237,0 1.552372,0.478347 2.157075,1.353813 l 0.613729,-0.306864 -0.893517,-1.859237 h -5.207667 v 0.740085 l 0.180508,0.01805 c 0.505424,0.05415 0.613729,0.180509 0.613729,0.758136 v 3.11377 c 0,0.577627 -0.108305,0.703982 -0.613729,0.758135 l -0.180508,0.01805 v 0.740084 h 5.361099 z" />
      <path
         inkscape:connector-curvature="0"
         id="path919"
         style="font-style:normal;font-variant:normal;font-weight:bold;font-stretch:normal;font-family:'TeX Gyre Bonum';-inkscape-font-specification:'TeX Gyre Bonum Bold';text-align:center;text-anchor:middle;fill:#292f75;stroke:none;stroke-width:0.34664583"
         d="M 71.760919,74.133064 V 73.39298 l -0.225635,-0.01805 c -0.433221,-0.06318 -0.640805,-0.243686 -1.245508,-0.947669 l -1.218432,-1.588474 0.884491,-1.119152 c 0.478347,-0.613729 0.947669,-0.902542 1.588474,-0.992796 v -0.740085 h -2.824956 v 0.740085 h 0.144406 c 0.324915,0 0.43322,0.0722 0.43322,0.198559 0,0.0722 -0.0361,0.153432 -0.08123,0.252712 l -0.658856,0.929618 -0.667881,-0.947669 c -0.0722,-0.09928 -0.108305,-0.180509 -0.108305,-0.243687 0,-0.135381 0.189534,-0.171483 0.568601,-0.189533 v -0.740085 h -3.357456 v 0.740085 c 0.586652,0.05415 0.694957,0.153432 1.245508,0.893516 l 1.065,1.416991 -1.371864,1.687754 c -0.306865,0.379067 -0.722034,0.640805 -1.110127,0.667881 v 0.740084 h 2.79788 V 73.39298 l -0.225635,-0.01805 c -0.333941,-0.02708 -0.478347,-0.09928 -0.478347,-0.243686 0,-0.0722 0.04513,-0.180509 0.135381,-0.31589 l 0.776186,-1.119152 0.902542,1.272584 c 0.06318,0.09928 0.108305,0.162458 0.108305,0.21661 0,0.09928 -0.135381,0.162458 -0.424195,0.189534 l -0.180508,0.01805 v 0.740084 z" />
    </g>
    <path
       transform="rotate(-54,181.00151,330.94797)"
       id="hand_hours"
       style="fill:#3250b0;stroke-width:0.63955551"
       d="M 194.63483,330.94797 181.0015,226.21435 167.36819,330.94797 Z"
       inkscape:connector-curvature="0" />
    <ellipse
       ry="27.274374"
       rx="27.266636"
       id="circle1026"
       style="fill:#3250b0;stroke-width:0.63955551"
       cy="330.94791"
       cx="181.00151" />
    <ellipse
       ry="21.819498"
       rx="21.813309"
       id="circle1030"
       style="fill:#1d2848;stroke-width:0.63955551"
       cy="330.94791"
       cx="181.00151" />
    <path
       transform="rotate(60,181.00151,330.94797)"
       inkscape:transform-center-y="-69.81611"
       inkscape:transform-center-x="-1.5469796"
       id="hand_minutes"
       style="fill:#1d2848;stroke-width:0.63955551"
       d="M 191.90816,330.94797 181.0015,191.30315 170.09485,330.94797 Z"
       inkscape:connector-curvature="0" />
  </g>
  <g
     style="display:none"
     inkscape:label="rawrlex-text"
     id="layer10"
     inkscape:groupmode="layer">
    <text
       xml:space="preserve"
       style="font-style:normal;font-variant:normal;font-weight:normal;font-stretch:normal;font-size:34.12086487px;line-height:60.00000238%;font-family:'TeX Gyre Bonum';-inkscape-font-specification:'TeX Gyre Bonum';text-align:center;writing-mode:lr-tb;text-anchor:middle;display:inline;fill:#292f75;stroke:none;stroke-width:1.31050479;stroke-linecap:round;stroke-linejoin:round;stroke-miterlimit:4;stroke-dasharray:none"
       x="180.84462"
       y="280.12668"
       id="text903"
       transform="scale(0.99985818,1.0001418)"><tspan
         sodipodi:role="line"
         id="tspan901"
         x="180.84462"
         y="280.12668"
         style="font-style:normal;font-variant:normal;font-weight:bold;font-stretch:normal;font-family:'TeX Gyre Bonum';-inkscape-font-specification:'TeX Gyre Bonum Bold';text-align:center;text-anchor:middle;fill:#292f75;stroke:none;stroke-width:1.31050479">RAWRLEX</tspan></text>
  </g>
  <g
     style="display:inline"
     inkscape:label="durg"
     id="durg"
     inkscape:groupmode="layer">
    <g
       inkscape:label="wing b"
       id="layer4"
       inkscape:groupmode="layer">
      <path
         sodipodi:nodetypes="cssc"
         inkscape:connector-curvature="0"
         id="path874-3"
         d="m 454.6527,145.06488 c 16.32958,7.60155 23.09854,13.94208 26.4304,17.56955 3.33181,3.62749 0.0405,9.93027 -5.04266,6.06583 -5.08315,-3.86444 -12.19478,-8.68471 -23.75401,-13.32497"
         style="display:inline;fill:#3250b0;stroke:#1d2848;stroke-width:4.00106001;stroke-linecap:round;stroke-linejoin:round;stroke-miterlimit:4;stroke-dasharray:none" />
      <path
         sodipodi:nodetypes="cccsc"
         inkscape:connector-curvature="0"
         id="path906"
         d="m 486.57061,157.67499 c -14.4121,-1.57295 -16.42114,18.95837 -14.13657,27.92818 -57.88195,-47.39621 -234.7842,-132.890656 -234.7842,-132.890656 27.91153,-3.297959 74.01692,-4.312168 144.2725,36.867049 70.25559,41.179227 104.64827,68.095427 104.64827,68.095427 z"
         style="fill:#292f75;stroke:#1d2848;stroke-width:4.00106001;stroke-linecap:round;stroke-linejoin:round;stroke-miterlimit:4;stroke-dasharray:none" />
      <path
         sodipodi:nodetypes="ccsssscsscccc"
         inkscape:connector-curvature="0"
         id="path904"
         d="m 192.03369,45.396207 c 3.3823,-0.94216 13.66539,0.0728 16.58978,1.279039 19.02713,-1.961349 70.10563,-2.777509 103.87957,7.333678 77.34696,23.156023 113.50307,54.239726 173.87756,99.507296 5.517,4.13655 2.02395,11.2108 -4.1424,6.36895 C 452.65431,136.65579 416.1705,110.28304 377.99453,90.092233 329.68255,64.540631 279.24707,48.410606 243.14545,55.782853 c -1.7097,3.536219 78.35185,42.452087 80.44054,54.354257 2.08869,11.90215 -34.02198,9.09514 -43.73058,-4.42564 -9.70861,-13.520788 -29.62549,-38.74503 -58.32594,-43.171499 -16.75932,-3.121399 -28.03423,-6.296818 -29.20015,-9.305007 -1.16594,-3.008179 -0.29564,-7.838757 -0.29564,-7.838757 z"
         style="fill:#3250b0;stroke:#1d2848;stroke-width:4.00106001;stroke-linecap:round;stroke-linejoin:round;stroke-miterlimit:4;stroke-dasharray:none" />
      <path
         sodipodi:nodetypes="scss"
         inkscape:connector-curvature="0"
         id="path902"
         d="m 195.33047,46.012546 c -7.40707,-3.004279 -19.14409,3.383529 -23.10555,9.556097 10.71421,-1.116939 21.21374,0.89298 23.71524,-1.011079 2.59147,-1.97254 2.30104,-7.364438 -0.60969,-8.545018 z"
         style="fill:#3a3c3f;stroke:#292929;stroke-width:4.00106001;stroke-linecap:round;stroke-linejoin:round;stroke-miterlimit:4;stroke-dasharray:none" />
    </g>
    <g
       style="opacity:1"
       inkscape:label="body"
       id="layer5"
       inkscape:groupmode="layer">
      <path
         sodipodi:nodetypes="cssscscssscsc"
         inkscape:connector-curvature="0"
         id="path880"
         d="m 84.603173,183.99076 c 16.196277,-8.82057 29.109337,-18.33416 49.084667,-18.4668 21.77442,-0.14457 52.22175,1.98336 71.04311,4.37757 20.13956,2.5619 92.43637,26.37396 105.968,48.70143 8.69401,14.3453 40.82877,69.5373 44.31724,94.28102 5.12214,49.50715 -31.65606,120.45506 -88.67983,157.9959 -16.08996,10.59258 -43.53883,25.59326 -99.50665,23.8484 33.4944,17.81007 85.40323,12.21137 130.24327,-10.20554 87.1691,-43.57852 128.07151,-115.48542 133.13773,-199.9621 2.3891,-39.8365 -8.9284,-104.38276 -58.84261,-143.23121 C 321.45388,102.48098 235.94035,79.928946 196.72346,91.972482 151.91044,86.711894 75.787803,97.05712 53.738164,129.16185 41.923228,146.36463 36.893288,186.23168 84.603173,183.99076 Z"
         style="fill:#3250b0;stroke:none;stroke-width:4.00106001;stroke-linecap:round;stroke-linejoin:round;stroke-miterlimit:4;stroke-dasharray:none" />
      <path
         sodipodi:nodetypes="sccccscscccsss"
         inkscape:connector-curvature="0"
         id="path892"
         d="m 223.1264,88.726513 c -10.06857,-0.0538 -19.0501,0.98695 -26.40328,3.245109 C 152.02846,86.724924 76.194165,97.00383 53.918507,128.9092 l 20.420885,-4.81977 c 31.376428,-14.67421 75.142518,-27.975769 121.286378,-19.56854 40.95252,-4.02781 65.07564,-2.9915 83.71169,5.53835 18.63605,8.52985 126.03774,66.44926 134.76498,143.66162 0.40051,11.96985 3.88275,47.68954 -8.14697,87.98924 -13.34364,44.70159 -45.52471,95.91402 -116.81882,145.45229 0.64054,0.087 1.27907,0.16029 1.91778,0.23552 2.01733,-0.92876 4.0261,-1.87866 6.01777,-2.87437 C 384.24132,440.94486 425.14465,369.03648 430.21089,284.5598 432.60004,244.72331 421.28204,180.17779 371.36784,141.32934 330.81253,109.76497 266.75681,88.959273 223.1264,88.726513 Z"
         style="fill:#292f75;stroke:none;stroke-width:4.00106001;stroke-linecap:round;stroke-linejoin:round;stroke-miterlimit:4;stroke-dasharray:none" />
      <path
         style="fill:none;stroke:#1d2848;stroke-width:4.00106001;stroke-linecap:round;stroke-linejoin:round;stroke-miterlimit:4;stroke-dasharray:none"
         d="m 84.603173,183.99076 c 16.196277,-8.82057 29.109337,-18.33416 49.084667,-18.4668 21.77442,-0.14457 55.95256,-2.60264 74.77392,-0.20842 20.13955,2.5619 92.90325,35.19089 107.38202,55.20486 9.83172,13.59039 35.68394,67.61986 39.17241,92.36358 5.12214,49.50715 -31.65606,120.45506 -88.67983,157.9959 -16.08996,10.59258 -43.53883,25.59326 -99.50665,23.8484 33.4944,17.81007 85.40323,12.21137 130.24327,-10.20554 87.1691,-43.57852 128.07151,-115.48542 133.13773,-199.9621 2.3891,-39.8365 -8.9284,-104.38276 -58.84261,-143.23121 C 321.45388,102.48098 235.94035,79.928946 196.72346,91.972482 151.91044,86.711894 75.787803,97.05712 53.738164,129.16185 41.923228,146.36463 36.893288,186.23168 84.603173,183.99076 Z"
         id="path888"
         inkscape:connector-curvature="0"
         sodipodi:nodetypes="cssscscssscsc" />
      <path
         sodipodi:nodetypes="ccssscsccssssc"
         inkscape:connector-curvature="0"
         id="path897"
         d="m 105.58468,157.36978 c 0,0 -0.77053,11.31171 1.18985,20.60928 8.7429,-6.61731 20.66083,-11.5069 35.9771,-12.71757 25.18567,-1.99079 44.48007,4.26278 63.30142,6.65699 20.13956,2.5619 75.6468,15.21055 102.34674,51.70288 9.90467,13.53727 43.12746,64.51965 46.61593,89.26337 5.12214,49.50715 -31.65624,120.45507 -88.68,157.9959 -9.92151,6.53166 -24.17468,14.73393 -46.75753,19.65811 27.35108,-2.00482 52.46863,-18.28207 76.64445,-32.70524 31.63025,-18.87047 58.75145,-60.69536 72.07593,-105.77419 13.32447,-45.07879 2.76373,-95.07538 -18.10957,-128.45254 -20.87328,-33.37716 -73.21092,-53.17491 -91.41175,-59.48569 -18.20085,-6.31079 -58.72624,-7.17103 -79.92689,-15.95556 -8.2626,-3.42362 -52.15048,-6.64894 -73.26568,9.20426 z"
         style="fill:#c4d9f5;stroke:#1d2848;stroke-width:4.00106001;stroke-linecap:round;stroke-linejoin:round;stroke-miterlimit:4;stroke-dasharray:none" />
    </g>
    <g
       inkscape:label="arm f"
       id="layer6"
       inkscape:groupmode="layer">
      <path
         sodipodi:nodetypes="csc"
         inkscape:transform-center-y="39.641551"
         inkscape:transform-center-x="72.330013"
         style="fill:#3250b0;stroke:none;stroke-width:6.00159025;stroke-linecap:round;stroke-linejoin:round"
         d="m 217.26483,153.21286 c -17.71791,-7.42182 -34.52731,-2.18488 -40.49078,2.11268 -5.96347,4.29756 2.94686,10.7994 8.05428,11.49602"
         id="path879"
         inkscape:connector-curvature="0" />
      <path
         inkscape:transform-center-y="44.543187"
         inkscape:transform-center-x="86.725486"
         sodipodi:nodetypes="ccccc"
         inkscape:connector-curvature="0"
         id="path877"
         d="m 179.72665,154.0382 c -2.97319,3.52778 7.27316,7.9402 7.27316,7.9402 l -7.09887,3.58547 -5.59385,-8.41419 z"
         style="fill:#c4d9f5;stroke:none;stroke-width:6.00159025;stroke-linecap:round;stroke-linejoin:round" />
      <path
         inkscape:transform-center-y="24.069019"
         inkscape:transform-center-x="-15.089679"
         sodipodi:nodetypes="cccc"
         inkscape:connector-curvature="0"
         id="path858"
         d="m 312.4043,198.24324 c -0.5789,-8.08487 -24.48225,-61.99474 -45.67761,-66.51774 l -27.24111,5.86284 c -3.24977,9.19954 17.87307,37.43858 23.95434,41.11829"
         style="fill:#3250b0;stroke:none;stroke-width:6.00159025;stroke-linecap:round;stroke-linejoin:round" />
      <path
         inkscape:transform-center-y="39.885629"
         inkscape:transform-center-x="72.037169"
         sodipodi:nodetypes="csc"
         inkscape:connector-curvature="0"
         id="path865"
         d="m 217.26483,153.21286 c -17.71791,-7.42182 -34.86233,-4.06903 -40.49078,2.11268 -4.14242,4.54961 1.84133,11.25776 6.94876,11.95437"
         style="fill:none;stroke:#1d2848;stroke-width:4.00106001;stroke-linecap:round;stroke-linejoin:round;stroke-miterlimit:4;stroke-dasharray:none" />
      <path
         inkscape:original-d="m 239.91567,138.25496 c -2.71164,9.37237 16.7875,37.27527 23.07162,40.59648"
         inkscape:path-effect="#path-effect871"
         sodipodi:nodetypes="cc"
         inkscape:transform-center-y="17.740782"
         inkscape:transform-center-x="9.4433154"
         inkscape:connector-curvature="0"
         id="path863"
         d="m 248.23184,157.20195 c -2.4554,-4.22485 -4.21328,-7.03293 -6.00143,-10.72613 -1.21827,-2.67779 -1.88465,-3.99465 -2.21298,-5.81102 -0.26579,-1.47044 -0.10176,-2.40984 -0.10176,-2.40984 0,0 -0.49385,0.80979 -0.71254,2.42257 -0.24101,1.77734 -0.0461,3.87561 0.66799,6.63148 0.91544,3.8394 2.55108,7.88193 4.9051,11.90756 5.36087,9.19539 12.53136,18.34694 16.62846,21.01915 0.3686,0.24188 1.58261,-1.38428 1.58261,-1.38428 0,0 0.7118,-1.89557 0.60257,-1.9661 -3.17578,-2.0713 -10.10032,-10.66497 -15.35802,-19.68339 z"
         style="fill:#1d2848;fill-rule:nonzero;stroke:none;stroke-width:6.00159025;stroke-linecap:round;stroke-linejoin:round" />
      <path
         inkscape:transform-center-y="52.797265"
         inkscape:transform-center-x="19.916619"
         sodipodi:nodetypes="ssccsscccccs"
         inkscape:connector-curvature="0"
         id="path854"
         d="m 215.23327,154.18763 c -3.86612,-0.51112 -7.28607,-0.77192 -10.18721,-0.8502 -15.47271,-0.41754 -32.17065,17.68174 -32.54892,22.66759 -0.37382,4.92674 9.31169,6.76339 18.61029,5.19602 -0.97318,1.86536 -1.57873,3.65601 -1.80764,5.26302 -0.80343,5.64042 12.24917,10.11267 18.0512,7.17185 5.80202,-2.94082 10.26541,-14.20361 15.69786,-16.61788 10.20881,0.52171 62.90409,30.24108 79.78335,32.18493 8.87977,0.60024 10.15102,-2.87485 9.57213,-10.95973 l -18.43557,-17.56054 -8.97018,-1.47698 c -27.39023,-17.14647 -53.01203,-22.80394 -69.76531,-25.01808 z"
         style="fill:#3250b0;stroke:none;stroke-width:6.00159025;stroke-linecap:round;stroke-linejoin:round" />
      <path
         inkscape:transform-center-y="58.883133"
         inkscape:transform-center-x="79.682308"
         sodipodi:nodetypes="scccscs"
         inkscape:connector-curvature="0"
         id="path881"
         d="m 181.29296,173.77985 c 2.41737,2.20751 7.64906,1.97849 10.40692,1.46368 l 4.23588,-0.79087 c -3.48191,4.36422 -9.45168,8.56821 -13.53784,7.21641 -4.08618,-1.3518 -9.07785,-2.56234 -8.64817,-5.5788 0.42969,-3.01647 6.27659,-7.18711 6.27659,-7.18711 -0.50585,1.99469 -0.0291,3.69362 1.26662,4.87669 z"
         style="fill:#c4d9f5;stroke:none;stroke-width:6.00159025;stroke-linecap:round;stroke-linejoin:round" />
      <path
         inkscape:transform-center-y="47.498197"
         inkscape:transform-center-x="36.638661"
         inkscape:original-d="m 284.41859,179.48457 c -33.46777,-21.70526 -60.32054,-26.83407 -75.79328,-27.25161 -15.47271,-0.41754 -35.74973,18.7872 -36.12801,23.77305 -0.37828,4.98585 9.19988,6.76398 18.59912,5.09494"
         inkscape:path-effect="#path-effect873"
         sodipodi:nodetypes="cscc"
         inkscape:connector-curvature="0"
         id="path859"
         d="m 267.07249,171.59373 c 8.28287,4.37702 17.3461,7.89084 17.3461,7.89084 0,0 -6.8984,-6.89324 -15.47711,-11.42734 -26.08924,-13.78781 -47.09252,-17.46815 -60.26222,-17.82354 -16.01565,-0.43219 -37.67706,19.04176 -38.17623,25.62101 -0.52808,6.9603 10.26356,8.79029 19.64508,7.42505 0.67635,-0.0984 0.94831,-2.1788 0.94831,-2.1788 0,0 -0.96116,-1.86146 -1.52434,-1.7795 -8.56468,1.24636 -15.26707,-0.7053 -15.08051,-3.16413 0.25665,-3.3827 19.15334,-22.32789 34.07979,-21.92509 12.53497,0.33826 32.94009,3.85284 58.50113,17.3615 z"
         style="fill:#1d2848;fill-rule:nonzero;stroke:none;stroke-width:6.00159025;stroke-linecap:round;stroke-linejoin:round" />
      <path
         inkscape:transform-center-y="59.550113"
         inkscape:transform-center-x="49.099844"
         sodipodi:nodetypes="csscscccc"
         inkscape:connector-curvature="0"
         id="path883"
         d="m 193.58361,180.3077 c 0.94727,6.52399 5.01921,10.24053 13.32844,5.71197 4.71171,-2.5679 7.46211,-13.72255 15.91394,-15.4921 4.76525,-0.9977 14.90936,5.66541 16.7094,10.02825 -7.87989,-2.0494 -14.78765,-6.25254 -17.55456,-3.44509 -2.76691,2.80743 -10.40641,16.49153 -16.11571,16.73579 -5.70929,0.24426 -17.52021,-2.58429 -16.61698,-7.22841 0.90316,-4.64414 4.33546,-6.31039 4.33546,-6.31039 z"
         style="fill:#c4d9f5;stroke:none;stroke-width:6.00159025;stroke-linecap:round;stroke-linejoin:round" />
      <path
         inkscape:transform-center-y="32.71999"
         inkscape:transform-center-x="10.685486"
         inkscape:original-d="m 205.98634,167.31218 c -10.62446,5.64559 -15.8825,13.51049 -16.68594,19.15092 -0.80343,5.64043 12.24955,10.11356 18.05158,7.17273 5.80202,-2.94081 10.2651,-14.20298 15.69755,-16.61725 10.20882,0.5217 62.90313,30.24052 79.78239,32.18437 8.87977,0.60025 10.15128,-2.87483 9.57238,-10.95971 -0.5789,-8.08487 -20.63273,-59.39161 -45.67761,-66.51774"
         inkscape:path-effect="#path-effect869"
         sodipodi:nodetypes="csscccc"
         inkscape:connector-curvature="0"
         id="path861"
         d="m 193.56301,180.89694 c 2.34985,-3.90105 5.20952,-7.06576 7.90372,-9.62833 2.57923,-2.45322 4.51961,-3.95643 4.51961,-3.95643 0,0 -2.38238,0.58415 -5.68482,2.32048 -3.35877,1.76595 -7.37897,4.68281 -10.15322,9.18107 -1.54338,2.52985 -2.49963,5.06268 -2.82791,7.36733 -1.08998,7.65209 13.97524,12.76675 20.93579,9.2387 6.16237,-3.12345 10.55553,-13.78414 15.17725,-16.35885 10.7296,1.37687 62.21973,30.17692 79.16968,32.12891 a 2,2 0 0 0 0.0939,0.009 c 10.55593,0.71355 12.33729,-4.2278 11.70216,-13.098 -0.5207,-7.27211 -13.77652,-41.68588 -31.98434,-58.94817 -3.31349,-3.17583 -7.01957,-5.24002 -10.32513,-6.35108 -3.16352,-1.06333 -5.36303,-1.07565 -5.36303,-1.07565 0,0 1.95735,0.99871 4.45028,2.84642 2.94517,2.18289 5.07824,4.28985 8.48583,7.48311 17.74274,16.82136 30.34107,50.66737 30.74661,56.33105 0.52111,7.27781 -0.2475,9.29861 -7.39489,8.82462 -16.5872,-1.95418 -69.00496,-31.63464 -79.86292,-32.18951 a 2,2 0 0 0 -0.9143,0.16975 c -6.08415,2.70389 -10.5379,13.99912 -15.78953,16.66096 -4.59935,2.33124 -15.67332,-1.55465 -15.16736,-5.10676 0.23883,-1.67662 0.95935,-3.67919 2.2826,-5.8482 z"
         style="fill:#1d2848;fill-rule:nonzero;stroke:none;stroke-width:6.00159025;stroke-linecap:round;stroke-linejoin:round" />
    </g>
    <g
       inkscape:label="wing f"
       id="layer7"
       inkscape:groupmode="layer">
      <path
         sodipodi:nodetypes="ccsccccc"
         style="fill:#292f75;stroke:none;stroke-width:4.00106001;stroke-linecap:round;stroke-linejoin:round;stroke-miterlimit:4;stroke-dasharray:none"
         d="m 499.45556,226.885 c -25.95783,-20.00298 -90.21575,-61.12783 -114.54187,-41.88524 -0.33609,14.82551 -30.17426,21.3359 -40.53688,-6.8573 -9.03659,-24.58549 -32.84074,-34.49676 -53.15978,-46.49408 -4.86997,-12.3782 45.46656,3.56868 45.46656,3.56868 L 300.45153,88.942403 345.06782,97.0149 c 0,0 130.51453,92.72291 154.38774,129.8701 z"
         id="path878"
         inkscape:connector-curvature="0" />
      <path
         sodipodi:nodetypes="cc"
         inkscape:connector-curvature="0"
         id="path876"
         d="M 499.45556,226.885 C 473.49773,206.88202 409.23981,165.75717 384.91369,184.99976"
         style="fill:none;stroke:#1d2848;stroke-width:4.00106001;stroke-linecap:round;stroke-linejoin:round;stroke-miterlimit:4;stroke-dasharray:none" />
      <path
         sodipodi:nodetypes="cssc"
         inkscape:connector-curvature="0"
         id="path874"
         d="m 482.82736,202.98804 c 16.45536,10.58473 19.59452,19.12932 21.9161,23.47363 2.32163,4.34432 -2.08208,8.94692 -6.04049,3.93605 -3.9584,-5.01089 -9.64273,-11.45363 -19.6789,-18.83212"
         style="fill:#3250b0;stroke:#1d2848;stroke-width:4.00106001;stroke-linecap:round;stroke-linejoin:round;stroke-miterlimit:4;stroke-dasharray:none" />
      <path
         inkscape:connector-curvature="0"
         id="path872"
         d="m 505.30967,213.17375 c -10.14221,12.36331 -12.60795,31.48405 -5.3454,52.35526 C 473.27381,225.42224 354.10766,92.019002 277.68851,69.425129 c -9.18763,-7.961368 5.6689,-7.465338 14.28225,-5.618718 113.65463,38.505929 213.33891,149.367339 213.33891,149.367339 z"
         style="fill:#292f75;stroke:#1d2848;stroke-width:4.00106001;stroke-linecap:round;stroke-linejoin:round;stroke-miterlimit:4;stroke-dasharray:none" />
      <path
         id="path867"
         style="fill:#3250b0;stroke:none;stroke-width:4.00106001;stroke-linecap:round;stroke-linejoin:round;stroke-miterlimit:4;stroke-dasharray:none"
         d="m 244.9638,102.89266 c 5.98707,-7.162219 25.13227,-6.684219 33.45363,-3.95033 10.29354,3.38184 20.08374,7.81561 34.55108,18.26208 -23.89704,-22.286739 -30.6274,-28.796057 -63.48558,-46.441591 -3.86883,-0.39851 -16.328,-2.81759 -18.73756,-5.342589 -2.40957,-2.524989 1.70933,-9.545537 3.28011,-9.831187 1.5708,-0.28565 10.57781,-1.402659 13.3817,-0.0919 8.63617,2.1e-4 18.82092,0.25306 27.69757,1.67212 37.42161,5.982388 77.94262,26.493862 117.98834,54.225437 40.96476,28.36802 87.62863,70.09525 115.19901,100.0534 3.19186,3.29165 1.17971,8.64029 -4.50795,5.00582 C 428.66742,145.87607 356.66059,84.478834 271.67006,61.902271 c 34.99057,13.757136 88.46653,50.057549 137.37082,94.142009 42.07218,37.92573 81.14101,82.3991 97.737,114.11539 l -5.26843,4.53921 C 464.53409,208.92714 329.62628,93.573911 264.73832,68.500699 c 23.59995,11.684057 49.86622,26.277522 69.09623,43.974571 17.10896,15.74508 18.90232,27.91193 14.68776,32.2654 -8.95161,9.24665 -72.11219,-13.52573 -88.5756,-24.67342"
         inkscape:connector-curvature="0"
         sodipodi:nodetypes="csccsccsscccscccssc" />
      <path
         inkscape:original-d="m 244.03018,104.45316 c 4.95941,-7.70055 24.0496,-8.202909 32.55701,-6.11929 12.15864,2.97786 22.43233,8.71309 36.89966,19.15956 -23.89704,-22.286739 -34.79089,-28.127047 -64.00392,-46.730611 -3.86883,-0.39851 -16.328,-2.81759 -18.73756,-5.342589 -2.40957,-2.524989 1.70933,-9.545537 3.28011,-9.831187 1.5708,-0.28565 10.57781,-1.402659 13.3817,-0.0919 8.63617,2.1e-4 18.82092,0.25306 27.69757,1.67212 37.42161,5.982388 77.94262,26.493862 117.98834,54.225437 40.96476,28.36802 87.81629,69.14768 115.38671,99.10582 3.19182,3.29165 0.99201,9.58787 -4.69565,5.9534 C 428.66742,145.87607 356.66059,84.478834 271.67006,61.902271 c 33.79701,13.287866 87.27723,50.074109 134.88175,92.317929 44.08154,39.11754 82.19347,81.07996 99.21814,115.68706 1.86048,3.78191 -4.55966,7.4487 -6.5757,3.86748 -16.20104,-28.77827 -52.56992,-70.58528 -94.83359,-108.71918 -48.51515,-43.77452 -104.3723,-82.969025 -139.24969,-96.433701 23.2273,11.562897 49.49357,26.156362 68.72358,43.853411 17.10896,15.74508 19.86207,27.47042 15.64751,31.82389 -8.95161,9.24664 -83.51373,-13.33291 -100.10987,-27.28819"
         inkscape:path-effect="#path-effect870"
         sodipodi:nodetypes="csccsccsscccsssscssc"
         inkscape:connector-curvature="0"
         d="m 253.03226,96.835038 c -3.06421,0.726627 -5.62843,2.414969 -7.22071,4.303282 -1.52166,1.80455 -1.78137,3.31484 -1.78137,3.31484 0,0 1.15588,-0.99103 2.9761,-1.7441 1.8378,-0.76034 4.47002,-1.23229 7.05782,-2.0094 7.43295,-1.984581 16.79971,-1.708438 22.04732,-0.4232 11.79474,2.88873 21.83027,8.45912 36.20461,18.83844 a 2,2 0 0 0 2.53489,-3.0841 C 290.81249,93.61219 279.72519,87.650706 250.55723,69.075848 a 2,2 0 0 0 -0.86937,-0.302503 c -3.74844,-0.386108 -15.69127,-2.843103 -17.49559,-4.733873 -0.76655,-0.803266 0.73244,-4.618504 2.15894,-6.239365 0.032,-0.03632 0.0627,-0.07016 0.0921,-0.101677 0.0265,-0.02837 0.0518,-0.05454 0.0758,-0.0787 0.0216,-0.02175 0.0419,-0.04157 0.061,-0.05968 0.0172,-0.0163 0.0331,-0.03091 0.0478,-0.04408 0.0133,-0.01185 0.0253,-0.02224 0.0362,-0.03142 0.0977,-0.08216 -0.28084,0.07222 -0.28085,0.07222 1.41289,-0.256933 10.07929,-1.228411 12.17689,-0.247827 a 2,2 0 0 0 0.84693,0.188198 c 8.60692,2.09e-4 18.65443,0.251832 27.3819,1.647043 37.06053,5.924664 77.22446,26.235716 117.16543,53.894754 40.88939,28.31582 87.55934,68.94044 115.0537,98.81593 a 2,2 0 0 0 0.0358,0.0379 c 1.20519,1.24289 1.72721,5.27657 -2.03237,2.97012 C 429.91345,144.31045 357.56922,82.650839 272.18353,59.969306 a 2,2 0 0 0 -1.24527,3.794272 c 33.54643,13.189348 86.74409,49.764232 134.28607,91.952552 44.03002,39.07182 81.84595,80.70999 98.75102,115.07397 0.7334,1.49082 -2.30924,3.29857 -3.03829,2.00351 C 484.62528,243.81862 448.02218,201.75694 405.70046,163.57066 357.1223,119.73928 300.98227,80.326374 265.83127,66.756071 a 2,2 0 0 0 -1.6116,3.656205 c 23.18043,11.53956 49.22899,26.020236 68.26054,43.534644 16.86816,15.52348 18.47081,25.95945 15.5649,28.96114 -0.83321,0.86067 -3.26695,1.53584 -7.39984,1.55093 -16.73483,0.0611 -52.35985,-10.14253 -74.52262,-20.18524 -4.17236,-1.90866 -8.44904,-3.40902 -11.57528,-4.76493 -3.11595,-1.35145 -5.17518,-2.49785 -5.17518,-2.49785 0,0 1.39531,1.90175 4.11986,4.19224 2.88121,2.4222 6.57721,4.73792 10.97965,6.71394 27.96878,12.67361 78.13161,26.36289 86.44731,17.77311 5.0903,-5.25807 2.10734,-16.92875 -12.27497,-31.36904 21.28226,15.41072 43.49122,33.37446 64.37682,52.21924 42.20562,38.08152 78.34028,79.63386 94.43057,108.2154 3.30304,5.86739 13.10068,0.34156 10.11312,-5.73144 C 490.42028,234.1742 452.01235,191.88753 407.87929,152.72427 370.85292,119.86741 330.14857,90.209459 297.86334,72.331745 371.06239,99.4664 435.36186,154.91031 502.41466,217.91148 a 2,2 0 0 0 0.29257,0.22774 c 7.3788,4.71512 12.28966,-3.79077 7.20839,-9.03097 l 0.0358,0.0379 C 482.30496,179.10538 435.27185,138.17068 394.23172,109.75046 354.08125,81.946348 313.20316,61.234452 275.42047,55.19434 c -8.8925,-1.421595 -19.04316,-1.689221 -27.62815,-1.697018 -3.80444,-1.350656 -12.46706,-0.177444 -14.12468,0.123993 -3.63043,0.660203 -7.61731,9.775938 -4.36917,13.179667 2.90332,3.042414 15.04433,5.363238 19.5011,5.897706 19.90354,12.66849 31.18738,19.354442 43.97413,29.455502 -5.18911,-2.555774 -10.25941,-4.427781 -15.71074,-5.762906 -5.72724,-1.402706 -16.1412,-1.662725 -24.0307,0.443754 z"
         style="fill:#1d2848;fill-rule:nonzero;stroke:none;stroke-width:4.00106001;stroke-linecap:round;stroke-linejoin:round;stroke-miterlimit:4;stroke-dasharray:none"
         id="path893" />
      <path
         inkscape:connector-curvature="0"
         id="path887"
         d="m 210.80996,63.527201 c 4.87082,-4.739779 19.86945,-8.361948 23.54646,-5.832118 3.677,2.529819 0.40502,7.717707 -3.38853,8.456737 -3.79353,0.73902 -15.10426,-2.873299 -20.15793,-2.624619 z"
         style="fill:#3a3c3f;stroke:#292929;stroke-width:4.00099993;stroke-linecap:round;stroke-linejoin:round;stroke-miterlimit:4;stroke-dasharray:none" />
    </g>
    <g
       inkscape:label="leg f"
       id="layer8"
       inkscape:groupmode="layer">
      <path
         style="fill:#3250b0;stroke:none;stroke-width:6.00159025;stroke-linecap:round;stroke-linejoin:round"
         d="m 370.32742,255.58348 c 6.09141,33.88177 -6.1703,63.43449 -25.47728,59.58461 -11.3099,-2.25523 -12.21659,-27.96375 -17.24713,-45.65801 -6.46389,-22.73588 -19.93755,-25.83445 -24.66973,-34.51518 -2.92642,-5.36823 -7.82933,-23.91213 7.99064,-23.91213 6.2927,0 14.40133,4.17992 20.86135,11.65967"
         id="path847"
         inkscape:connector-curvature="0"
         sodipodi:nodetypes="cssssc" />
      <path
         style="fill:#3250b0;stroke:none;stroke-width:6.00159025;stroke-linecap:round;stroke-linejoin:round"
         d="m 414.10323,253.72046 c -1.85507,-55.18105 -46.611,-99.33575 -67.57316,-93.19357 -27.43361,8.0384 -11.0786,101.63738 0.35575,123.96201"
         id="path849"
         inkscape:connector-curvature="0"
         sodipodi:nodetypes="csc" />
      <path
         sodipodi:nodetypes="csssssccc"
         inkscape:connector-curvature="0"
         id="path857"
         d="m 302.98034,218.21173 c 1.93091,17.47717 18.63882,24.47772 23.89206,32.70789 6.61082,10.35708 10.70303,27.82088 10.75464,39.44255 0.0242,5.43376 0.13118,13.99805 1.35179,21.62183 1.29249,8.07292 -5.38252,-2.11083 -6.3931,-12.11203 -1.73141,-17.13481 -3.27956,-32.9771 -9.03479,-41.2324 -9.11442,-13.07371 -18.01995,-16.93569 -20.18286,-22.80005 -5.08125,-10.57904 -0.38776,-17.62779 -0.38776,-17.62779 z"
         style="fill:#c4d9f5;stroke:none;stroke-width:6.00159025;stroke-linecap:round;stroke-linejoin:round" />
      <path
         inkscape:original-d="m 372.45418,245.97821 c 6.0914,33.88177 -8.05323,72.66087 -27.55364,69.95707 -15.14778,-2.1003 -12.26699,-28.73094 -17.29753,-46.4252 -6.46389,-22.73588 -19.93755,-25.83445 -24.66973,-34.51518 -2.92642,-5.36823 -7.82933,-23.91213 7.99064,-23.91213 6.2927,0 17.11153,5.73585 22.83438,13.97774"
         inkscape:path-effect="#path-effect851"
         sodipodi:nodetypes="cssssc"
         inkscape:connector-curvature="0"
         id="path845"
         d="m 375.28656,273.41187 c 0.78033,-7.13215 0.23629,-13.75883 -0.72708,-19.05633 -0.93189,-5.1244 -2.1053,-8.37733 -2.1053,-8.37733 0,0 0.188,3.45368 0.11265,8.54428 -0.0835,5.64156 -0.47276,11.26041 -1.25664,18.45523 -2.61327,23.93446 -13.56246,42.71973 -26.13497,40.97651 -13.28828,-1.84247 -10.45765,-26.73314 -15.64845,-44.99108 -6.58067,-23.14665 -20.52271,-27.01053 -24.83746,-34.92552 -2.28763,-4.19643 -7.49283,-20.95486 6.23461,-20.95486 5.28734,0 14.82868,4.78836 20.45654,12.11313 0.35565,0.46295 2.37784,-0.13539 2.37784,-0.13539 0,0 1.25625,-1.70015 0.79403,-2.30166 -6.13836,-7.9892 -16.88937,-13.67608 -23.62841,-13.67608 -17.86671,0 -13.2979,20.35501 -9.74667,26.8694 5.14961,9.44647 18.15489,11.77973 24.502,34.10484 4.8731,17.14051 1.97207,45.50573 18.94661,47.85932 16.04927,2.22529 27.95289,-19.7042 30.6607,-44.50446 z"
         style="fill:#1d2848;fill-rule:nonzero;stroke:none;stroke-width:6.00159025;stroke-linecap:round;stroke-linejoin:round" />
      <path
         inkscape:original-d="m 414.10323,253.72046 c -1.85507,-55.18105 -46.611,-99.33575 -67.57316,-93.19357 -27.43361,8.0384 -11.0786,101.63738 0.35575,123.96201"
         inkscape:path-effect="#path-effect855"
         sodipodi:nodetypes="csc"
         inkscape:connector-curvature="0"
         id="path843"
         d="m 406.47767,222.8798 c 2.65617,7.99763 4.45904,14.58836 5.82565,20.97485 1.25209,5.85135 1.79991,9.86581 1.79991,9.86581 0,0 0.45778,-4.02498 0.18354,-10.11934 -0.28388,-6.30864 -1.35955,-13.99987 -4.01316,-21.9826 -13.21599,-39.77474 -45.92654,-68.39633 -64.30592,-63.01093 -22.47672,6.58596 -17.9665,62.1078 -9.83,98.39826 1.34688,6.01089 3.14556,11.55914 5.07983,16.35528 2.75632,6.84708 5.6683,11.12777 5.6683,11.12777 0,0 -1.62774,-4.88754 -3.2436,-11.89145 -1.11119,-4.84151 -2.29854,-10.65905 -3.60143,-16.4667 -8.05949,-35.94699 -11.51583,-88.24404 7.05166,-93.68456 15.16008,-4.44209 46.44501,21.48884 59.38522,60.43361 z"
         style="fill:#1d2848;fill-rule:nonzero;stroke:none;stroke-width:6.00159025;stroke-linecap:round;stroke-linejoin:round" />
    </g>
    <g
       inkscape:label="face"
       id="layer9"
       inkscape:groupmode="layer">
      <path
         inkscape:transform-center-y="-79.146518"
         inkscape:transform-center-x="48.846152"
         sodipodi:nodetypes="cssc"
         inkscape:connector-curvature="0"
         id="path1503-6"
         d="M 42.688509,106.69125 C 51.942031,88.144313 84.267791,46.165096 94.985622,40.453908 98.488914,38.587139 100.1712,37.849599 98.503431,44.013447 96.561302,51.191295 74.361538,94.492841 69.58366,106.94456"
         style="fill:#3a3c3f;stroke:#292929;stroke-width:4.00106001;stroke-linecap:round;stroke-linejoin:round;stroke-miterlimit:4;stroke-dasharray:none" />
      <path
         inkscape:transform-center-y="-42.372876"
         inkscape:transform-center-x="64.471548"
         style="fill:#3250b0;stroke:#1d2848;stroke-width:4.00106001;stroke-linecap:round;stroke-linejoin:round;stroke-miterlimit:4;stroke-dasharray:none"
         d="m 69.719014,112.89299 c 0.370756,-1.38422 4.559659,-9.24112 6.047675,-14.4873 -3.136732,-3.062329 -19.642515,-5.824368 -26.407364,-5.328778 -1.598117,1.471439 -7.717543,12.252848 -9.080658,16.384268 -3.332581,8.13236 -5.455654,17.13653 -5.455654,17.13653"
         id="path1568-7"
         inkscape:connector-curvature="0"
         sodipodi:nodetypes="cccc" />
      <path
         inkscape:transform-center-y="35.313898"
         inkscape:transform-center-x="54.199386"
         style="fill:#c4d9f5;stroke:none;stroke-width:4.00106001;stroke-linecap:round;stroke-linejoin:round;stroke-miterlimit:4;stroke-dasharray:none"
         d="m 11.840104,219.15014 c 0.652521,4.94994 7.335744,9.99392 15.548264,11.83927 6.517771,1.46451 19.364342,-0.6341 27.947921,-5.02464 7.509178,-3.84099 15.989272,-15.89415 27.529478,-25.62714 8.175652,-6.89533 16.226009,-12.4666 26.195983,-16.91023 12.50398,-5.57302 12.17496,-31.39783 6.32062,-36.39259 -6.1298,-6.306 -20.216477,-3.60951 -20.175572,4.29539 0.04091,7.90491 -83.366694,67.81994 -83.366694,67.81994 z"
         id="path1552"
         inkscape:connector-curvature="0"
         sodipodi:nodetypes="csssscsc" />
      <path
         inkscape:transform-center-y="6.1672807"
         inkscape:transform-center-x="67.392682"
         id="path1564"
         style="fill:#3250b0;stroke:none;stroke-width:4.00106001;stroke-linecap:round;stroke-linejoin:round;stroke-miterlimit:4;stroke-dasharray:none"
         d="m 100.47612,101.66152 c 0,0 -16.63802,-8.630938 -36.692711,-0.55448 -20.054684,8.07646 -24.443897,19.47832 -30.722628,28.93991 -6.235653,11.48349 -9.181654,48.12523 -14.342976,53.51632 -6.066676,6.33679 -10.4581544,6.73996 -13.4702567,12.97939 -2.6845504,5.56093 0.5969992,17.69866 4.6390183,21.96549 6.5044024,1.10467 8.1624424,-2.18649 12.8783824,-2.5445 6.366544,-0.4833 12.35908,5.94285 25.203303,1.50944 10.154302,-3.50495 14.949503,-24.53904 22.111867,-31.29339 4.461818,-4.20767 12.772722,-6.74904 19.009632,-13.16029 6.079189,-6.24916 6.890007,-15.46973 6.117047,-21.68918"
         inkscape:connector-curvature="0"
         sodipodi:nodetypes="csccsccsccc" />
      <path
         inkscape:transform-center-y="-41.942824"
         inkscape:transform-center-x="57.689577"
         sodipodi:nodetypes="ssssss"
         inkscape:connector-curvature="0"
         id="path1548"
         d="m 43.278812,115.67556 c -0.993973,2.11103 -1.284771,5.51751 1.425679,6.81273 3.857622,1.84341 11.274605,0.1614 13.614752,-3.54961 5.023005,-7.96548 7.397759,-11.14708 17.602308,-12.04496 10.20456,-0.89789 4.659113,-9.42424 -1.360303,-9.65184 -6.019419,-0.22763 -25.693857,6.56449 -31.282436,18.43368 z"
         style="fill:#292f75;stroke:none;stroke-width:4.00106001;stroke-linecap:round;stroke-linejoin:round;stroke-miterlimit:4;stroke-dasharray:none" />
      <path
         inkscape:transform-center-y="6.0135603"
         inkscape:transform-center-x="67.654589"
         inkscape:original-d="m 100.47612,101.66152 c 0,0 -16.63802,-8.630938 -36.692711,-0.55448 -20.054684,8.07646 -24.898298,19.19186 -30.722628,28.93991 -6.70224,11.21741 -9.181654,48.12523 -14.342976,53.51632 -6.066676,6.33679 -10.4581544,6.73996 -13.4702567,12.97939 -2.6845504,5.56093 0.5969992,17.69866 4.6390183,21.96549 6.5044024,1.10467 8.1624424,-2.18649 12.8783824,-2.5445 6.366544,-0.4833 11.907161,3.61584 24.751379,-0.81759 10.154305,-3.50494 15.401427,-22.21201 22.563791,-28.96637 4.461818,-4.20766 12.772722,-6.74903 19.009632,-13.16029 6.079189,-6.24916 6.890007,-15.46972 6.117047,-21.68918"
         inkscape:path-effect="#path-effect1566"
         sodipodi:nodetypes="csscsccsccc"
         inkscape:connector-curvature="0"
         d="m 97.78016,102.65628 c 0.944901,0.41625 2.69497,-0.99527 2.69497,-0.99527 0,0 -0.13973,-2.24402 -1.084634,-2.660266 l -0.06545,-0.0304 c -5.177023,-2.060923 -19.604337,-6.43769 -36.288773,0.281493 -20.78418,8.370247 -26.007461,20.254577 -31.692384,29.769297 -6.894594,11.53935 -9.550805,48.43788 -14.070757,53.15905 -5.838598,6.09856 -10.577438,6.76231 -13.8266956,13.49299 -3.07092751,6.36129 0.4808386,19.45239 4.9881799,24.21043 a 2,2 0 0 0 1.117073,0.59632 c 7.0307487,1.19406 9.3141387,-2.21451 13.3646447,-2.52201 5.662716,-0.42987 12.013006,3.64858 25.252546,-0.9213 11.03269,-3.80813 16.583361,-23.0835 23.283399,-29.40187 4.157101,-3.9203 12.616623,-6.58591 19.071043,-13.22076 1.718429,-1.76647 3.044993,-3.73637 4.056524,-5.79645 2.059052,-4.23448 2.269998,-8.64216 1.871519,-11.99736 -0.390772,-3.29032 -1.244571,-5.28995 -1.244571,-5.28995 0,0 -0.154963,2.1691 -0.760992,5.22171 -0.639483,3.22112 -1.679315,6.72445 -3.456476,10.3026 -0.843579,1.71803 -1.939029,3.33718 -3.333151,4.77028 -6.019403,6.18768 -14.181689,8.60481 -18.948223,13.09983 -7.624691,7.19035 -12.568264,25.32912 -21.844187,28.53087 -12.448893,4.29698 -17.179837,0.17715 -24.250214,0.71388 -5.16858,0.39237 -6.325591,3.33561 -11.705589,2.66821 -3.3271883,-4.13953 -6.0168104,-14.75628 -3.8593103,-19.22545 2.7749475,-5.74818 6.8190643,-5.89077 13.1138133,-12.46579 5.802697,-6.06101 8.105314,-42.97812 14.615199,-53.87359 5.963738,-9.98138 10.427685,-20.32785 29.752873,-28.11052 15.40307,-6.203152 28.689922,-2.11679 33.315066,-0.27556 z"
         style="fill:#1d2848;fill-rule:nonzero;stroke:none;stroke-width:4.00106001;stroke-linecap:round;stroke-linejoin:round;stroke-miterlimit:4;stroke-dasharray:none"
         id="path1558" />
      <path
         inkscape:transform-center-y="-74.663163"
         inkscape:transform-center-x="12.032519"
         sodipodi:nodetypes="cssc"
         inkscape:connector-curvature="0"
         id="path1503"
         d="M 72.257651,105.70998 C 85.219736,87.830283 126.52124,49.347945 138.78324,45.215687 c 4.008,-1.35068 5.90495,-1.83227 3.07662,4.355518 -3.29361,7.205718 -34.1822,48.845495 -41.37656,61.099665"
         style="fill:#3a3c3f;stroke:#292929;stroke-width:4.00106001;stroke-linecap:round;stroke-linejoin:round;stroke-miterlimit:4;stroke-dasharray:none" />
      <path
         inkscape:transform-center-y="-47.366986"
         inkscape:transform-center-x="31.930101"
         style="fill:#3250b0;stroke:none;stroke-width:4.00106001;stroke-linecap:round;stroke-linejoin:round;stroke-miterlimit:4;stroke-dasharray:none"
         d="m 69.426821,108.0477 c 2.021154,-3.85231 9.823187,-13.485639 11.640646,-14.675399 6.754653,0.61933 22.585333,6.048109 25.178313,9.582969 -2.32689,4.93155 -7.745642,11.99612 -8.338016,13.30092"
         id="path1568"
         inkscape:connector-curvature="0"
         sodipodi:nodetypes="cccc" />
      <path
         inkscape:transform-center-y="-47.638277"
         inkscape:transform-center-x="31.62757"
         inkscape:original-d="m 69.426821,108.0477 c 2.021154,-3.85231 9.823187,-13.485639 11.640646,-14.675399 6.754653,0.61933 22.585333,6.048109 25.178313,9.582969 -2.32689,4.93155 -7.745642,11.99612 -8.338016,13.30092"
         inkscape:path-effect="#path-effect1570"
         sodipodi:nodetypes="cccc"
         inkscape:connector-curvature="0"
         id="path1524"
         d="m 72.069111,100.62789 c -1.164938,1.51415 -1.907912,3.3217 -2.289193,4.85409 -0.373277,1.50021 -0.353097,2.56572 -0.353097,2.56572 0,0 0.872799,-0.61077 2.029459,-1.4775 1.121408,-0.84032 2.681218,-2.0477 3.792555,-3.51551 2.485073,-3.256074 5.194303,-6.427796 6.430052,-7.600344 6.248815,0.8354 18.472323,5.101684 22.128663,7.894734 -0.91319,1.71001 -2.0955,3.57838 -3.29312,5.38408 -0.958534,1.44554 -1.615233,3.1271 -2.029968,4.53679 -0.440343,1.56755 -0.576698,2.98624 -0.576698,2.98624 0,0 1.009241,-0.54622 2.439116,-1.71187 1.16,-0.89171 2.51108,-2.10803 3.501,-3.60026 1.51832,-2.28922 3.16897,-4.93609 4.20667,-7.13535 a 24.412973,24.412973 0 0 0 0.39797,-0.88898 4.1813851,4.1813851 0 0 0 -0.59409,-1.14741 C 104.72838,97.505302 88.247013,92.0222 81.25008,91.380655 a 18.722256,18.722256 0 0 0 -0.487676,-0.0383 2.7944075,2.7944075 0 0 0 -0.790352,0.356603 c -1.416967,0.927587 -4.981656,5.101307 -7.902941,8.928929 z"
         style="fill:#1d2848;fill-rule:nonzero;stroke:none;stroke-width:4.00106001;stroke-linecap:round;stroke-linejoin:round;stroke-miterlimit:4;stroke-dasharray:none" />
      <path
         inkscape:transform-center-y="39.755571"
         inkscape:transform-center-x="82.240818"
         inkscape:original-d="m 29.27117,199.46766 c -0.489345,-7.29542 4.153446,-9.80607 8.963002,-10.64462 4.809548,-0.83852 7.760062,-4.4171 7.760062,-4.4171"
         inkscape:path-effect="#path-effect1112"
         inkscape:connector-curvature="0"
         id="path1528"
         d="m 29.857996,190.8254 c -1.690393,2.0147 -1.838518,4.40235 -1.531125,6.06669 0.306909,1.66171 0.944299,2.57557 0.944299,2.57557 0,0 0.395258,-1.03921 1.057779,-2.33609 0.706668,-1.38329 1.50579,-2.62217 2.517837,-3.64776 0.665851,-0.7486 1.535308,-1.33462 2.569974,-1.78551 1.083037,-0.47647 2.2476,-0.87189 3.407786,-1.22449 0,0 1e-6,0 1e-6,0 4.331936,-3.02988 7.140493,-6.03591 7.169643,-6.06765 0,0 0,0 0,0 0,0 0,0 0,0 0,0 0,0 0,0 0,0 0,0 0,0 0,0 0,0 0,0 0,0 0,0 0,0 5.2e-5,-2.6e-4 4.4e-5,-2.2e-4 4.4e-5,-2.2e-4 0,0 3.1e-5,-10e-6 -1.85e-4,6e-5 0,0 0,0 0,0 0,0 0,0 0,0 0,0 0,0 0,0 0,0 0,0 0,0 0,0 0,0 0,0 0,0 0,0 0,0 -0.04641,0.0113 -4.268244,1.00694 -8.35025,2.76627 0,0 -1e-6,0 -1e-6,0 -1.260236,0.0693 -2.563427,0.31382 -3.825026,0.85909 -1.449826,0.63181 -2.832277,1.52529 -3.960776,2.79404 z"
         style="fill:#1d2848;fill-rule:nonzero;stroke:none;stroke-width:4.00106001;stroke-linecap:round;stroke-linejoin:round;stroke-miterlimit:4;stroke-dasharray:none" />
      <path
         inkscape:transform-center-y="37.325454"
         inkscape:transform-center-x="53.899859"
         inkscape:original-d="m 11.840104,219.15014 c 0.652521,4.94994 7.335744,9.99392 15.548264,11.83927 6.517771,1.46451 19.364342,-0.6341 27.947921,-5.02464 7.509178,-3.84099 15.989272,-15.89415 27.529478,-25.62714 8.175652,-6.89533 18.583393,-11.05151 27.588513,-17.50954 4.91256,-3.52304 8.19089,-9.04916 9.07877,-15.73148 1.12267,-8.45088 -0.77087,-17.4077 -4.1507,-20.06176"
         inkscape:path-effect="#path-effect1554"
         sodipodi:nodetypes="csssssc"
         inkscape:connector-curvature="0"
         id="path1530"
         d="m 13.875203,219.19883 c -0.01994,-0.0977 -2.035099,-0.0487 -2.035099,-0.0487 0,0 -1.9552983,0.50111 -1.8836921,0.85061 1.2049281,5.88819 8.6410711,11.06322 16.9934981,12.94001 6.991362,1.57092 20.468453,-0.67948 29.297159,-5.19541 7.992548,-4.08823 16.49439,-16.25255 27.908126,-25.87887 8.007311,-6.75335 18.328115,-10.86086 27.464645,-17.41313 4.69617,-3.36786 7.99712,-8.38075 9.40093,-14.38159 0.2103,-0.89939 0.36424,-1.80707 0.46534,-2.71567 0.5281,-4.72506 -0.0674,-9.08963 -1.20581,-12.7004 -0.61706,-1.96936 -1.35261,-3.53149 -2.15863,-4.7944 -1.37963,-2.19137 -2.73932,-2.82644 -2.73932,-2.82644 0,0 0.99975,1.06209 1.72526,3.30541 0.42722,1.35593 0.7106,2.85459 0.90437,4.7879 0.35092,3.56555 0.23677,7.42989 -0.43199,11.70897 -0.12328,0.78012 -0.27428,1.5554 -0.45406,2.32349 -1.1935,5.1018 -3.97214,9.27038 -7.83721,12.04221 -8.87371,6.36379 -19.368388,10.56864 -27.712381,17.60595 -11.666676,9.83966 -20.125022,21.78166 -27.150828,25.3754 -8.338454,4.26516 -20.554505,6.21198 -26.598677,4.85389 -7.575459,-1.70221 -13.190957,-6.12201 -13.951631,-9.83924 z"
         style="fill:#1d2848;fill-rule:nonzero;stroke:none;stroke-width:4.00106001;stroke-linecap:round;stroke-linejoin:round;stroke-miterlimit:4;stroke-dasharray:none" />
    </g>
    <g
       style="display:inline"
       inkscape:label="eyes closed"
       id="layer11"
       inkscape:groupmode="layer">
      <path
         inkscape:transform-center-y="5.0389266"
         inkscape:transform-center-x="-2.442604"
         sodipodi:nodetypes="cssssc"
         inkscape:connector-curvature="0"
         id="path1492"
         d="m 81.344253,134.67218 c 1.493418,9.74531 -2.982107,21.48148 -12.082543,25.4812 -8.24743,3.62483 -15.158449,1.61946 -16.781385,-0.73841 -1.790337,-2.60108 -0.274025,-4.65209 1.151287,-5.03718 3.950655,-1.06741 4.682537,2.66794 11.664916,0.82646 7.952849,-2.09743 13.537311,-11.42047 16.047725,-20.53207 z"
         style="fill:#1d2848;stroke-width:4.00099993;stroke-linecap:round;stroke-linejoin:round;stroke-miterlimit:4;stroke-dasharray:none" />
      <path
         inkscape:transform-center-y="6.9355259"
         inkscape:transform-center-x="3.5607485"
         style="fill:#1d2848;stroke-width:4.00099993;stroke-linecap:round;stroke-linejoin:round;stroke-miterlimit:4;stroke-dasharray:none"
         d="m 23.873043,159.0008 c 5.079932,4.03569 8.414779,3.53075 10.602878,2.65215 3.116987,-1.25158 3.329581,-4.57665 0.879617,-5.65312 -2.480487,-1.08988 -4.176877,2.2175 -8.377497,-0.89603 -0.726088,-0.53818 -1.313805,-1.17327 -1.746425,-1.87091 0,0 -2.056454,5.21349 -1.358573,5.76791 z"
         id="path1494"
         inkscape:connector-curvature="0"
         sodipodi:nodetypes="sssscs" />
    </g>
    <g
       style="display:inline"
       inkscape:label="eyes open"
       id="eyes"
       inkscape:groupmode="layer">
      <path
         inkscape:transform-center-y="-8.3314474"
         inkscape:transform-center-x="56.73178"
         sodipodi:nodetypes="sssss"
         inkscape:connector-curvature="0"
         id="path1500"
         d="m 47.202979,138.44835 c 4.35123,-9.41806 15.214778,-15.06812 25.112208,-10.15985 11.449389,5.6779 9.312993,17.57981 3.866555,24.64126 -5.446439,7.06144 -14.342115,11.03249 -23.633348,6.08653 -9.291222,-4.94595 -7.514849,-15.8723 -5.345415,-20.56794 z"
         style="display:inline;fill:#ffffff;stroke:#000000;stroke-width:4.00106;stroke-linecap:round;stroke-linejoin:round;stroke-miterlimit:4;stroke-dasharray:none" />
      <path
         inkscape:transform-center-y="-6.1159785"
         inkscape:transform-center-x="58.528979"
         sodipodi:nodetypes="sssss"
         inkscape:connector-curvature="0"
         id="path1498"
         d="m 66.423916,146.77673 c -0.44952,2.8375 -2.563558,6.29324 -5.974885,5.82781 -3.411323,-0.46543 -4.777375,-4.61356 -4.417359,-7.24568 0.31987,-2.3383 2.611816,-6.30319 6.023143,-5.83776 3.411326,0.46544 4.796441,4.55826 4.369101,7.25563 z"
         style="display:inline;fill:#f01d0a;stroke:none;stroke-width:6.00159;stroke-linecap:round;stroke-linejoin:round" />
      <path
         inkscape:transform-center-y="-5.5132849"
         inkscape:transform-center-x="90.00451"
         sodipodi:nodetypes="sssss"
         inkscape:connector-curvature="0"
         id="path1534"
         d="m 38.778579,131.63994 c -8.654777,-4.35266 -18.286811,1.72182 -21.90039,10.32864 -3.613595,8.60686 -0.652404,18.32412 7.514693,20.72571 8.167102,2.40158 16.188598,-5.21564 19.021383,-15.01652 1.809187,-6.25942 0.379776,-13.51544 -4.635686,-16.03783 z"
         style="display:inline;fill:#ffffff;stroke:#000000;stroke-width:4.00106;stroke-linecap:round;stroke-linejoin:round;stroke-miterlimit:4;stroke-dasharray:none" />
      <path
         inkscape:transform-center-y="-5.5812427"
         inkscape:transform-center-x="89.401845"
         sodipodi:nodetypes="sssss"
         inkscape:connector-curvature="0"
         id="path1532"
         d="m 30.402793,140.32975 c -1.780667,-0.0409 -4.133065,2.33522 -4.435262,5.71391 -0.307648,3.43976 1.16863,6.82209 3.967366,6.82705 2.500275,0.005 4.51465,-3.112 4.785179,-5.33202 0.407878,-3.34698 -0.664658,-7.12548 -4.317283,-7.20894 z"
         style="display:inline;fill:#f01d0a;stroke:none;stroke-width:4.00106;stroke-linecap:round;stroke-linejoin:round;stroke-miterlimit:4;stroke-dasharray:none" />
    </g>
  </g>
</svg>
