<?xml version="1.0" encoding="UTF-8" standalone="no"?>
<!-- Created with Inkscape (http://www.inkscape.org/) -->

<svg
   width="512"
   height="512"
   viewBox="0 0 512 512"
   version="1.1"
   id="svg4575"
   inkscape:version="1.1.2 (0a00cf5339, 2022-02-04)"
   sodipodi:docname="certificate.svg"
   inkscape:export-filename="../stickers/certificate.png"
   inkscape:export-xdpi="96"
   inkscape:export-ydpi="96"
   xmlns:inkscape="http://www.inkscape.org/namespaces/inkscape"
   xmlns:sodipodi="http://sodipodi.sourceforge.net/DTD/sodipodi-0.dtd"
   xmlns="http://www.w3.org/2000/svg"
   xmlns:svg="http://www.w3.org/2000/svg"
   xmlns:rdf="http://www.w3.org/1999/02/22-rdf-syntax-ns#"
   xmlns:cc="http://creativecommons.org/ns#"
   xmlns:dc="http://purl.org/dc/elements/1.1/">
  <defs
     id="defs4569">
    <inkscape:path-effect
       effect="powerstroke"
       id="path-effect87577"
       is_visible="true"
       lpeversion="1"
       offset_points="0.2,20 | 0.45339882,20.101045 | 0.64789244,13.871785"
       not_jump="false"
       sort_points="true"
       interpolator_type="CentripetalCatmullRom"
       interpolator_beta="0.2"
       start_linecap_type="round"
       linejoin_type="round"
       miter_limit="4"
       scale_width="1"
       end_linecap_type="zerowidth" />
    <inkscape:path-effect
       effect="powerstroke"
       id="path-effect87255"
       is_visible="true"
       lpeversion="1"
       offset_points="0.10618706,7.5460756 | 1.5,20 | 2.1413486,17.365891"
       not_jump="false"
       sort_points="true"
       interpolator_type="CentripetalCatmullRom"
       interpolator_beta="0.2"
       start_linecap_type="round"
       linejoin_type="round"
       miter_limit="4"
       scale_width="1"
       end_linecap_type="zerowidth" />
    <inkscape:path-effect
       effect="powerstroke"
       id="path-effect87218"
       is_visible="true"
       lpeversion="1"
       offset_points="0.2,20 | 1,20 | 1.5436692,12.873797"
       not_jump="false"
       sort_points="true"
       interpolator_type="CentripetalCatmullRom"
       interpolator_beta="0.2"
       start_linecap_type="round"
       linejoin_type="round"
       miter_limit="4"
       scale_width="1"
       end_linecap_type="zerowidth" />
    <inkscape:path-effect
       effect="powerstroke"
       id="path-effect86934"
       is_visible="true"
       lpeversion="1"
       offset_points="0.2,20 | 1,20 | 1.6159818,18.441166"
       not_jump="false"
       sort_points="true"
       interpolator_type="CentripetalCatmullRom"
       interpolator_beta="0.2"
       start_linecap_type="round"
       linejoin_type="round"
       miter_limit="4"
       scale_width="1"
       end_linecap_type="zerowidth" />
    <inkscape:path-effect
       effect="powerstroke"
       id="path-effect85833"
       is_visible="true"
       lpeversion="1"
       offset_points="0.10481039,9.4663601 | 1.5,20 | 2.1432707,19.347482"
       not_jump="false"
       sort_points="true"
       interpolator_type="CentripetalCatmullRom"
       interpolator_beta="0.2"
       start_linecap_type="round"
       linejoin_type="round"
       miter_limit="4"
       scale_width="1"
       end_linecap_type="zerowidth" />
    <inkscape:path-effect
       effect="powerstroke"
       id="path-effect85469"
       is_visible="true"
       lpeversion="1"
       offset_points="0.21891677,21.799258 | 1.4801682,20.553477 | 2.1422445,21.875796"
       not_jump="false"
       sort_points="true"
       interpolator_type="CentripetalCatmullRom"
       interpolator_beta="0.2"
       start_linecap_type="round"
       linejoin_type="round"
       miter_limit="4"
       scale_width="1"
       end_linecap_type="zerowidth" />
    <inkscape:path-effect
       effect="powerstroke"
       id="path-effect85399"
       is_visible="true"
       lpeversion="1"
       offset_points="0.2,20 | 1,20 | 1.8021428,18.520205"
       not_jump="false"
       sort_points="true"
       interpolator_type="CentripetalCatmullRom"
       interpolator_beta="0.2"
       start_linecap_type="round"
       linejoin_type="round"
       miter_limit="4"
       scale_width="1"
       end_linecap_type="zerowidth" />
    <inkscape:path-effect
       effect="taper_stroke"
       id="path-effect81908"
       is_visible="true"
       lpeversion="1"
       stroke_width="40"
       attach_start="0.2"
       end_offset="0.2"
       start_smoothing="0.5"
       end_smoothing="0.5"
       jointype="extrapolated"
       start_shape="center"
       end_shape="center"
       miter_limit="100" />
    <inkscape:path-effect
       effect="fill_between_many"
       method="bsplinespiro"
       linkedpaths="#path76641,0,1"
       id="path-effect81910"
       join="true"
       close="true"
       autoreverse="true" />
  </defs>
  <sodipodi:namedview
     id="base"
     pagecolor="#ffffff"
     bordercolor="#666666"
     borderopacity="1.0"
     inkscape:pageopacity="0.0"
     inkscape:pageshadow="2"
     inkscape:zoom="1.6122035"
     inkscape:cx="125.91463"
     inkscape:cy="313.2359"
     inkscape:document-units="px"
     inkscape:current-layer="layer5"
     showgrid="false"
     units="px"
     inkscape:pagecheckerboard="true"
     inkscape:window-width="2408"
     inkscape:window-height="1411"
     inkscape:window-x="30"
     inkscape:window-y="0"
     inkscape:window-maximized="1"
     inkscape:document-rotation="0"
     borderlayer="true"
     inkscape:snap-global="false"
     showguides="true"
     inkscape:guide-bbox="true">
    <sodipodi:guide
       position="324.14952,265.62185"
       orientation="0.16579639,0.98616001"
       id="guide98624" />
  </sodipodi:namedview>
  <metadata
     id="metadata4572">
    <rdf:RDF>
      <cc:Work
         rdf:about="">
        <dc:format>image/svg+xml</dc:format>
        <dc:type
           rdf:resource="http://purl.org/dc/dcmitype/StillImage" />
      </cc:Work>
    </rdf:RDF>
  </metadata>
  <g
     inkscape:groupmode="layer"
     id="layer4"
     inkscape:label="body">
    <path
       id="path25414"
       style="fill:#3250b0;fill-opacity:1;stroke:#1d2848;stroke-width:4;stroke-linecap:round;stroke-linejoin:round;stroke-miterlimit:4;stroke-dasharray:none;stroke-opacity:1"
       d="m 519.1859,285.06493 c -8.0733,-0.16898 -37.8264,-11.17835 -53.75907,-10.25098 -21.29696,1.2396 -53.35921,6.89241 -71.75874,11.22934 l -22.3667,101.88808 c 27.28636,3.21044 82.54709,-9.4855 93.56212,-1.01387 7.25256,5.57792 17.58597,27.42986 12.26637,44.7213 l 168.36779,41.79235 z"
       sodipodi:nodetypes="csccsccc" />
    <path
       style="fill:#3250b0;fill-opacity:1;stroke:#1d2848;stroke-width:4;stroke-linecap:round;stroke-linejoin:round;stroke-miterlimit:4;stroke-dasharray:none;stroke-opacity:1"
       d="m 473.81299,345.91366 c 14.08126,21.29045 7.6351,70.79924 3.88014,83.64113 -3.75498,12.84189 -17.0853,85.3308 -19.46345,90.73795 -2.37815,5.40714 -22.53001,83.47222 -23.53133,95.30025 -1.00132,11.82801 242.26048,46.18559 253.27505,41.00383 11.01457,-5.18177 21.21589,-99.63712 18.58728,-121.20922 -2.6286,-21.57209 1.75233,-137.48692 4.25563,-150.77936"
       id="path24865"
       sodipodi:nodetypes="csssssc" />
    <path
       style="fill:#c4d9f5;fill-opacity:1;stroke:#1d2848;stroke-width:4;stroke-linecap:round;stroke-linejoin:round;stroke-miterlimit:4;stroke-dasharray:none;stroke-opacity:1"
       d="m 454.95694,633.125 c 18.45861,-86.67943 47.48633,-248.11506 81.42637,-297.95238 33.94005,-49.83732 107.62593,-62.96655 117.74831,-28.13396 10.12238,34.83259 18.90518,303.17742 3.42375,355.02426 C 642.07393,713.90975 454.95694,633.125 454.95694,633.125 Z"
       id="path26502" />
  </g>
  <g
     inkscape:groupmode="layer"
     id="layer3"
     inkscape:label="cert">
    <path
       style="fill:#e9d7bc;fill-opacity:1;stroke:#d8b98e;stroke-width:4;stroke-linecap:round;stroke-linejoin:round;stroke-miterlimit:4;stroke-dasharray:none;stroke-opacity:1"
       d="m 445.73117,78.314157 c 5.72954,0.511073 7.58946,9.488556 7.6334,16.644532 0.0516,8.407731 -6.23432,21.270481 -10.71912,24.050501 -11.67521,-0.6162 -65.51109,-13.19929 -65.51109,-13.19929 z"
       id="path15796"
       sodipodi:nodetypes="csccc" />
    <path
       style="fill:#e9d7bc;fill-opacity:1;stroke:#d8b98e;stroke-width:4;stroke-linecap:round;stroke-linejoin:round;stroke-miterlimit:4;stroke-dasharray:none;stroke-opacity:1"
       d="m 378.35572,509.46795 c 4.56304,1.72963 12.53302,-0.11832 16.63793,-12.27414 4.3255,-12.80897 5.83367,-37.6828 -1.07179,-41.75461 -15.16232,-8.91446 -170.60097,-20.45414 -170.60097,-20.45414"
       id="path6738"
       sodipodi:nodetypes="cscc" />
    <path
       style="fill:#f6eee3;fill-opacity:1;stroke:#d8b98e;stroke-width:4;stroke-linecap:round;stroke-linejoin:round;stroke-miterlimit:4;stroke-dasharray:none;stroke-opacity:1"
       d="m 287.21296,457.2502 94.20863,21.69061 c -0.32622,-13.48718 7.90418,-23.75968 12.50027,-23.50161 -14.14495,-7.51144 -94.02482,-13.46746 -94.02482,-13.46746 -10.03928,7.93446 -12.68408,15.27846 -12.68408,15.27846 z"
       id="path6853"
       sodipodi:nodetypes="ccccc" />
    <path
       style="fill:#f6eee3;fill-opacity:1;stroke:#d8b98e;stroke-width:4;stroke-linecap:round;stroke-linejoin:round;stroke-miterlimit:4;stroke-dasharray:none;stroke-opacity:1"
       d="m 92.048909,18.246235 c 45.212431,3.571618 161.988991,23.801886 179.489531,26.886113 19.51795,3.439768 93.58923,18.345548 98.27762,20.455268 4.6884,2.109719 64.41882,10.067238 75.91511,12.726541 -8.06328,0.700803 -11.8604,13.283638 -13.4502,28.237683 -5.6007,52.68136 -21.88175,177.65585 -26.21368,199.40416 -5.19801,26.09648 -36.35142,158.55762 -36.69291,173.01175 -0.3415,14.45416 5.81616,29.46814 8.98134,30.5002 C 362.78357,507.74872 28.763722,451.26484 16.70064,449.38629 4.9557843,447.55729 -0.28816756,428.32814 2.380642,415.67635 4.9075748,403.69714 41.315322,220.64697 52.507924,182.12562 62.573828,147.48201 67.069347,77.837263 73.114345,42.433765 74.787834,32.632711 80.127143,17.304459 92.048909,18.246235 Z"
       id="path6076"
       sodipodi:nodetypes="ssscssscsssss" />
  </g>
  <g
     inkscape:groupmode="layer"
     id="layer5"
     inkscape:label="seal">
    <path
       style="fill:#726450;fill-opacity:1;stroke:#d8b98e;stroke-width:5;stroke-linecap:round;stroke-linejoin:round;stroke-miterlimit:4;stroke-dasharray:none;stroke-opacity:1"
       d="M 30.910399,417.42543 148.9857,438.43441"
       id="path105567"
       sodipodi:nodetypes="cc" />
    <path
       id="path53843"
       style="fill:#cd1808;fill-opacity:1;stroke:#7f1005;stroke-width:3;stroke-linecap:round;stroke-linejoin:round;stroke-miterlimit:4;stroke-dasharray:none;stroke-opacity:1"
       d="m 352.96393,476.86363 c 7.71756,-5.71682 14.42595,-16.66964 14.48532,-23.88246 0.0594,-7.21283 -4.86802,-18.86015 -5.99596,-27.56897 -1.12794,-8.70883 -1.6623,-15.38734 -4.51182,-21.63845 -2.84954,-6.25112 -14.06971,-10.2048 -18.75963,-11.3268 -4.68992,-1.12199 -8.25327,4.42579 -15.88037,4.40426 -8.5972,-0.0243 -16.27094,-7.12348 -31.01866,3.65628 -11.68804,8.54329 -22.14351,-2.0303 -27.01152,5.98396 -4.86802,8.01426 7.0646,18.05875 7.36142,27.46213 0.29683,9.4034 -9.37985,20.40961 -4.39309,29.17185 4.98675,8.76224 10.38905,5.82372 16.44437,11.38024 6.05533,5.55651 11.33884,13.73105 19.35322,17.68476 12.64493,2.72482 18.50909,-9.29193 25.67577,-10.12109 10.62281,-1.22902 19.66391,-1.80784 24.25095,-5.20571 z"
       sodipodi:nodetypes="ssssssssssscss" />
    <path
       id="path53720"
       style="fill:#cd1808;fill-opacity:1;stroke:#7f1005;stroke-width:2;stroke-linecap:round;stroke-linejoin:round;stroke-miterlimit:4;stroke-dasharray:none;stroke-opacity:1"
       d="m 358.57233,454.59154 c -7.83372,20.78593 -31.03454,31.28578 -51.82048,23.45206 -20.78593,-7.83372 -31.28578,-31.03455 -23.45206,-51.82048 7.83373,-20.78594 31.03456,-31.28578 51.82048,-23.45206 20.78594,7.83373 31.28578,31.03454 23.45206,51.82048 z"
       sodipodi:nodetypes="sssss" />
    <path
       id="path66836"
       style="display:inline;fill:#7f1005;fill-opacity:1;stroke:none;stroke-width:1.33449;stroke-linecap:round;stroke-linejoin:round;stroke-miterlimit:4;stroke-dasharray:none;stroke-dashoffset:0;stroke-opacity:1"
       d="m 316.40475,431.60316 c 4.10948,-1.01794 22.68518,-14.71639 16.3072,-23.82663 5.42269,2.74745 6.69382,7.28355 8.56041,8.15262 0.46215,2.94787 -3.04782,9.25664 -6.07599,11.28878 -6.085,4.08344 -14.52674,5.37158 -17.33745,5.14027 -1.22357,-0.37831 -1.45417,-0.75504 -1.45417,-0.75504 z m 34.37196,-3.38079 c 0.70443,-1.40308 2.83576,-2.94168 2.83576,-2.94168 0,0 -1.79542,0.0259 -3.59226,-1.03183 -2.11822,-0.5934 -9.17837,2.7e-4 -10.56384,1.9319 6.15381,-0.87155 8.22036,-0.0634 11.32034,2.04161 z m -2.80015,10.53683 c 0.60332,-0.35808 1.76385,-0.33053 3.22528,-0.0139 -0.39672,-0.5008 -1.25406,-1.64356 -1.86615,-3.74771 -1.32466,-1.61161 -6.86332,-6.33358 -10.40729,-7.49357 6.44959,4.4798 8.36778,7.77875 9.04816,11.25521 z m -5.3992,5.23309 c -0.0634,-2.11868 -0.9923,-11.42734 -4.73478,-15.77706 1.7524,4.13789 1.7634,13.99485 0.66318,15.8157 1.13147,0.16684 3.05378,1.52636 3.72134,2.17235 -0.001,-0.51441 0.10827,-1.46933 0.35026,-2.21099 z m -26.96755,-11.48817 c 6.60481,1.4731 17.04142,-1.92348 20.13989,-4.61596 2.19304,-1.90566 8.09107,-7.4381 5.6861,-15.49024 3.8687,2.0376 5.37407,13.6037 14.86612,12.17476 -6.94348,3.62999 -8.85295,9.41086 -2.49063,16.15665 -10.81185,-3.82635 -10.54682,4.51547 -10.47976,7.85261 -5.45933,-5.28655 -8.8583,-3.46266 -8.8583,-3.46266 -3.87956,-5.08448 -9.54462,-9.33082 -18.86342,-12.61516 z m -11.71102,-14.42573 c 0.88489,0.0875 2.35482,0.97532 2.46252,1.77698 0.10768,0.80168 -0.98525,0.59473 -1.36006,0.42416 -0.37483,-0.17054 -1.04346,-1.03726 -1.10246,-2.20114 z m 36.84618,36.60516 c -1.34451,-2.2898 -5.2686,-5.21453 -6.2303,-7.33951 -3.8556,-8.51948 -21.02806,-15.06983 -23.08879,-15.21728 0.25539,-1.53433 0.59793,-4.92326 0.39565,-6.64225 0,0 1.64487,1.84938 2.70649,3.5375 0.0492,-2.61605 -1.11783,-6.51009 -3.31242,-9.38629 -2.19461,-2.87622 -6.48307,-3.61423 -7.20078,-3.88472 -0.71771,-0.27049 -2.43753,-3.31904 -3.1671,-4.17943 -0.72958,-0.86039 -4.23941,-0.21418 -4.61135,1.37731 -0.67578,2.89159 1.49157,8.34503 2.1408,10.57683 0.64923,2.23181 3.33503,3.99507 3.95802,5.6374 0.62299,1.64235 -1.46055,4.87067 -1.50316,6.96213 -0.0736,3.61288 2.61242,7.18183 4.89283,7.88815 4.51933,-2.10543 9.48205,-3.62976 14.6874,-3.8207 -3.19322,0.78367 -7.183,3.25254 -7.84514,6.31658 2.40303,-0.005 8.3753,2.16289 9.10541,4.83915 -2.97413,-2.40816 -10.27538,-4.09352 -13.57664,1.09305 0,0 17.72314,6.82228 23.88726,9.03289 0.47101,0.16896 0.92135,-2.58108 0.98872,-4.95679 2.52483,0.66208 5.3584,5.47101 4.25355,8.08461 -2.58368,6.11183 -10.49828,7.70973 -15.8348,6.26531 -2.63741,-0.71386 -3.52673,-2.9033 -2.78444,-4.83463 0.36429,-0.94675 3.35863,-2.72178 5.13262,0.15816 -0.25303,-5.13288 -6.46885,-4.28608 -7.72298,-1.03299 -1.08008,2.80152 -0.0875,7.08039 4.15623,8.59328 9.27878,3.30789 19.80362,-0.94256 22.47398,-7.56589 1.69743,-4.21017 0.18865,-7.94297 -1.90106,-11.50188 z m -40.85513,-5.29341 c 0.95831,-1.33608 7.79969,-6.00673 10.71052,-3.17564 1.33703,1.3004 -4.53916,5.58427 -4.53916,5.58427 z"
       sodipodi:nodetypes="cccsccccccccccccccccccscccccccsscsscccssssssscccccccssscsssscscc" />
    <g
       id="g87685"
       transform="matrix(0.09953921,0.02015254,-0.02015254,0.09953921,187.9185,391.53239)">
      <path
         style="fill:#726450;fill-opacity:1;fill-rule:nonzero;stroke:none;stroke-width:40;stroke-linecap:round;stroke-linejoin:round;stroke-miterlimit:4;stroke-dasharray:none;stroke-opacity:1"
         d="m -1129.2052,45.808447 c -5.6591,-0.458418 -15.0358,-0.90172 -26.4855,0.302233 -11.6614,1.226223 -24.6213,4.058413 -38.3762,9.533904 -4.6921,1.867771 -9.6841,4.123834 -14.9104,6.864053 -20.7245,10.86622 -43.086,28.297746 -64.4499,55.399123 -18.0477,22.89443 -33.8844,50.82519 -46.6466,82.93572 -13.0662,32.87541 -21.9707,67.75776 -27.2316,102.40149 -5.8104,38.21157 -1.9855,76.2392 12.9595,109.97493 14.5264,32.79111 38.3008,58.43662 67.3183,73.67352 15.6472,8.21624 32.0997,13.03021 48.4577,14.76549 18.9914,2.01463 36.9555,-0.20232 52.7991,-4.99372 7.9418,-2.40177 15.2348,-5.41366 21.7766,-8.75934 18.4883,-9.45561 33.289,-23.16401 44.7603,-36.80218 11.32,-13.4583 19.1526,-26.55034 24.1619,-34.1545 -7.4352,5.66312 -19.9968,13.29761 -34.997,20.16422 -15.5365,7.11206 -30.9944,12.2478 -47.3327,16.26374 -5.6675,1.39306 -11.5723,2.63537 -17.7311,3.55489 -12.2578,1.83009 -25.0018,2.29536 -38.0295,0.4041 -11.1868,-1.62401 -22.374,-4.96434 -33.1606,-10.43411 -19.9002,-10.09117 -37.9121,-27.26362 -49.7585,-51.40699 -12.2006,-24.86528 -16.6085,-54.7011 -11.69,-86.16231 5.0086,-32.04639 13.2467,-63.91962 25.0676,-93.62891 11.5462,-29.0191 25.5231,-53.48168 40.828,-72.96273 18.0107,-22.92517 36.0213,-36.66858 51.4969,-44.80773 3.9341,-2.069049 7.6525,-3.750346 11.1059,-5.125085 20.6159,-8.206757 37.8118,-7.861586 46.8382,-7.130402 a 20,20 90 0 0 3.2296,-39.869406 z"
         id="path76641"
         inkscape:linked-fill="path81912"
         sodipodi:nodetypes="csc"
         inkscape:path-effect="#path-effect85399"
         inkscape:original-d="m -1130.82,65.74315 c -97.5776,-7.9043 -175.067,99.93912 -196.7184,240.54569 -22.6111,146.83887 127.424,244.56467 252.4664,110.66033" />
      <path
         style="fill:#726450;fill-opacity:1;fill-rule:nonzero;stroke:none;stroke-width:40;stroke-linecap:round;stroke-linejoin:round;stroke-miterlimit:4;stroke-dasharray:none;stroke-opacity:1"
         d="m -1114.8318,401.59519 c 2.3907,3.81567 15.971,25.34822 26.4553,44.21375 1.146,2.06198 2.3655,4.28454 3.6291,6.63255 7.3198,13.6014 17.2509,33.43319 24.0349,54.81845 5.4593,17.20956 8.9443,35.51658 8.0225,53.73012 -0.8571,16.93589 -5.504,33.69297 -15.8106,49.97988 -2.4248,3.88238 -6.8119,8.33062 -13.8067,13.00752 -7.2099,4.82067 -16.3312,9.31292 -26.8655,13.39068 -22.029,8.52734 -48.0572,14.42766 -71.2447,18.34478 -2.2964,0.38793 -4.585,0.75786 -6.8626,1.11053 -31.3985,4.86194 -61.8447,6.64337 -86.4476,7.01003 -13.7372,0.20472 -26.4933,-0.016 -37.7661,-0.49685 -11.2724,-0.48085 -21.2806,-1.23404 -29.3716,-2.11307 -7.0451,-0.75023 -14.1768,-0.63625 -21.301,0.52268 -4.8137,0.78306 -9.7443,2.09768 -14.657,3.97323 -10.2559,3.91541 -19.391,9.865 -27.1045,17.06479 -9.2441,8.62844 -15.5311,18.16585 -19.6982,26.38168 -4.1073,8.09821 -6.1519,14.90203 -7.2955,18.53004 2.9797,-2.42268 8.6584,-6.40831 15.9571,-10.29129 7.553,-4.01829 16.1987,-7.59471 25.5693,-9.82599 7.7745,-1.85123 14.8551,-2.50501 21.6527,-2.51838 3.2389,-0.006 6.246,0.13052 9.091,0.29608 4.119,0.23969 8.3532,0.63321 12.4353,1.19475 9.9178,1.24614 21.3264,1.85776 33.5694,1.97827 12.3208,0.12126 25.9737,-0.25099 40.5172,-1.0823 25.7216,-1.47027 58.2419,-4.63345 91.2924,-9.989 2.4264,-0.39318 4.8697,-0.80054 7.3255,-1.22247 24.3793,-4.18855 53.4222,-10.60277 79.1173,-20.42162 12.3418,-4.71619 24.4087,-10.40519 34.9301,-17.3202 10.0457,-6.60239 19.4246,-14.80689 26.0515,-25.07675 14.6113,-22.65973 21.4788,-46.409 22.9419,-70.01252 1.5399,-24.84441 -2.9705,-48.50059 -9.2011,-68.89982 -7.7342,-25.32226 -18.9371,-48.03967 -26.6543,-62.58655 -1.3608,-2.56517 -2.6702,-4.98024 -3.8982,-7.21041 -11.2384,-20.41026 -25.371,-42.60505 -27.6617,-46.26097 a 21.799258,21.799258 90 0 0 -36.9456,23.14838 z"
         id="path85434"
         inkscape:path-effect="#path-effect85469"
         inkscape:original-d="m -1096.359,390.021 c 39.7456,63.43547 94.8983,154.80395 45.4023,232.17251 -35.758,55.89434 -221.6524,70.0671 -292.5841,61.69384 -41.0756,-4.84883 -71.4528,20.36363 -87.3808,43.80863"
         sodipodi:nodetypes="cssc" />
      <path
         style="fill:#726450;fill-opacity:1;fill-rule:nonzero;stroke:none;stroke-width:40;stroke-linecap:round;stroke-linejoin:round;stroke-miterlimit:4;stroke-dasharray:none;stroke-opacity:1"
         d="m -952.24833,97.754441 c 0.4336,-0.390235 1.35686,-1.493769 3.23425,-2.664044 1.16903,-0.728723 3.10584,-1.706499 5.55067,-2.602407 2.76219,-1.012204 6.27989,-1.896798 8.95584,-1.859771 1.15095,0.01593 2.09763,0.201006 2.58742,0.538455 0.43582,0.300262 0.46665,0.763712 -0.31783,0.973543 -0.76213,0.203855 -2.15603,0.06963 -3.72419,-0.811854 -1.61928,-0.910218 -2.65417,-2.161133 -3.35977,-3.112888 -0.0649,0.07065 0.0713,0.840136 0.18734,2.034574 0.12122,1.247923 0.23203,2.803947 0.30948,4.806738 0.15724,4.066061 0.14555,9.172193 -0.0423,15.373943 -0.38868,12.83326 -1.49254,29.09986 -2.92477,47.06171 -3.33544,41.83043 -8.05053,90.82003 -10.91801,130.07473 -1.81917,24.90374 -3.24117,47.75277 -4.12694,68.8987 -0.97903,23.37232 -1.28603,44.32582 -0.73015,62.66537 0.58772,19.38976 2.16299,36.74755 5.26071,50.93516 1.57034,7.19214 3.65865,14.16858 6.5365,20.38964 1.43892,3.11051 3.15855,6.21422 5.23989,9.13597 2.0543,2.88378 4.57044,5.74356 7.6567,8.24634 2.88535,2.25691 6.16578,3.84003 9.63469,4.6887 3.27332,0.80081 6.43397,0.88181 9.30309,0.51859 0.80933,-0.10246 1.59658,-0.24024 2.35999,-0.40728 1.77174,-0.38766 3.44752,-0.94996 5.02606,-1.63679 2.07885,-0.9045 4.01186,-2.03533 5.80792,-3.30623 3.30986,-2.34208 6.35068,-5.30075 9.14261,-8.57038 2.67875,-3.13708 5.24169,-6.6957 7.63689,-10.47991 4.989,-7.88222 9.24799,-16.72328 12.50037,-25.28128 4.68831,-12.33636 6.51049,-21.89374 7.55584,-28.00414 -3.26188,5.03833 -9.36983,12.88614 -18.16129,20.97876 -6.24058,5.7445 -13.10788,10.92562 -19.66905,14.58249 -3.13441,1.74696 -6.02236,3.04419 -8.51693,3.85439 -2.61437,0.8491 -4.63886,1.10531 -5.80372,0.87069 -0.61094,-0.12306 -0.93946,-0.37935 -0.91862,-0.69291 0.0156,-0.23479 0.23321,-0.49679 0.65441,-0.71756 0.18156,-0.0952 0.40151,-0.18505 0.65954,-0.26317 0.91952,-0.27842 2.31361,-0.40146 4.00298,-0.077 1.8094,0.34755 3.62383,1.14576 5.22406,2.32536 0.34613,0.21235 0.31196,0.19062 0.0332,-0.29377 -0.29379,-0.51051 -0.74087,-1.32734 -1.3041,-2.65493 -1.15756,-2.72851 -2.3951,-6.65463 -3.55419,-12.08396 -2.28675,-10.71149 -3.85212,-25.27341 -4.61974,-43.55426 -0.71535,-17.03626 -0.72769,-36.95027 -0.0918,-59.7378 0.57428,-20.58078 1.65985,-42.98336 3.17114,-67.6471 2.37993,-38.8399 6.11484,-87.65989 8.22152,-130.36065 0.89622,-18.1656 1.45224,-35.34127 1.19871,-49.28562 -0.12223,-6.7229 -0.43516,-12.925245 -1.03042,-18.307343 -0.29459,-2.663515 -0.67053,-5.240308 -1.1581,-7.657688 -0.47535,-2.356745 -1.11169,-4.839785 -2.00964,-7.225455 -1.64251,-3.766466 -4.16643,-7.192252 -7.64213,-9.754611 -3.4356,-2.532798 -7.11454,-3.719228 -10.43438,-4.115317 -3.31601,-0.395631 -6.361,-0.02245 -8.88484,0.57032 -2.66746,0.626497 -5.13011,1.587904 -7.26542,2.597459 -4.91959,2.325939 -9.27268,5.465695 -12.32326,7.89286 -2.74978,2.187835 -4.98644,4.238979 -6.31602,5.394449 -2.32216,2.018073 -3.76227,3.048065 -4.4694,3.684469 a 9.4663623,9.4663623 90 0 0 12.66522,14.072678 z"
         id="path85831"
         inkscape:path-effect="#path-effect85833"
         inkscape:original-d="m -958.58094,90.718102 c 11.46218,-10.3158 31.29344,-19.1801 35.13092,-7.9043 13.76949,40.459378 -39.84856,372.719938 3.79597,409.215728 10.4712,8.75608 42.4255,-22.52364 55.74804,-56.6699"
         sodipodi:nodetypes="cssc" />
      <path
         style="fill:#726450;fill-opacity:1;fill-rule:nonzero;stroke:none;stroke-width:40;stroke-linecap:round;stroke-linejoin:round;stroke-miterlimit:4;stroke-dasharray:none;stroke-opacity:1"
         d="m -697.89348,262.18189 c -9.94489,5.3032 -27.64754,15.93252 -46.87771,35.50506 -3.13775,3.1936 -6.45174,6.7592 -9.87289,10.71992 -13.42053,15.53717 -27.13606,35.64046 -37.92917,59.74689 -9.14875,20.43376 -15.34612,41.94126 -17.34866,62.36676 -1.01357,10.33827 -0.93389,20.22556 0.30467,29.42955 1.34769,10.01501 4.04542,19.05899 8.04536,26.95802 1.26655,2.50635 2.93099,4.73043 4.90339,6.6181 1.95692,1.87287 4.06895,3.27465 6.13438,4.31067 4.0342,2.02357 8.04328,2.73495 11.1837,2.9624 3.23913,0.23461 6.36951,0.0121 9.16875,-0.39716 2.87515,-0.42037 5.74166,-1.08816 8.5243,-1.9168 5.68582,-1.69316 11.56584,-4.21953 17.31912,-7.38535 6.05892,-3.334 12.10797,-7.44814 17.82973,-12.24321 5.66931,-4.7511 10.97591,-10.13585 15.6454,-16.04233 5.45973,-6.90608 10.35825,-15.17944 14.29501,-24.18775 4.67946,-10.70782 7.52663,-21.32633 9.09581,-31.20455 1.5577,-9.80597 1.67125,-17.6304 1.81787,-22.76001 -2.30871,4.61063 -6.39385,11.10913 -12.26878,18.15126 -5.97398,7.16085 -12.79277,13.72038 -20.45391,19.98409 -6.53054,5.33933 -12.58364,9.60017 -18.37632,13.74914 -4.86273,3.48288 -9.5942,6.78789 -14.2881,9.87145 -4.74746,3.11873 -9.21593,5.85106 -13.37431,8.12911 -4.02433,2.20461 -7.33694,3.7515 -9.97319,4.77322 -1.30036,0.50398 -2.12568,0.76277 -2.75351,0.96239 -0.57823,0.18385 -0.63009,0.19533 -0.0494,0.28466 0.42393,0.0652 2.21445,0.29701 4.38579,1.39887 1.15504,0.58612 2.47133,1.44202 3.75569,2.6719 1.30101,1.24582 2.41614,2.73039 3.26499,4.4 -1.67185,-3.459 -3.16814,-8.14575 -3.96849,-14.36336 -0.73826,-5.73527 -0.84518,-12.49393 -0.083,-20.21227 1.51969,-15.38971 6.30457,-32.69008 13.96664,-49.93141 8.98666,-20.22192 20.43092,-37.10129 31.52721,-49.99237 2.81966,-3.27574 5.54095,-6.20887 8.10465,-8.81821 15.60884,-15.88672 29.68656,-24.25473 37.16648,-28.24346 a 20.000004,20.000004 90 0 0 -18.82148,-35.29522 z"
         id="path86343"
         sodipodi:nodetypes="csc"
         inkscape:path-effect="#path-effect86934"
         inkscape:original-d="m -688.48274,279.8295 c -77.63055,41.39717 -119.27496,149.92285 -95.19593,198.14365 6.68396,13.38535 80.38436,-23.17703 98.02425,-93.31105" />
      <path
         style="fill:#726450;fill-opacity:1;fill-rule:nonzero;stroke:none;stroke-width:40;stroke-linecap:round;stroke-linejoin:round;stroke-miterlimit:4;stroke-dasharray:none;stroke-opacity:1"
         d="m -686.66251,285.89588 c -0.29739,8.50144 -0.96956,22.09536 -2.9607,44.04964 -0.3152,3.4754 -0.68285,7.25183 -1.10589,11.36189 -1.60713,15.61434 -4.05242,35.55126 -6.14971,54.84295 -0.90869,8.35849 -1.73908,16.60906 -2.34565,24.2718 -0.59963,7.57515 -0.9878,14.6555 -1.02951,20.9697 -0.0213,3.22428 0.0471,6.30035 0.23117,9.19473 0.18877,2.96879 0.5062,5.86313 1.01153,8.61593 0.52023,2.83394 1.30324,5.87331 2.5561,8.84076 0.66812,1.58248 1.52518,3.27657 2.64004,4.96409 1.17312,1.77571 2.67283,3.61149 4.61569,5.30321 4.44056,3.6828 9.42833,5.69597 14.26166,6.44313 4.95291,0.76565 9.5187,0.18406 13.33857,-0.89197 3.98189,-1.12167 7.57855,-2.89483 10.7246,-4.89038 3.2428,-2.05692 6.25725,-4.50871 9.01834,-7.16267 0.97804,-0.9401 1.93453,-1.91541 2.86837,-2.92086 4.15356,-4.47212 8.10158,-10.22078 11.53037,-16.49691 5.42458,-9.92924 8.14451,-18.45086 9.75771,-23.31727 -3.91824,3.14229 -11.39075,8.18656 -20.39812,12.5201 -5.95153,2.86334 -10.98266,4.67937 -15.47784,6.07775 -0.96592,0.30049 -1.90222,0.56625 -2.80517,0.79638 -2.57683,0.65674 -4.85618,1.016 -6.72157,1.06923 -1.82126,0.052 -3.16643,-0.19768 -3.78896,-0.64621 -0.56492,-0.40702 -0.43045,-1.00432 0.67063,-1.16935 1.086,-0.16276 2.62152,0.20518 4.05861,1.1104 1.22729,1.03558 2.06327,2.06053 2.59678,2.81258 0.49964,0.70431 0.81421,1.28638 0.95422,1.53684 0.2761,0.49392 0.22004,0.29587 0.11716,-0.67003 -0.10056,-0.94415 -0.21648,-2.24612 -0.29482,-4.18083 -0.0743,-1.83621 -0.10467,-4.00912 -0.0758,-6.58106 0.057,-5.08491 0.33849,-11.17158 0.82164,-18.29123 0.48528,-7.15089 1.15045,-15.00075 1.90415,-23.22212 1.44996,-15.81621 3.83237,-39.20575 5.28232,-55.02195 0.39761,-4.26879 0.73937,-8.01143 1.06989,-11.65566 2.05766,-22.68771 2.77638,-37.02004 3.09974,-46.26423 a 20,20 90 0 0 -39.97554,-1.39838 z"
         id="path86969"
         sodipodi:nodetypes="csc"
         inkscape:path-effect="#path-effect87218"
         inkscape:original-d="m -666.67474,286.59507 c -2.53067,72.34456 -20.69163,166.25847 -9.00609,176.97621 11.68555,10.71773 39.82003,-8.37318 57.98101,-34.49763" />
      <path
         style="fill:#726450;fill-opacity:1;fill-rule:nonzero;stroke:none;stroke-width:40;stroke-linecap:round;stroke-linejoin:round;stroke-miterlimit:4;stroke-dasharray:none;stroke-opacity:1"
         d="m -543.20193,276.53469 c 0.13211,-0.21084 0.30311,-0.94432 1.25036,-1.6181 0.58009,-0.41262 1.66692,-0.90141 3.14033,-1.21873 1.69505,-0.36506 3.8669,-0.47642 5.81866,0.088 1.64126,0.47462 2.81604,1.35876 3.14195,2.4002 0.29489,0.94233 -0.27924,1.69263 -0.73771,2.3516 -0.031,0.19004 0.69909,1.39221 1.56108,2.97096 0.94915,1.73837 2.02547,3.81774 3.32298,6.49008 2.68635,5.53275 5.69138,12.31435 8.96795,20.01791 7.59525,17.85728 15.03379,36.59653 22.62904,54.45379 4.38115,10.26894 8.43282,19.55995 12.35706,28.12496 4.32684,9.4437 8.40872,17.80413 12.31649,25.01484 2.06826,3.81641 4.11858,7.36759 6.15387,10.60719 2.06312,3.28387 4.1875,6.37026 6.37576,9.14048 2.1434,2.71345 4.62472,5.47697 7.4449,7.85843 1.41618,1.19587 3.09188,2.44345 5.01504,3.55334 1.88463,1.08765 4.27294,2.19709 7.09418,2.88682 3.9507,0.69013 8.23891,0.94927 12.79494,0.76185 3.10573,-0.12777 6.50753,-0.53184 10.1193,-1.25495 7.3874,-1.47901 15.38571,-4.24093 23.03496,-8.35652 7.79209,-4.19244 14.4495,-9.36853 19.7175,-15.1538 7.40869,-8.13616 10.57346,-15.80208 12.25536,-20.62722 -3.67928,3.83089 -9.72222,8.41831 -18.58241,11.40037 -6.19224,2.08411 -12.86581,3.08862 -19.59619,3.1473 -6.67261,0.0582 -12.68987,-0.81453 -17.63647,-1.9901 -2.40759,-0.57216 -4.45092,-1.1876 -6.17916,-1.75531 -2.54019,-0.83443 -4.47885,-1.72866 -5.81758,-2.51424 1.5195,0.32991 2.62312,0.82702 3.12709,1.0575 0.57484,0.26289 0.77178,0.36634 0.76283,0.25153 -0.0169,-0.21633 -0.80697,-1.21964 -1.83848,-2.79204 -1.065,-1.62344 -2.31672,-3.65804 -3.81881,-6.28806 -1.45594,-2.54922 -3.05081,-5.48958 -4.79895,-8.85815 -3.3163,-6.3903 -7.02843,-14.01923 -11.25234,-23.06104 -3.85252,-8.24681 -7.83924,-17.03828 -12.40992,-27.20265 -6.52829,-14.51776 -16.80805,-37.12288 -25.60647,-54.23569 -3.98,-7.74106 -8.0771,-15.21158 -12.05406,-21.4834 -1.91877,-3.02598 -3.88464,-5.89284 -5.8789,-8.45523 -1.91025,-2.45445 -4.10862,-4.97003 -6.56418,-7.11574 -5.278,-4.046 -11.10203,-5.91946 -16.62569,-6.16432 -5.63827,-0.24994 -10.54868,1.19071 -14.34114,3.00402 -4.5675,2.18388 -7.94702,5.09188 -10.23704,7.49474 -2.02202,2.12165 -3.39115,4.05472 -4.27348,5.22322 -1.52301,2.01697 -2.51069,3.14498 -2.94167,3.83281 a 7.5460756,7.5460756 90 0 0 12.78902,8.01336 z"
         id="path87253"
         inkscape:path-effect="#path-effect87255"
         inkscape:original-d="m -549.59644,272.52801 c 5.58227,-8.9091 21.12768,-14.92579 30.5163,-5.69376 20.09598,19.76082 66.42181,158.98594 86.78528,164.65089 19.77201,5.50042 56.71555,-0.13394 72.86693,-26.45933"
         sodipodi:nodetypes="cssc" />
      <path
         style="fill:#726450;fill-opacity:1;fill-rule:nonzero;stroke:none;stroke-width:40;stroke-linecap:round;stroke-linejoin:round;stroke-miterlimit:4;stroke-dasharray:none;stroke-opacity:1"
         d="m -415.77752,244.71913 c -3.84447,4.10296 -9.90078,10.99385 -18.76463,22.76147 -4.1035,5.4478 -8.18542,11.11053 -12.10932,16.69863 -7.14012,10.1684 -1.34524,1.91308 -8.48536,12.08148 -11.80106,16.87542 -25.02429,36.41586 -35.22772,54.71354 -2.62258,4.70305 -4.99476,9.18055 -7.20564,13.52914 -6.97372,13.71658 -12.90309,27.31695 -19.94749,42.80421 -3.6162,7.9503 -7.79269,17.44736 -11.86513,27.04124 -4.46545,10.51971 -8.34181,20.05744 -11.46255,28.12724 -4.25157,10.99399 -6.27316,17.11784 -7.33693,20.38706 2.82606,-2.16478 7.64929,-6.22569 15.86457,-15.03087 5.9763,-6.40542 12.72787,-14.22373 20.04429,-23.08621 6.5662,-7.95372 13.21977,-16.30815 18.48978,-23.07177 10.49012,-13.46321 19.68877,-24.80401 28.75851,-37.13342 2.86947,-3.90075 5.76623,-7.94991 8.79505,-12.32875 11.59588,-16.76444 23.72915,-36.98771 34.44744,-53.37273 2.73021,-4.17367 5.35564,-8.08656 7.8827,-11.69632 3.72109,-5.31535 7.53475,-10.60754 11.29816,-15.60395 8.06324,-10.70497 13.21444,-16.48335 16.01305,-19.47013 a 20,20 90 0 0 -29.18878,-27.34986 z"
         id="path87575"
         inkscape:path-effect="#path-effect87577"
         inkscape:original-d="m -401.18313,258.39406 c -42.05291,44.88043 -122.58613,189.97139 -146.99916,224.46908" />
    </g>
  </g>
  <g
     inkscape:groupmode="layer"
     id="layer2"
     inkscape:label="fingers">
    <path
       style="fill:#3250b0;stroke:#1d2848;stroke-width:4;stroke-linecap:round;stroke-linejoin:round;stroke-miterlimit:4;stroke-dasharray:none"
       d="M 236.63926,17.590445 C 229.2544,3.1641825 207.6,-6.3294523 191.24851,13.902673 c -5.29231,6.548297 -7.99588,31.729882 -5.67281,40.462046 2.32306,8.732161 11.72905,32.172453 22.30342,32.392041 13.62955,0.283028 19.52371,-13.085498 22.06985,-19.843934"
       id="path3403"
       sodipodi:nodetypes="csssc" />
    <path
       style="fill:#3a3c3f;stroke:#292929;stroke-width:4;stroke-linecap:round;stroke-linejoin:round;stroke-miterlimit:4;stroke-dasharray:none"
       d="m 202.7496,75.826189 c 0.95221,-8.380716 17.24447,-8.609762 19.90961,-2.006494 2.66514,6.60327 -1.13308,17.887575 -0.26349,24.391826 C 201.11489,89.702969 201.94851,82.876916 202.7496,75.826189 Z"
       id="path5379"
       sodipodi:nodetypes="sscs" />
    <path
       style="fill:#3250b0;stroke:#1d2848;stroke-width:4;stroke-linecap:round;stroke-linejoin:round;stroke-miterlimit:4;stroke-dasharray:none"
       d="M 283.13358,28.758642 C 284.68566,20.370335 281.86082,6.7878412 269.09079,2.6992129 259.91415,-0.23890365 245.05583,6.5543775 237.02348,18.0347 228.99115,29.515028 219.15011,64.494918 220.187,72.895836 c 1.03691,8.400921 7.8213,28.313154 17.8182,29.463244 9.99688,1.15008 18.1054,-4.019458 20.3671,-14.002199 2.26172,-9.982739 27.73699,-42.629543 24.76128,-59.598239 z"
       id="path2741"
       sodipodi:nodetypes="csssssc" />
    <path
       style="fill:#3250b0;stroke:#1d2848;stroke-width:4;stroke-linecap:round;stroke-linejoin:round;stroke-miterlimit:4;stroke-dasharray:none"
       d="m 289.11193,20.256498 c 5.94581,-7.501677 20.90319,-12.7792097 32.04136,-7.269991 11.5601,5.717913 13.85946,19.279625 11.10514,25.607957 -5.19485,11.935737 -19.2027,36.839172 -27.87838,46.754572 0.87748,3.940388 -5.80943,21.033574 -24.40847,18.758234 -11.22289,-1.37297 -19.7884,-24.417262 -15.93181,-36.297118 3.8566,-11.879853 19.02917,-39.929381 25.07216,-47.553654 z"
       id="path868"
       sodipodi:nodetypes="ssscsss" />
    <path
       style="fill:#3a3c3f;stroke:#292929;stroke-width:4;stroke-linecap:round;stroke-linejoin:round;stroke-miterlimit:4;stroke-dasharray:none"
       d="m 269.58046,91.64343 c 1.07959,-10.836326 23.08167,-11.307733 23.3091,1.18784 0.22744,12.49557 -6.01009,19.03742 -5.66648,26.98355 -8.77008,-6.66011 -18.87129,-15.83862 -17.64262,-28.17139 z"
       id="path3913"
       sodipodi:nodetypes="sscs" />
    <path
       style="fill:#3a3c3f;stroke:#292929;stroke-width:4;stroke-linecap:round;stroke-linejoin:round;stroke-miterlimit:4;stroke-dasharray:none"
       d="m 228.68277,88.040735 c 2.23426,-9.109148 19.86723,-5.69907 21.61388,1.946952 1.74666,7.646024 -2.51101,17.772533 -1.64974,24.881603 -8.29319,-1.3946 -22.97331,-14.5601 -19.96414,-26.828555 z"
       id="path4793"
       sodipodi:nodetypes="sscs" />
    <path
       style="fill:#3a3c3f;stroke:#1d2848;stroke-width:4;stroke-linecap:round;stroke-linejoin:round;stroke-miterlimit:4;stroke-dasharray:none"
       d="m 191.60484,50.349615 c 6.96472,-2.909114 18.88202,-4.015653 23.04974,-1.891876"
       id="path6003"
       sodipodi:nodetypes="cc" />
    <path
       style="fill:#3a3c3f;stroke:#1d2848;stroke-width:4;stroke-linecap:round;stroke-linejoin:round;stroke-miterlimit:4;stroke-dasharray:none"
       d="m 229.42238,63.876928 c 5.23577,-3.648815 22.34006,-0.297426 25.04638,2.442145"
       id="path6038"
       sodipodi:nodetypes="cc" />
    <path
       style="fill:#3a3c3f;stroke:#1d2848;stroke-width:4;stroke-linecap:round;stroke-linejoin:round;stroke-miterlimit:4;stroke-dasharray:none"
       d="m 272.09881,67.109129 c 8.68514,-2.684102 22.90005,2.278221 26.31659,7.341393"
       id="path6040"
       sodipodi:nodetypes="cc" />
  </g>
</svg>
