<?xml version="1.0" encoding="UTF-8" standalone="no"?>
<svg
   xmlns:osb="http://www.openswatchbook.org/uri/2009/osb"
   xmlns:dc="http://purl.org/dc/elements/1.1/"
   xmlns:cc="http://creativecommons.org/ns#"
   xmlns:rdf="http://www.w3.org/1999/02/22-rdf-syntax-ns#"
   xmlns:svg="http://www.w3.org/2000/svg"
   xmlns="http://www.w3.org/2000/svg"
   xmlns:xlink="http://www.w3.org/1999/xlink"
   xmlns:sodipodi="http://sodipodi.sourceforge.net/DTD/sodipodi-0.dtd"
   xmlns:inkscape="http://www.inkscape.org/namespaces/inkscape"
   inkscape:export-ydpi="96"
   inkscape:export-xdpi="96"
   inkscape:export-filename="../stickers/nomp.png"
   sodipodi:docname="nomp.svg"
   inkscape:version="0.92+devel (unknown)"
   id="svg4575"
   version="1.1"
   viewBox="0 0 512 512"
   height="512"
   width="512">
  <defs
     id="defs4569">
    <inkscape:path-effect
       miter_limit="100"
       jointype="extrapolated"
       smoothing="0.5"
       end_offset="0.24533686"
       attach_start="0.2"
       stroke_width="4"
       is_visible="true"
       id="path-effect1035"
       effect="taper_stroke" />
    <inkscape:path-effect
       miter_limit="100"
       jointype="extrapolated"
       smoothing="0.5"
       end_offset="0.05020395"
       attach_start="0.03963049"
       stroke_width="4"
       is_visible="true"
       id="path-effect1027"
       effect="taper_stroke" />
    <inkscape:path-effect
       miter_limit="100"
       jointype="extrapolated"
       smoothing="0.5"
       end_offset="0.050633927"
       attach_start="0.05622516"
       stroke_width="4"
       is_visible="true"
       id="path-effect1025"
       effect="taper_stroke" />
    <inkscape:path-effect
       miter_limit="100"
       jointype="extrapolated"
       smoothing="0.5"
       end_offset="0.069866176"
       attach_start="0.074607666"
       stroke_width="4"
       is_visible="true"
       id="path-effect1023"
       effect="taper_stroke" />
    <inkscape:path-effect
       miter_limit="100"
       jointype="round"
       smoothing="0.5"
       end_offset="0.2"
       attach_start="0.2"
       stroke_width="4"
       is_visible="true"
       id="path-effect1021"
       effect="taper_stroke" />
    <inkscape:path-effect
       miter_limit="100"
       jointype="round"
       smoothing="0.5"
       end_offset="0.83800729"
       attach_start="0.75398214"
       stroke_width="4"
       is_visible="true"
       id="path-effect1017"
       effect="taper_stroke" />
    <inkscape:path-effect
       miter_limit="100"
       jointype="round"
       smoothing="0.5"
       end_offset="0.067220613"
       attach_start="0.33854056"
       stroke_width="4"
       is_visible="true"
       id="path-effect935"
       effect="taper_stroke" />
    <inkscape:path-effect
       miter_limit="100"
       jointype="round"
       smoothing="0.5"
       end_offset="0.24727051"
       attach_start="0.097025449"
       stroke_width="4"
       is_visible="true"
       id="path-effect933"
       effect="taper_stroke" />
    <inkscape:path-effect
       miter_limit="100"
       jointype="round"
       smoothing="0.5"
       end_offset="0.70734685"
       attach_start="0.2"
       stroke_width="4"
       is_visible="true"
       id="path-effect2260"
       effect="taper_stroke" />
    <inkscape:path-effect
       miter_limit="100"
       jointype="extrapolated"
       smoothing="0.5"
       end_offset="0.2"
       attach_start="0.2"
       stroke_width="4"
       is_visible="true"
       id="path-effect2256"
       effect="taper_stroke" />
    <inkscape:path-effect
       miter_limit="100"
       jointype="round"
       smoothing="0.5"
       end_offset="0.44397963"
       attach_start="0.2"
       stroke_width="4"
       is_visible="true"
       id="path-effect2200"
       effect="taper_stroke" />
    <inkscape:path-effect
       miter_limit="100"
       jointype="round"
       smoothing="0.5"
       end_offset="0.27172453"
       attach_start="0.2"
       stroke_width="4"
       is_visible="true"
       id="path-effect2196"
       effect="taper_stroke" />
    <inkscape:path-effect
       miter_limit="100"
       jointype="extrapolated"
       smoothing="0.5"
       end_offset="0.30611655"
       attach_start="0.029781919"
       stroke_width="4"
       is_visible="true"
       id="path-effect2194"
       effect="taper_stroke" />
    <inkscape:path-effect
       miter_limit="100"
       jointype="extrapolated"
       smoothing="0.5"
       end_offset="0.78567678"
       attach_start="0.56530512"
       stroke_width="4"
       is_visible="true"
       id="path-effect2177"
       effect="taper_stroke" />
    <inkscape:path-effect
       miter_limit="100"
       jointype="extrapolated"
       smoothing="0.5"
       end_offset="0.2"
       attach_start="0.79986232"
       stroke_width="4"
       is_visible="true"
       id="path-effect2173"
       effect="taper_stroke" />
    <inkscape:path-effect
       miter_limit="100"
       jointype="extrapolated"
       smoothing="0.5"
       end_offset="0"
       attach_start="0.29276599"
       stroke_width="4"
       is_visible="true"
       id="path-effect2171"
       effect="taper_stroke" />
    <inkscape:path-effect
       miter_limit="100"
       jointype="round"
       smoothing="0.5"
       end_offset="0.46534623"
       attach_start="0.56868136"
       stroke_width="4"
       is_visible="true"
       id="path-effect2167"
       effect="taper_stroke" />
    <clipPath
       id="clipPath935"
       clipPathUnits="userSpaceOnUse">
      <rect
         transform="rotate(-90)"
         y="208.16693"
         x="1066.3167"
         height="593.4621"
         width="457.46793"
         id="rect937"
         style="fill:#008d48;stroke-width:6;stroke-linecap:round;stroke-linejoin:round" />
    </clipPath>
    <clipPath
       id="clipPath941"
       clipPathUnits="userSpaceOnUse">
      <rect
         transform="rotate(-90)"
         y="156.43475"
         x="-878.71704"
         height="720.06525"
         width="499.435"
         id="rect943"
         style="fill:#008d48;stroke-width:6;stroke-linecap:round;stroke-linejoin:round" />
    </clipPath>
    <linearGradient
       gradientTransform="matrix(0.04693032,-0.00634377,0.00634378,0.04693039,435.33172,287.09987)"
       osb:paint="solid"
       id="you-alt">
      <stop
         id="stop982"
         offset="0"
         style="stop-color:#f5f5f5;stop-opacity:1;" />
    </linearGradient>
    <linearGradient
       gradientTransform="matrix(0,0,0,0,802.52069,916.65611)"
       osb:paint="solid"
       id="you">
      <stop
         id="stop855"
         offset="0"
         style="stop-color:#dadada;stop-opacity:1;" />
    </linearGradient>
    <linearGradient
       gradientTransform="matrix(0,0,0,0,1484.3903,2137.358)"
       osb:paint="solid"
       id="you-outline">
      <stop
         id="stop865"
         offset="0"
         style="stop-color:#a0a0a0;stop-opacity:1;" />
    </linearGradient>
    <inkscape:path-effect
       miter_limit="100"
       jointype="extrapolated"
       smoothing="0.5"
       end_offset="0.16146146"
       attach_start="0.17195616"
       stroke_width="0.79374999"
       is_visible="true"
       id="path-effect1086"
       effect="taper_stroke" />
    <inkscape:path-effect
       miter_limit="100"
       jointype="extrapolated"
       smoothing="0.5"
       end_offset="0.2"
       attach_start="0.36657247"
       stroke_width="0.79374999"
       is_visible="true"
       id="path-effect1092"
       effect="taper_stroke" />
  </defs>
  <sodipodi:namedview
     showguides="true"
     inkscape:snap-global="false"
     borderlayer="true"
     inkscape:document-rotation="0"
     inkscape:window-maximized="1"
     inkscape:window-y="0"
     inkscape:window-x="30"
     inkscape:window-height="1411"
     inkscape:window-width="2408"
     inkscape:pagecheckerboard="true"
     units="px"
     showgrid="false"
     inkscape:current-layer="layer15"
     inkscape:document-units="px"
     inkscape:cy="97.189634"
     inkscape:cx="-235.41473"
     inkscape:zoom="0.9899495"
     inkscape:pageshadow="2"
     inkscape:pageopacity="0.0"
     borderopacity="1.0"
     bordercolor="#666666"
     pagecolor="#ffffff"
     id="base" />
  <metadata
     id="metadata4572">
    <rdf:RDF>
      <cc:Work
         rdf:about="">
        <dc:format>image/svg+xml</dc:format>
        <dc:type
           rdf:resource="http://purl.org/dc/dcmitype/StillImage" />
        <dc:title />
      </cc:Work>
    </rdf:RDF>
  </metadata>
  <g
     sodipodi:insensitive="true"
     style="display:none"
     transform="translate(0,-161.53332)"
     id="layer1"
     inkscape:groupmode="layer"
     inkscape:label="ref">
    <image
       sodipodi:absref="/home/melano/Pictures/Dragons/Glax/sketches/nomp.jpg"
       xlink:href="../sketches/nomp.jpg"
       transform="matrix(0,1.0142868,-1.0142868,0,-1034.0439,-97.72358)"
       style="opacity:1"
       id="image931"
       preserveAspectRatio="none"
       height="2282.6448"
       width="1614.8394"
       x="22.850328"
       y="-2628.9214"
       clip-path="url(#clipPath935)" />
    <rect
       y="180.95949"
       x="695.23914"
       height="283.69064"
       width="427.11996"
       id="rect945"
       style="fill:#008d48;stroke-width:5.50327969;stroke-linecap:round;stroke-linejoin:round" />
    <image
       sodipodi:absref="/home/melano/Pictures/Dragons/Glax/sketches/nomp.jpg"
       xlink:href="../sketches/nomp.jpg"
       y="-1269.6915"
       x="-6.283844"
       width="1614.8394"
       height="2282.6448"
       preserveAspectRatio="none"
       id="image927"
       style="opacity:1"
       transform="matrix(0,0.81797981,-0.81797981,0,1317.3271,-18.212774)"
       clip-path="url(#clipPath941)" />
  </g>
  <g
     inkscape:label="nomp"
     id="layer2"
     inkscape:groupmode="layer">
    <g
       inkscape:label="durg b"
       id="layer5"
       inkscape:groupmode="layer">
      <g
         inkscape:label="wing b"
         id="layer19"
         inkscape:groupmode="layer">
        <path
           sodipodi:nodetypes="cccc"
           inkscape:connector-curvature="0"
           id="path1019"
           d="m 222.82725,234.86476 c -8.43209,2.47353 -34.36517,8.12515 -38.25528,14.17332 -4.34026,3.58321 41.18689,9.37918 41.18689,9.37918 z"
           style="fill:#292f75;stroke:#1d2848;stroke-width:6;stroke-linecap:round;stroke-linejoin:round" />
        <path
           sodipodi:nodetypes="ccc"
           inkscape:connector-curvature="0"
           id="path2075-6"
           d="m 180.18985,250.96936 c -3.83018,5.53037 -5.52553,14.24853 -6.66783,17.38853 6.55966,-5.09167 12.15008,-10.83855 13.79524,-11.10282"
           style="fill:#3a3c3f;stroke:#292929;stroke-width:4;stroke-linecap:round;stroke-linejoin:round;stroke-miterlimit:4;stroke-dasharray:none" />
        <path
           sodipodi:nodetypes="ccscsscscc"
           inkscape:connector-curvature="0"
           d="m 228.73528,231.77723 c 4.4938,0.4604 21.84793,22.61952 21.35645,25.6755 -8.10755,-1.52896 -48.34332,-12.82341 -55.83377,-12.72035 -6.69165,0.0921 -12.14583,3.75432 -13.94369,6.59592 -2.46634,3.89818 0.10797,10.37955 6.7386,7.07457 2.5588,-1.27541 4.6785,-2.72146 10.38364,-1.27151 18.26418,4.6418 51.67334,12.99321 59.09037,11.88628 7.41701,-1.1069 8.70624,-9.03386 8.20315,-14.76704 -0.39986,-4.55668 -7.42162,-17.83915 -13.42229,-24.83513 -5.71048,-6.65765 -11.21371,-9.74127 -15.2391,-9.73414"
           style="fill:#3250b0;stroke:#1d2848;stroke-width:4;stroke-linecap:round;stroke-linejoin:round;stroke-miterlimit:4;stroke-dasharray:none"
           id="path2071-5" />
      </g>
      <g
         style="opacity:1"
         inkscape:label="body"
         id="layer6"
         inkscape:groupmode="layer">
        <path
           id="path2183"
           style="fill:#3250b0;stroke:none;stroke-width:4;stroke-linecap:round;stroke-linejoin:round;stroke-miterlimit:4;stroke-dasharray:none"
           d="m 202.87106,114.07972 c 31.05229,17.26362 16.43322,86.15508 31.19472,126.42805 14.7615,40.27294 55.65478,63.11749 69.34188,89.77475 13.68708,26.65724 59.43171,-0.42628 59.43171,-0.42628 24.12307,-12.80144 24.89916,-34.46694 38.8401,-45.0137 13.94096,-10.54674 47.58205,-30.23703 58.25374,-43.34507 10.67171,-13.10804 17.84721,-24.64667 23.51424,-47.62746 5.66702,-22.98078 5.12136,-46.28921 26.55296,-72.53185 -34.7944,12.62894 -40.39156,56.12735 -56.22316,72.91329 -17.21194,18.24949 -54.70425,41.12768 -74.97913,58.20965 -8.77977,-9.2623 -31.3374,-27.53262 -47.82464,-40.14787 -10.86141,-8.31064 -23.62446,-16.8016 -29.25552,-27.36752 C 292.99831,168.58447 297.7691,75.136183 261.31105,68.41678"
           inkscape:connector-curvature="0"
           sodipodi:nodetypes="csscssscscssc" />
        <path
           sodipodi:nodetypes="csscscssssccccc"
           inkscape:connector-curvature="0"
           id="path2140"
           d="m 262.76787,90.73724 c 6.87081,2.780716 12.84665,14.05405 15.43769,28.71336 5.0816,28.74995 3.14612,61.96391 6.22784,73.87271 4.03343,15.58658 19.6117,31.3299 25.10601,35.34184 5.49431,4.01197 15.43536,3.5382 21.5057,11.55977 6.07033,8.02157 28.72386,17.52968 33.36186,23.27075 4.37211,3.55724 19.47001,12.2489 25.58201,4.36673 7.92874,-10.22508 37.3365,-29.17357 56.11548,-45.42132 8.04806,-6.96327 14.15272,-14.23395 16.97528,-18.48385 6.7436,-10.15374 11.78894,-22.78579 6.98104,-25.65094 -4.80789,-2.86515 -11.59459,11.05852 -16.82256,15.75406 -7.44936,14.5485 -68.48462,47.38981 -75.54436,54.74475 -18.06614,-20.84312 -71.33753,-49.40929 -78.12539,-67.6091 -0.0469,-14.29446 -7.89914,-113.294899 -36.66372,-112.485285 -11.6426,10.321255 -0.13688,22.026525 -0.13688,22.026525 z"
           style="fill:#292f75;stroke:none;stroke-width:4;stroke-linecap:round;stroke-linejoin:round;stroke-miterlimit:4;stroke-dasharray:none" />
        <path
           sodipodi:nodetypes="csscccsc"
           inkscape:connector-curvature="0"
           id="path1488"
           d="m 480.95863,202.13493 c -10.81525,24.91219 -15.37309,26.26956 -29.33033,39.98996 -9.35491,9.19617 -55.41255,35.44571 -61.00152,42.23249 -5.58898,6.78679 -37.15966,22.80428 -37.15966,22.80428 l 24.87659,9.54939 c 13.76236,-11.57151 14.30046,-25.00212 17.61839,-27.12368 3.31792,-2.12154 61.19487,-43.82234 66.19585,-49.41977 5.00097,-5.59742 18.09383,-26.60411 18.80068,-38.03267 z"
           style="fill:#c4d9f5;stroke:none;stroke-width:6;stroke-linecap:round;stroke-linejoin:round" />
        <path
           sodipodi:nodetypes="csscssscscssc"
           inkscape:connector-curvature="0"
           d="m 202.87106,114.07972 c 31.05229,17.26362 16.43322,86.15508 31.19472,126.42805 14.7615,40.27294 55.65478,63.11749 69.34188,89.77475 13.68708,26.65724 59.43171,-0.42628 59.43171,-0.42628 24.12307,-12.80144 24.89916,-34.46694 38.8401,-45.0137 13.94096,-10.54674 47.58205,-30.23703 58.25374,-43.34507 10.67171,-13.10804 17.84721,-24.64667 23.51424,-47.62746 5.66702,-22.98078 5.12136,-46.28921 26.55296,-72.53185 -34.7944,12.62894 -39.43927,54.26938 -56.22316,72.91329 -20.4105,22.67243 -55.72917,37.7372 -76.00405,54.81917 -6.91281,-10.16193 -30.31248,-24.14214 -46.79972,-36.75739 -10.86141,-8.31064 -23.62446,-16.8016 -29.25552,-27.36752 -8.71965,-16.36124 -2.56294,-109.030193 -39.02099,-115.749597"
           style="fill:none;stroke:#1d2848;stroke-width:4;stroke-linecap:round;stroke-linejoin:round;stroke-miterlimit:4;stroke-dasharray:none"
           id="path2135" />
      </g>
      <g
         style="opacity:1"
         inkscape:label="arm b 2"
         id="layer18"
         inkscape:groupmode="layer">
        <path
           sodipodi:nodetypes="csc"
           inkscape:connector-curvature="0"
           id="path2082"
           d="m 220.77196,246.2875 c -22.73623,-8.09431 -31.57405,31.25406 -32.02039,37.19344 -0.42134,5.60656 -1.25453,14.739 5.09658,24.01183"
           style="fill:#3250b0;stroke:#1d2848;stroke-width:4;stroke-linecap:round;stroke-linejoin:round;stroke-miterlimit:4;stroke-dasharray:none" />
      </g>
      <g
         style="opacity:1"
         inkscape:label="head"
         id="layer7"
         inkscape:groupmode="layer">
        <path
           sodipodi:nodetypes="ccc"
           inkscape:transform-center-y="-41.437708"
           inkscape:transform-center-x="-20.925502"
           inkscape:connector-curvature="0"
           id="path2092"
           d="m 198.39158,60.447715 c 5.38218,-14.008271 17.94868,-55.15455 28.17886,-58.4650387 2.98038,-0.9537559 -6.13107,45.4788397 -7.81427,60.3005657"
           style="fill:#3a3c3f;stroke:#292929;stroke-width:4;stroke-linecap:round;stroke-linejoin:round;stroke-miterlimit:4;stroke-dasharray:none" />
        <path
           sodipodi:nodetypes="cscc"
           inkscape:transform-center-y="-6.6480968"
           inkscape:transform-center-x="-13.359697"
           inkscape:connector-curvature="0"
           id="path2096"
           d="m 186.90751,86.190594 c 1.01922,-3.294816 5.14378,-21.026875 8.02797,-22.639498 2.88419,-1.612621 20.99385,-1.734797 24.22616,0.135759 3.23233,1.870556 -1.28892,11.668855 -1.28892,11.668855"
           style="fill:#3250b0;stroke:#1d2848;stroke-width:4;stroke-linecap:round;stroke-linejoin:round;stroke-miterlimit:4;stroke-dasharray:none" />
        <path
           sodipodi:nodetypes="cscsscsc"
           inkscape:connector-curvature="0"
           id="path2094"
           d="m 280.34847,84.746957 c 3.97093,8.310134 2.46587,25.446953 -2.45554,36.913103 -4.55148,10.60425 -23.41334,30.34259 -27.81883,32.06914 -4.40548,1.72657 -54.04509,4.95386 -60.69265,-1.21109 -8.8566,-3.59263 -15.29556,-31.97428 -13.64531,-42.44209 1.35237,-8.57827 9.52961,-26.84393 22.11422,-31.723875 10.44344,-7.596818 39.2339,-12.412083 54.76334,-8.255043 15.52942,4.157042 26.09361,12.185039 27.73477,14.649855 z"
           style="fill:#3250b0;stroke:none;stroke-width:4;stroke-linecap:round;stroke-linejoin:round;stroke-miterlimit:4;stroke-dasharray:none" />
        <path
           sodipodi:nodetypes="cssc"
           inkscape:connector-curvature="0"
           id="path2098"
           d="m 252.69277,77.551859 c -3.9383,4.405244 -10.5185,15.891287 -30.30401,12.893113 -19.78548,-2.998176 -4.81257,-25.080455 4.57534,-27.675729 9.38791,-2.595273 24.56575,-7.867217 37.90205,2.407596"
           style="fill:#292f75;stroke:none;stroke-width:4;stroke-linecap:round;stroke-linejoin:round;stroke-miterlimit:4;stroke-dasharray:none" />
        <path
           inkscape:original-d="m 217.95095,69.686951 c 1.99809,-2.877875 5.03222,-5.907105 10.44973,-8.112801 6.91699,-2.816201 15.25843,-3.405272 25.32993,-1.384059 8.9845,1.803064 11.96735,6.163842 11.96735,6.163842"
           inkscape:path-effect="#path-effect2173"
           sodipodi:nodetypes="cssc"
           inkscape:connector-curvature="0"
           id="path2100"
           d="m 224.45622,61.239106 c -2.49382,1.377363 -4.21775,3.474772 -5.24133,5.309579 -1.00154,1.795298 -1.26394,3.138266 -1.26394,3.138266 0,0 1.11478,-0.794153 2.71832,-1.768154 2.20068,-1.336708 3.11126,-1.735379 5.72157,-3.178656 0.83269,-0.460129 1.75024,-0.900886 2.76401,-1.313635 6.47367,-2.635704 14.40193,-3.238287 24.18223,-1.275513 6.71401,1.347408 9.71651,4.206517 10.48871,5.069036 0.0425,0.12424 0.4072,-0.07849 0.82647,-0.310349 0.41338,-0.2286 0.85916,-0.459778 1.00136,-0.529631 0.0512,-0.03044 0.0443,-0.02612 0.0443,-0.02612 0,0 -0.006,0.0054 0.0398,-0.03265 0.13111,-0.126737 0.45009,-0.447934 0.74298,-0.87345 0.27994,-0.406692 0.46592,-0.816195 0.3252,-0.895888 -1.33003,-1.485595 -5.02062,-4.785263 -12.68181,-6.322757 -10.3627,-2.079652 -19.11732,-1.504093 -26.47763,1.492605 -1.15473,0.470136 -2.21474,0.978239 -3.19029,1.517312 z"
           style="fill:#1d2848;fill-rule:nonzero;stroke:none;stroke-width:4;stroke-linecap:round;stroke-linejoin:round;stroke-miterlimit:4;stroke-dasharray:none" />
        <path
           sodipodi:nodetypes="ssssssss"
           inkscape:connector-curvature="0"
           id="path2084"
           d="m 191.5528,106.08775 c -3.01499,-0.13772 -7.49475,-8.463246 -6.83277,-9.251622 0.61188,-0.728687 5.02899,3.657342 6.67714,3.723472 1.79811,0.0721 5.83563,-2.919895 10.65009,-3.026695 5.29772,-0.117513 11.78702,1.384694 13.91435,6.346135 0.69361,1.61767 -1.83309,4.59494 -3.68687,2.91974 -2.77654,-2.50908 -5.59469,-4.61442 -10.16046,-4.66782 -5.36633,-0.0628 -8.58425,4.04709 -10.56148,3.95679 z"
           style="fill:#1d2848;stroke:none;stroke-width:4;stroke-linecap:round;stroke-linejoin:round;stroke-miterlimit:4;stroke-dasharray:none" />
        <path
           style="fill:#1d2848;stroke:none;stroke-width:4.1946311;stroke-linecap:round;stroke-linejoin:round;stroke-miterlimit:4;stroke-dasharray:none"
           d="m 254.64801,111.41081 c 3.1236,0.51035 9.51992,-7.06456 9.01103,-8.01663 -0.47038,-0.87999 -5.95094,2.66599 -7.65647,2.37762 -1.86071,-0.31463 -6.21773,-3.78114 -11.21521,-4.50729 -5.49912,-0.79905 -12.41935,0.18668 -15.42846,4.47463 -1.06025,1.51083 1.28159,4.66632 3.42508,3.15948 3.21048,-2.25688 6.58719,-3.38444 11.34625,-2.85681 5.59359,0.62014 8.46934,5.03431 10.51778,5.369 z"
           id="path2086"
           inkscape:connector-curvature="0"
           sodipodi:nodetypes="ssssssss" />
        <path
           sodipodi:nodetypes="csscssc"
           style="fill:#c4d9f5;stroke:none;stroke-width:4;stroke-linecap:round;stroke-linejoin:round;stroke-miterlimit:4;stroke-dasharray:none"
           d="m 276.34484,123.05564 c -9.13186,-13.96337 -20.05745,10.09517 -27.75621,17.61824 -7.69876,7.52309 -56.72947,2.1412 -57.23796,-9.36693 -0.5085,-11.50812 -6.32197,-16.49272 -15.33736,-10.4135 0.36641,10.9518 9.67752,33.13683 15.58778,35.03803 5.91027,1.90122 56.04945,4.81483 63.15509,-2.08671 7.10563,-6.90155 18.7596,-20.32917 21.58866,-30.78913 z"
           id="path2181"
           inkscape:connector-curvature="0" />
        <path
           inkscape:original-d="m 197.85036,78.352145 c -12.58461,4.879945 -20.76185,23.145605 -22.11422,31.723875 -1.65025,10.46781 4.78871,38.84946 13.64531,42.44209 6.64756,6.16495 56.28717,2.93766 60.69265,1.21109 4.40549,-1.72655 23.26735,-21.46489 27.81883,-32.06914 4.92141,-11.46615 6.42647,-28.602969 2.45554,-36.913103"
           inkscape:path-effect="#path-effect2171"
           style="fill:#1d2848;fill-rule:nonzero;stroke:none;stroke-width:4;stroke-linecap:round;stroke-linejoin:round;stroke-miterlimit:4;stroke-dasharray:none"
           d="m 189.46889,86.848984 c 1.97644,-2.142156 3.86353,-4.366178 5.47902,-5.941368 1.61072,-1.570537 2.90245,-2.555471 2.90245,-2.555471 0,0 -1.62526,0.02717 -3.94303,0.854065 -2.39643,0.854958 -5.14391,2.455163 -7.39367,4.947108 -7.199,7.89219 -11.73031,19.123432 -12.75312,25.611252 -1.71815,10.89852 4.6253,39.89905 14.55741,44.4719 8.34567,6.52765 57.38233,3.355 62.48592,1.35483 5.15944,-2.02202 24.26667,-22.28472 28.92692,-33.14241 5.06302,-11.79608 6.73438,-29.540041 2.42224,-38.564226 l -3.60912,1.724591 c 3.62972,7.596085 2.29095,24.125755 -2.48884,35.261975 -4.44271,10.35081 -23.0592,29.56479 -26.71075,30.99587 -3.63131,1.42316 -52.71607,4.64401 -58.60289,-0.81543 a 2.7054776,2.7054776 0 0 1 -0.24339,-0.25735 4.3845808,4.3845808 0 0 1 -0.3648,-0.12953 c -7.57836,-3.07412 -13.98429,-30.36428 -12.4215,-40.27732 0.89008,-5.64587 5.09897,-16.239191 11.75715,-23.538486 z"
           id="path2169"
           inkscape:connector-curvature="0"
           sodipodi:nodetypes="cscssc" />
        <path
           sodipodi:nodetypes="csc"
           inkscape:connector-curvature="0"
           id="path2088"
           d="m 262.11779,67.444909 c 11.71274,-13.579332 44.44954,-55.792888 49.37115,-51.445845 5.07324,4.480956 -30.8549,68.026113 -32.26957,71.246684"
           style="fill:#3a3c3f;stroke:#292929;stroke-width:4;stroke-linecap:round;stroke-linejoin:round;stroke-miterlimit:4;stroke-dasharray:none" />
        <path
           sodipodi:nodetypes="cssc"
           inkscape:connector-curvature="0"
           id="path2090"
           d="m 251.13064,79.041556 c 2.87808,-4.483501 7.34582,-10.004604 11.0163,-10.949303 6.06379,-1.56068 17.08752,10.175567 18.65597,14.89437 0.84671,2.54736 -3.48563,7.59063 -4.6846,8.723113"
           style="fill:#3250b0;stroke:none;stroke-width:4;stroke-linecap:round;stroke-linejoin:round;stroke-miterlimit:4;stroke-dasharray:none" />
        <path
           inkscape:original-d="m 251.13064,79.041556 c 2.87808,-4.483501 7.34582,-10.004604 11.0163,-10.949303 6.06379,-1.56068 17.08752,10.175567 18.65597,14.89437 0.84671,2.54736 -3.48563,7.59063 -4.6846,8.723113"
           inkscape:path-effect="#path-effect2177"
           style="fill:#1d2848;fill-rule:nonzero;stroke:none;stroke-width:4;stroke-linecap:round;stroke-linejoin:round;stroke-miterlimit:4;stroke-dasharray:none"
           d="m 255.69935,70.034072 c -3.77523,3.740232 -4.56871,9.007484 -4.56871,9.007484 0,0 4.23376,-3.068509 7.37888,-6.160919 1.60575,-1.585221 3.01059,-2.56187 4.13593,-2.851508 4.68242,-1.205146 14.96241,9.685784 16.25956,13.588333 0.002,0.006 0.0416,0.221167 -0.10606,0.716089 -0.31657,1.173611 -0.89557,2.530104 -1.37544,3.839728 -0.76501,1.994669 -1.3052,3.536457 -1.3052,3.536457 0,0 1.60881,-0.525378 3.41424,-1.977168 1.15453,-0.90402 2.46907,-2.257611 3.09943,-4.255379 0.27299,-0.914958 0.41783,-2.07144 0.0688,-3.121398 -1.83641,-5.524986 -13.62428,-18.112238 -21.05239,-16.200414 -2.06573,0.531673 -4.15328,2.105848 -5.94908,3.878695 z"
           id="path2175"
           inkscape:connector-curvature="0"
           sodipodi:nodetypes="cssc" />
        <path
           sodipodi:nodetypes="cssc"
           inkscape:connector-curvature="0"
           id="path2179"
           d="m 176.01331,120.89345 c 9.01539,-6.07922 14.82886,-1.09462 15.33736,10.4135 0.50849,11.50813 49.8679,17.01177 57.56666,9.48869 7.69876,-7.52308 18.29565,-31.70337 27.42751,-17.74"
           style="fill:none;stroke:#1d2848;stroke-width:4;stroke-linecap:round;stroke-linejoin:round;stroke-miterlimit:4;stroke-dasharray:none" />
      </g>
    </g>
    <g
       style="display:inline"
       inkscape:label="you"
       id="layer4"
       inkscape:groupmode="layer">
      <g
         inkscape:label="leg b"
         id="layer8"
         inkscape:groupmode="layer">
        <path
           sodipodi:nodetypes="cscssc"
           inkscape:connector-curvature="0"
           id="path2145"
           d="m 292.85365,356.63645 c -24.81248,-31.39712 -49.01726,-24.62807 -56.77044,-18.52857 -7.75318,6.09948 -2.13173,45.88348 4.3244,53.58318 -30.87165,0.47732 -50.2131,8.13485 -59.56223,11.87482 -9.34914,3.73999 -26.95049,26.46196 -15.79165,34.58741 11.15883,8.12545 125.05783,-31.14564 124.36085,-46.54774"
           style="fill:url(#you);stroke:url(#you-outline);stroke-width:4;stroke-linecap:round;stroke-linejoin:round;stroke-miterlimit:4;stroke-dasharray:none" />
      </g>
      <g
         inkscape:label="arm b"
         id="layer9"
         inkscape:groupmode="layer">
        <path
           sodipodi:nodetypes="cscsssc"
           inkscape:connector-curvature="0"
           id="path2142"
           d="m 210.12997,314.59857 c 3.07442,5.70927 7.84744,45.77655 7.11023,51.06907 -0.73719,5.29252 -11.66801,58.30016 -15.82125,61.41135 -17.5637,-5.99877 -32.7839,22.27124 -23.05125,28.1105 12.00371,7.20183 37.42716,-4.24483 41.19086,-7.01015 3.76374,-2.76536 21.27192,-64.19634 21.76192,-76.6791 0.48997,-12.48277 -6.31191,-51.55872 -7.88037,-56.59989"
           style="opacity:1;fill:url(#you);stroke:url(#you-outline);stroke-width:4;stroke-linecap:round;stroke-linejoin:round;stroke-miterlimit:4;stroke-dasharray:none" />
      </g>
      <g
         inkscape:label="body 1"
         id="layer10"
         inkscape:groupmode="layer">
        <path
           style="fill:url(#you);stroke:none;stroke-width:4;stroke-linecap:round;stroke-linejoin:round;stroke-miterlimit:4;stroke-dasharray:none"
           d="m 205.05894,198.99398 c 3.6718,13.03625 7.591,37.77402 6.04804,50.3699 -1.54294,12.59587 -15.68273,36.03519 -18.16507,58.57322 -2.48232,22.53802 13.23917,47.5402 26.97896,55.55381 20.4726,11.94044 43.33752,18.03939 58.10084,51.3595 11.76191,3.67005 37.42296,7.91586 52.55326,2.95414 15.13031,-4.96173 31.13101,-20.35275 37.23776,-37.65771 6.10673,-17.30498 -2.78972,-15.63458 -7.62579,-24.01092 -8.96024,-22.42572 -62.82591,-91.8736 -82.14289,-102.71886 -5.98614,-17.41753 -6.5589,-36.74232 -2.60026,-58.11052 5.73177,-30.93933 -6.86007,-58.00625 -25.42102,-61.75451"
           id="path2185"
           inkscape:connector-curvature="0"
           sodipodi:nodetypes="cssscssccsc" />
        <path
           sodipodi:nodetypes="csssscsc"
           inkscape:connector-curvature="0"
           id="path2187"
           d="m 196.78051,289.45317 c 4.77096,-8.522 28.47178,-17.28125 37.66042,1.31774 5.81077,11.76173 7.88393,37.52286 16.94545,50.08297 10.99014,15.23333 25.04402,24.1673 35.04202,26.00851 14.41081,2.65386 23.5613,31.34926 18.84508,32.19833 -4.71622,0.84906 -26.49841,-3.31377 -26.49841,-3.31377 -24.171,-15.2772 -53.69486,-26.70468 -64.83484,-37.60737 -11.13997,-10.90271 -27.68447,-32.20167 -17.15972,-68.68641 z"
           style="fill:url(#you-alt);stroke:none;stroke-width:4;stroke-linecap:round;stroke-linejoin:round;stroke-miterlimit:4;stroke-dasharray:none" />
        <path
           style="fill:url(#you);stroke:none;stroke-width:4;stroke-linecap:round;stroke-linejoin:round;stroke-miterlimit:4;stroke-dasharray:none"
           d="m 360.81362,358.2174 c 0.3639,-11.32852 5.6887,-23.71497 16.2426,-31.86752 16.33813,-12.6207 54.98403,-29.84465 78.50304,-66.49829 17.03782,-26.55291 11.68414,-36.00081 23.19873,-56.38522 -1.40425,16.99755 21.46781,66.46772 13.63803,101.73833 -9.50665,42.82429 -47.51684,66.75249 -68.72855,74.06886 -26.54188,9.15485 -47.17756,7.65358 -60.99137,-0.60121"
           id="path2147"
           inkscape:connector-curvature="0"
           sodipodi:nodetypes="csscssc" />
        <path
           sodipodi:nodetypes="cccc"
           inkscape:connector-curvature="0"
           id="path2059"
           d="m 435.46444,283.4126 c 26.2719,-6.33461 46.37573,4.79425 55.68016,26.22507 7.99029,-42.57959 -14.02305,-90.08495 -12.685,-103.65484 -13.63014,22.33783 -3.30785,35.30073 -42.99516,77.42977 z"
           style="fill:url(#you-alt);stroke:none;stroke-width:4;stroke-linecap:round;stroke-linejoin:round;stroke-miterlimit:4;stroke-dasharray:none" />
        <path
           sodipodi:nodetypes="csscssc"
           inkscape:connector-curvature="0"
           id="path2057"
           d="m 360.81362,358.2174 c 0.3639,-11.32852 5.6887,-23.71497 16.2426,-31.86752 16.33813,-12.6207 54.98403,-29.84465 78.50304,-66.49829 17.03782,-26.55291 11.68414,-36.00081 23.19873,-56.38522 -1.40425,16.99755 21.46781,66.46772 13.63803,101.73833 -9.50665,42.82429 -47.51684,66.75249 -68.72855,74.06886 -26.54188,9.15485 -47.17756,7.65358 -60.99137,-0.60121"
           style="fill:none;stroke:url(#you-outline);stroke-width:4;stroke-linecap:round;stroke-linejoin:round;stroke-miterlimit:4;stroke-dasharray:none" />
        <path
           sodipodi:nodetypes="cssscssccsc"
           inkscape:connector-curvature="0"
           id="path2061"
           d="m 205.20211,207.69892 c 3.67179,13.03625 7.44783,29.06908 5.90487,41.66496 -1.54294,12.59587 -15.68273,36.03519 -18.16507,58.57322 -2.48232,22.53802 13.23917,47.5402 26.97896,55.55381 20.4726,11.94044 43.33752,18.03939 58.10084,51.3595 11.76191,3.67005 37.42296,7.91586 52.55326,2.95414 15.13031,-4.96173 31.13101,-20.35275 37.23776,-37.65771 6.10673,-17.30498 -2.78972,-15.63458 -7.62579,-24.01092 -8.96024,-22.42572 -62.82591,-91.8736 -82.14289,-102.71886 -5.98614,-17.41753 -8.4431,-28.51447 -2.45709,-49.40558 8.23383,-28.73611 -6.86008,-58.00626 -25.42102,-61.75452"
           style="fill:none;stroke:url(#you-outline);stroke-width:4;stroke-linecap:round;stroke-linejoin:round;stroke-miterlimit:4;stroke-dasharray:none" />
      </g>
      <g
         style="opacity:1"
         inkscape:label="arm f"
         id="layer11"
         inkscape:groupmode="layer">
        <path
           sodipodi:nodetypes="cscccssc"
           inkscape:connector-curvature="0"
           d="m 241.49785,313.95063 c 2.7175,14.20928 7.19779,64.70336 6.51184,69.50079 -0.68594,4.79744 -13.78425,51.38582 -17.95958,58.77805 0,0 -1.58,0.24344 -5.98679,1.37465 -11.47025,2.94416 -24.1439,13.84046 -21.77729,25.92788 1.40739,7.18813 35.84,7.03071 46.06325,-2.80255 6.03369,-5.80353 25.81087,-64.90873 27.68547,-81.8152 1.52829,-13.78315 -1.13623,-55.85233 -5.40858,-73.15098"
           style="fill:url(#you);stroke:none;stroke-width:4;stroke-linecap:round;stroke-linejoin:round;stroke-miterlimit:4;stroke-dasharray:none"
           id="path2155" />
        <path
           sodipodi:nodetypes="csc"
           inkscape:connector-curvature="0"
           id="path2053"
           d="m 241.49785,313.95063 c 2.7175,14.20928 7.19779,64.70336 6.51184,69.50079 -0.68594,4.79744 -13.5383,51.37624 -17.71362,58.76847"
           style="fill:none;stroke:url(#you-outline);stroke-width:4;stroke-linecap:round;stroke-linejoin:round;stroke-miterlimit:4;stroke-dasharray:none" />
        <path
           inkscape:original-d="m 238.04971,443.06234 c -11.2959,-3.86686 -40.29542,10.12037 -35.51897,26.48659 2.84103,9.73462 37.67982,6.71149 47.90307,-3.12178 6.03369,-5.80353 23.72634,-64.60643 25.60094,-81.5129 1.52829,-13.78315 -1.13623,-55.85233 -5.40858,-73.15098"
           inkscape:path-effect="#path-effect2256"
           sodipodi:nodetypes="csssc"
           inkscape:connector-curvature="0"
           id="path2055"
           d="m 229.88084,444.73494 c 2.01347,-0.29478 3.92073,-0.92526 5.45698,-1.25629 1.52465,-0.32852 2.71189,-0.41631 2.71189,-0.41631 0,0 -0.82491,-0.86139 -2.48677,-1.5617 -1.717,-0.72354 -4.00863,-1.12502 -6.32464,-0.71375 -13.79992,2.24593 -32.93569,14.5605 -28.62747,29.32236 3.4578,11.84794 40.25936,8.29171 51.20943,-2.24066 6.57382,-6.32306 24.31272,-65.69228 26.20231,-82.73393 1.2535,-11.30497 -0.23348,-40.56993 -3.06608,-60.72257 -0.46606,-3.32758 -1.46664,-6.44139 -2.46196,-8.83415 -0.97607,-2.34647 -1.86836,-3.81467 -1.86836,-3.81467 0,0 -0.0772,1.71621 -0.093,4.20373 -0.0152,2.40155 0.0184,5.85507 0.46227,9.00185 2.80871,19.98272 4.24326,48.97692 3.0515,59.72499 -1.85961,16.77129 -19.50601,75.00787 -24.99957,80.29187 -9.48335,9.12159 -42.38355,11.58616 -44.59671,4.0029 -3.3341,-11.42409 13.12106,-22.25036 25.43019,-24.25367 z"
           style="fill:url(#you-outline);fill-rule:nonzero;stroke:none;stroke-width:4;stroke-linecap:round;stroke-linejoin:round;stroke-miterlimit:4;stroke-dasharray:none" />
      </g>
      <g
         style="opacity:1"
         inkscape:label="leg f"
         id="layer12"
         inkscape:groupmode="layer">
        <path
           style="fill:url(#you);stroke:none;stroke-width:4;stroke-linecap:round;stroke-linejoin:round;stroke-miterlimit:4;stroke-dasharray:none"
           d="m 341.20242,370.12444 c -7.55268,-12.37594 -29.60548,-28.64805 -51.90789,-18.07896 -26.27441,12.45143 -21.08197,71.18292 -3.49018,87.07869 -21.4,2.54832 -54.98276,27.7252 -61.04306,38.41901 -6.06026,10.6938 -4.15785,31.99171 13.58387,32.39601 17.74171,0.40428 83.90748,-47.30728 95.5003,-80.54494 2.22433,-7.23106 1.04259,-15.66984 -1.91949,-21.1639"
           id="path2258"
           inkscape:connector-curvature="0"
           sodipodi:nodetypes="cscsscc" />
        <path
           inkscape:original-d="m 341.20242,370.12444 c -7.55268,-12.37594 -29.60548,-28.64805 -51.90789,-18.07896 -26.27441,12.45143 -21.02475,71.1144 -3.42797,87.00463 -21.3992,2.55506 -54.97405,27.74248 -61.03097,38.43819 -6.05693,10.69571 -4.14783,31.99302 13.59402,32.39174 17.74183,0.39871 83.89263,-47.33363 95.475,-80.57494 2.22207,-7.23176 1.03766,-15.67015 -1.92614,-21.16328"
           inkscape:path-effect="#path-effect2260"
           sodipodi:nodetypes="cscsscc"
           inkscape:connector-curvature="0"
           id="path2051"
           d="m 333.63491,363.89576 c 1.56845,1.56351 3.69148,3.21451 5.04647,4.27347 1.46563,1.14544 2.52104,1.95521 2.52104,1.95521 0,0 -0.1887,-1.31634 -0.91245,-3.14211 -0.73876,-1.86361 -1.97955,-4.08422 -3.83528,-5.92362 -10.65081,-10.58599 -29.2021,-19.73675 -48.01665,-10.82056 -26.31006,12.46833 -22.9706,67.58593 -6.59,87.4732 -21.84749,4.77791 -52.71667,28.13246 -58.75277,38.79141 -6.74731,11.91482 -4.1483,34.93994 15.28941,35.37678 18.89686,0.42466 85.64408,-48.15238 97.40857,-81.91638 a 2,2 0 0 0 0.0231,-0.0706 c 0.70414,-2.29163 1.08753,-4.67882 1.20228,-7.04574 0.21678,-4.15998 -0.87114,-7.90637 -2.2731,-10.66321 -1.35732,-2.66907 -2.76711,-4.04176 -2.76711,-4.04176 0,0 0.5325,1.89268 0.8598,4.63437 0.36589,3.06499 0.3561,6.02415 0.1851,9.87691 -0.0998,2.0586 -0.43007,4.0986 -1.01976,6.02936 -11.43519,32.71703 -76.94825,79.5707 -93.52906,79.19808 -16.046,-0.3606 -17.26519,-19.9301 -11.89864,-29.40671 5.72009,-10.1009 38.61301,-34.94061 59.52777,-37.43783 a 2,2 0 0 0 1.10328,-3.47025 c -16.56587,-14.9593 -21.91702,-71.93129 2.94406,-83.71294 16.86931,-7.99435 33.68237,0.30108 43.48389,10.04295 z"
           style="fill:url(#you-outline);fill-rule:nonzero;stroke:none;stroke-width:4;stroke-linecap:round;stroke-linejoin:round;stroke-miterlimit:4;stroke-dasharray:none" />
        <text
           transform="matrix(0.94346779,-0.33146709,0.33146819,0.94346538,0,0)"
           id="text1017"
           y="482.3717"
           x="122.43794"
           style="font-weight:bold;font-size:51.13462448px;line-height:60.00000238%;font-family:Maya;-inkscape-font-specification:'Maya Bold';text-align:start;writing-mode:lr-tb;text-anchor:start;display:inline;opacity:1;fill:url(#you-outline);fill-opacity:1;stroke:url(#you-outline);stroke-width:3.10392809;stroke-linecap:round;stroke-linejoin:round;stroke-miterlimit:4;stroke-dasharray:none"
           xml:space="preserve"><tspan
             dx="10.929904 -10.929904 1.7237124"
             style="text-align:start;text-anchor:start;fill:url(#you-outline);stroke:url(#you-outline);stroke-width:3.10392809"
             y="482.3717"
             x="122.43794"
             id="tspan1015"
             sodipodi:role="line">You</tspan></text>
      </g>
      <g
         style="opacity:1"
         inkscape:label="head 1"
         id="layer17"
         inkscape:groupmode="layer">
        <path
           sodipodi:nodetypes="csccc"
           inkscape:connector-curvature="0"
           id="path2204"
           d="m 171.03175,166.99978 c -7.0805,11.53166 6.65971,22.87132 3.00056,34.74193 -3.65917,11.87062 43.83017,3.48005 43.83017,3.48005 l -7.71138,-40.8225 z"
           style="fill:url(#you);stroke:url(#you-outline);stroke-width:4;stroke-linecap:round;stroke-linejoin:round;stroke-miterlimit:4;stroke-dasharray:none" />
        <path
           sodipodi:nodetypes="cssssc"
           inkscape:connector-curvature="0"
           id="path1959"
           d="m 200.21258,148.96586 c -1.70136,-3.78447 -2.24943,-6.96308 -8.69836,-9.32725 -3.51237,-1.28765 -11.89465,-0.47123 -21.16579,-0.90171 -16.16067,-0.75038 -34.22862,-3.18577 -36.89867,1.31058 -2.81185,4.73511 17.75461,23.2387 24.89829,25.89392 8.82529,3.28026 24.2777,7.65528 30.77137,15.81031"
           style="fill:url(#you);stroke:url(#you-outline);stroke-width:4;stroke-linecap:round;stroke-linejoin:round;stroke-miterlimit:4;stroke-dasharray:none" />
        <path
           sodipodi:nodetypes="csssc"
           inkscape:connector-curvature="0"
           id="path1920"
           d="m 195.24497,181.12632 c -1.5615,6.43356 -8.92156,10.16987 -16.43913,8.34528 -7.51759,-1.82461 -12.34594,-8.51919 -10.78443,-14.95277 1.5615,-6.43358 8.92156,-10.16989 16.43914,-8.34528 7.51758,1.82461 12.34593,8.51918 10.78442,14.95277"
           style="fill:url(#you-alt);stroke:url(#you-outline);stroke-width:4;stroke-linecap:round;stroke-linejoin:round;stroke-miterlimit:4;stroke-dasharray:none" />
        <path
           sodipodi:nodetypes="cscsc"
           inkscape:connector-curvature="0"
           id="path1918"
           d="m 190.40872,174.80312 c 1e-5,2.74672 -2.6846,4.97338 -5.99622,4.97338 -3.31163,-1e-5 -5.99621,-2.22667 -5.99621,-4.97338 0,-2.74674 2.68458,-4.9734 5.99621,-4.9734 3.31162,-1e-5 5.99623,2.22665 5.99622,4.9734"
           style="fill:url(#you-outline);stroke:none;stroke-width:3.58754611;stroke-linecap:round;stroke-linejoin:round;stroke-miterlimit:4;stroke-dasharray:none" />
        <path
           sodipodi:nodetypes="csccccccscc"
           inkscape:connector-curvature="0"
           id="path2189"
           d="m 198.20033,182.474 c -3.24389,9.13581 -27.82645,16.92033 -31.88129,24.05723 -4.05486,7.13689 1.29859,15.90838 4.71406,16.5043 0.53349,0.0931 1.07831,0.14667 1.62909,0.16714 l -0.0886,0.0181 c 1.55719,3.21447 7.53299,8.87983 14.74634,10.85586 7.22865,1.98023 22.26014,1.74472 34.19064,-2.32381 20.30282,-6.9236 33.9121,-24.37431 43.29862,-26.47414 0,0 3.68762,-60.02414 -33.0707,-62.15871 -18.51591,-1.07523 -38.43129,-3.12901 -32.8752,32.0578 z"
           style="fill:url(#you);stroke:none;stroke-width:4;stroke-linecap:round;stroke-linejoin:round;stroke-miterlimit:4;stroke-dasharray:none" />
        <path
           inkscape:original-d="m 255.77947,192.5499 c -21.8013,0.15931 -36.29482,29.70594 -50.0904,31.25885 -11.89348,1.33879 -17.85779,-2.15041 -21.35797,-6.61267 -3.60666,4.88611 -8.82696,6.61868 -13.29872,5.83847 -3.41548,-0.59591 -8.76766,-9.36643 -4.71281,-16.50332 3.17458,-5.58754 23.31251,-16.00275 31.62523,-24.58797"
           inkscape:path-effect="#path-effect2196"
           sodipodi:nodetypes="cscssc"
           inkscape:connector-curvature="0"
           id="path1914"
           d="m 244.42073,197.49999 c 3.13859,-1.5651 4.9108,-2.52523 7.56621,-3.60439 2.17488,-0.88388 3.79253,-1.3457 3.79253,-1.3457 0,0 -1.58971,-0.5517 -4.13347,-0.62094 -2.62087,-0.0713 -5.89393,0.41475 -9.02124,1.99689 -15.67788,7.87801 -27.04957,26.75743 -37.15941,27.89545 -11.32135,1.27439 -16.52101,-1.98451 -19.56061,-5.85958 a 2,2 0 0 0 -3.18275,0.0466 c -3.16736,4.29097 -7.67469,5.69652 -11.34586,5.05599 -1.59038,-0.27748 -6.92252,-7.20018 -3.31763,-13.5451 1.96589,-3.46012 13.00713,-10.03256 22.2374,-16.68305 2.39923,-1.72154 4.34347,-3.81694 5.70712,-5.68768 1.32584,-1.81888 1.94178,-3.20522 1.94178,-3.20522 0,0 -1.34566,0.69933 -3.25337,1.69744 -1.78698,0.93494 -4.54581,2.367 -6.73384,3.95011 -9.14198,6.58688 -20.7189,13.27403 -23.37695,17.95244 -4.502,7.9239 0.87883,18.54919 6.10798,19.46154 4.62571,0.80707 9.76016,-0.67931 13.68243,-4.75775 4.11139,4.07951 10.62792,6.77767 21.54174,5.54916 11.96309,-1.34664 23.55769,-20.78383 38.50794,-28.29621 z"
           style="fill:url(#you-outline);fill-rule:nonzero;stroke:none;stroke-width:4;stroke-linecap:round;stroke-linejoin:round;stroke-miterlimit:4;stroke-dasharray:none" />
        <path
           inkscape:original-d="m 172.57398,223.22033 c 1.55719,3.21447 7.53288,8.88023 14.74624,10.85626 7.22866,1.98023 22.26083,1.74492 34.19135,-2.3236 20.30282,-6.92359 33.91205,-24.37373 43.29857,-26.47355"
           inkscape:path-effect="#path-effect2194"
           sodipodi:nodetypes="cssc"
           inkscape:connector-curvature="0"
           id="path1916"
           d="m 174.48331,222.56122 c -0.0402,-0.0743 -1.90933,0.65911 -1.90933,0.65911 0,0 -1.72485,1.03028 -1.60773,1.24622 2.09301,3.8635 8.34088,9.48862 15.82556,11.53897 7.58884,2.0789 23.20305,1.78797 35.36529,-2.35957 14.45897,-4.93074 25.61008,-15.04597 33.96825,-21.26011 2.32193,-1.67492 4.21248,-3.69256 5.80073,-5.02512 1.57371,-1.32036 2.88406,-2.08128 2.88406,-2.08128 0,0 -1.50124,-0.23389 -3.75276,0.2928 -2.37861,0.55642 -4.951,1.78913 -7.31861,3.60359 -8.57723,6.37699 -19.15612,16.00662 -32.87273,20.6842 -11.6988,3.9895 -26.14893,4.16919 -33.01741,2.28763 -6.51238,-1.78401 -11.93148,-6.93971 -13.36532,-9.58644 z"
           style="fill:url(#you-outline);fill-rule:nonzero;stroke:none;stroke-width:4;stroke-linecap:round;stroke-linejoin:round;stroke-miterlimit:4;stroke-dasharray:none" />
        <path
           sodipodi:nodetypes="csssc"
           inkscape:connector-curvature="0"
           id="path1910"
           d="m 241.7803,179.8085 c 0,6.78576 -6.99613,12.28671 -15.62629,12.28671 -8.63016,0 -15.62628,-5.50095 -15.62628,-12.28671 0,-6.78576 6.99612,-12.2867 15.62628,-12.2867 8.63016,0 15.62629,5.50094 15.62629,12.2867"
           style="opacity:1;fill:url(#you-alt);stroke:url(#you-outline);stroke-width:4;stroke-linecap:round;stroke-linejoin:round;stroke-miterlimit:4;stroke-dasharray:none" />
        <path
           sodipodi:nodetypes="ccscc"
           inkscape:connector-curvature="0"
           id="path973"
           d="m 233.60927,176.65136 c -0.29296,3.19996 -3.81285,5.49352 -7.86191,5.12282 -4.04905,-0.3707 -7.09396,-3.26528 -6.801,-6.46523 0.29297,-3.19995 3.81286,-5.49351 7.86191,-5.12281 4.04905,0.3707 7.09395,3.26528 6.801,6.46522"
           style="opacity:1;fill:url(#you-outline);stroke:none;stroke-width:4;stroke-linecap:round;stroke-linejoin:round;stroke-miterlimit:4;stroke-dasharray:none" />
        <path
           sodipodi:nodetypes="cccccc"
           inkscape:connector-curvature="0"
           id="path2206"
           d="m 210.34032,173.52148 -1.51507,-12.04594 29.85215,-0.85653 0.98992,8.75807 -16.71261,1.42978 z"
           style="fill:url(#you);stroke:none;stroke-width:4;stroke-linecap:round;stroke-linejoin:round;stroke-miterlimit:4;stroke-dasharray:none" />
        <path
           sodipodi:nodetypes="cc"
           inkscape:connector-curvature="0"
           id="path1908"
           d="m 206.27564,174.6842 c 13.99942,-4.66595 29.95146,-2.34817 36.42682,-6.47682"
           style="opacity:1;fill:none;stroke:url(#you-outline);stroke-width:4;stroke-linecap:round;stroke-linejoin:round;stroke-miterlimit:4;stroke-dasharray:none" />
        <path
           sodipodi:nodetypes="ccsc"
           inkscape:connector-curvature="0"
           id="path1961"
           d="m 245.70021,142.45552 c 7.6789,-10.4254 44.87211,-25.40605 66.03615,-23.21533 -3.84386,5.81584 -7.07839,20.7247 -19.17192,35.74163 -6.75439,8.38711 -18.68126,16.15344 -28.56286,17.06259"
           style="fill:url(#you);stroke:none;stroke-width:4;stroke-linecap:round;stroke-linejoin:round;stroke-miterlimit:4;stroke-dasharray:none" />
        <path
           sodipodi:nodetypes="cccc"
           inkscape:connector-curvature="0"
           id="path1912"
           d="m 197.80616,199.97513 c -6.16066,2.7607 -15.99703,4.65769 -19.50288,4.33214 -1.22912,5.8694 3.31033,13.08078 6.71373,13.71086 5.08587,-4.51212 10.20137,-13.0185 12.78915,-18.043 z"
           style="fill:url(#you-alt);stroke:url(#you-outline);stroke-width:4;stroke-linecap:round;stroke-linejoin:round;stroke-miterlimit:4;stroke-dasharray:none" />
        <path
           inkscape:original-d="m 245.70021,142.45552 c 7.6789,-10.4254 44.87211,-25.40605 66.03615,-23.21533 -3.84386,5.81584 -7.07839,20.7247 -19.17192,35.74163 -6.75439,8.38711 -18.68126,16.15344 -28.56286,17.06259"
           inkscape:path-effect="#path-effect2200"
           style="fill:url(#you-outline);fill-rule:nonzero;stroke:none;stroke-width:4;stroke-linecap:round;stroke-linejoin:round;stroke-miterlimit:4;stroke-dasharray:none"
           d="m 252.40181,134.14613 c -2.29683,1.44962 -4.09769,3.36924 -5.26228,5.20074 -1.11977,1.76101 -1.43932,3.10865 -1.43932,3.10865 0,0 1.14819,-0.77139 2.81198,-1.66262 1.33539,-0.71533 4.25997,-2.10271 6.05584,-3.28411 13.0646,-8.41621 37.35279,-16.90042 53.89521,-16.47237 -3.47644,7.20153 -7.09209,19.82115 -17.45648,32.69095 -3.58866,4.45614 -8.73007,8.75677 -14.2448,11.85293 -3.78864,2.10283 -5.3811,3.17226 -8.53558,4.68844 -2.42072,1.16351 -4.2248,1.77567 -4.2248,1.77567 0,0 1.86422,0.39804 4.73933,0.15194 2.98745,-0.25572 6.55353,-1.18427 9.97928,-3.12816 5.91146,-3.31891 11.47943,-7.96125 15.40193,-12.83193 12.2417,-15.20091 15.73006,-30.51801 19.28275,-35.89331 a 2,2 0 0 0 -1.46259,-3.09213 c -17.39823,-1.80092 -45.17811,7.64308 -59.54047,16.89531 z"
           id="path2198"
           inkscape:connector-curvature="0"
           sodipodi:nodetypes="ccsc" />
        <path
           sodipodi:nodetypes="ccccc"
           inkscape:connector-curvature="0"
           id="path2202"
           d="m 170.4957,168.22399 1.83455,-11.46133 25.72282,5.52578 -0.61273,11.74536 z"
           style="fill:url(#you);stroke:none;stroke-width:4;stroke-linecap:round;stroke-linejoin:round;stroke-miterlimit:4;stroke-dasharray:none" />
        <path
           sodipodi:nodetypes="cc"
           inkscape:connector-curvature="0"
           id="path1930"
           d="m 168.89837,168.24988 c 8.06471,-0.36199 26.7714,5.86031 29.9056,6.96639"
           style="fill:url(#you-alt);stroke:url(#you-outline);stroke-width:4;stroke-linecap:round;stroke-linejoin:round;stroke-miterlimit:4;stroke-dasharray:none" />
      </g>
    </g>
    <g
       style="display:inline"
       inkscape:label="durg f"
       id="layer3"
       inkscape:groupmode="layer">
      <g
         inkscape:label="arm b 1"
         id="layer13"
         inkscape:groupmode="layer">
        <path
           sodipodi:nodetypes="csc"
           inkscape:connector-curvature="0"
           id="path2079"
           d="m 199.47609,275.93418 c 11.8599,0 19.73444,8.96851 20.65857,18.23671 0.98593,9.8881 -19.08625,33.47261 -29.64536,6.85207"
           style="display:inline;fill:#3250b0;stroke:none;stroke-width:4;stroke-linecap:round;stroke-linejoin:round;stroke-miterlimit:4;stroke-dasharray:none" />
        <path
           sodipodi:nodetypes="cscscc"
           inkscape:connector-curvature="0"
           id="path1486"
           d="m 205.76663,277.43648 c 7.86086,7.29875 9.63174,12.82709 8.71608,19.01147 -0.91565,6.18438 -6.92317,14.85676 -17.18228,13.27365 3.15038,2.75702 5.0221,3.39102 7.81176,3.39102 2.78966,0 17.45884,-9.04498 15.25336,-18.44641 -1.32742,-5.19643 -6.2661,-16.63718 -14.59892,-17.22973 z"
           style="fill:#c4d9f5;stroke:none;stroke-width:6;stroke-linecap:round;stroke-linejoin:round" />
        <path
           inkscape:original-d="m 188.75157,283.48094 c -0.62025,3.92418 -0.7119,10.57761 1.69474,17.40782 10.6021,26.75474 30.67428,3.17023 29.68835,-6.71787 -0.92413,-9.2682 -8.79867,-18.23671 -20.65857,-18.23671"
           inkscape:path-effect="#path-effect1035"
           sodipodi:nodetypes="ccsc"
           inkscape:connector-curvature="0"
           d="m 190.45411,286.27656 c 0.08,-1.18195 -1.70254,-2.79562 -1.70254,-2.79562 0,0 -2.18876,1.03325 -2.28846,2.52757 -0.27857,4.14763 0.0661,9.7815 2.09687,15.5449 a 36.202059,36.202059 0 0 0 0.0129,0.0365 47.440553,47.440553 0 0 0 0.0141,0.0357 c 9.15927,23.11369 25.90711,12.32491 31.65571,0.48288 1.32339,-2.72616 2.12385,-5.71149 1.88211,-8.13599 -0.76953,-7.7177 -5.90195,-15.19797 -13.94223,-18.40454 -2.1471,-0.85287 -4.37435,-0.80714 -6.05036,-0.48456 -1.64982,0.31754 -2.65611,0.85083 -2.65611,0.85083 0,0 1.03599,0.47576 2.43049,1.13711 1.13007,0.53594 3.38854,1.64868 4.79422,2.21204 6.63931,2.64785 10.81844,8.81496 11.44373,15.08599 0.15263,1.53075 -0.33719,3.59637 -1.50027,5.9923 -4.18389,8.61874 -16.52893,19.4471 -24.32435,-0.17372 -1.80859,-5.15241 -2.11468,-10.2056 -1.8658,-13.91134 z"
           style="display:inline;fill:#1d2848;fill-rule:nonzero;stroke:none;stroke-width:4;stroke-linecap:round;stroke-linejoin:round;stroke-miterlimit:4;stroke-dasharray:none"
           id="path1029" />
      </g>
      <g
         inkscape:label="arm f 1"
         id="layer14"
         inkscape:groupmode="layer">
        <path
           sodipodi:nodetypes="cccsccsc"
           inkscape:connector-curvature="0"
           id="path2077"
           d="m 279.77327,236.66196 c 2.7074,2.86571 5.62967,11.7865 2.31979,16.07357 -3.30988,4.28706 -35.68875,22.56563 -60.57986,60.76517 -6.83792,7.32933 -7.79962,27.00586 -1.01294,33.55593 6.78668,6.55009 26.67801,4.54763 30.65739,-8.02487 3.97938,-12.57247 -4.12772,-22.30651 -4.12772,-22.30651 10.60455,-13.41029 51.73744,-37.99755 57.5647,-50.69732 5.82726,-12.69978 4.47946,-17.10866 4.47946,-17.10866"
           style="fill:#3250b0;stroke:none;stroke-width:4;stroke-linecap:round;stroke-linejoin:round;stroke-miterlimit:4;stroke-dasharray:none" />
        <path
           sodipodi:nodetypes="cscscc"
           inkscape:connector-curvature="0"
           id="path1484"
           d="m 246.00454,316.55512 c 2.61404,14.70528 3.08659,25.0166 -9.53712,29.56427 -12.6237,4.54767 -18.68638,-5.95693 -18.68638,-5.95693 3.38373,10.07647 19.27409,16.13181 28.31419,6.71304 7.81718,-8.14462 7.47175,-18.41395 4.9176,-23.75308 -2.55415,-5.33913 -5.00829,-6.5673 -5.00829,-6.5673 z"
           style="fill:#c4d9f5;stroke:none;stroke-width:6;stroke-linecap:round;stroke-linejoin:round" />
        <path
           inkscape:original-d="m 280.48567,236.99553 c 2.70741,2.86572 4.91727,11.45293 1.60739,15.74 -3.30988,4.28706 -36.73316,22.16687 -61.21427,60.63044 -6.92962,10.88749 -6.41539,27.33635 0.3713,33.88644 6.78668,6.55007 25.92818,4.35185 29.90756,-8.22065 3.97938,-12.57247 -4.12772,-22.30651 -4.12772,-22.30651 10.60455,-13.41029 51.73744,-37.99755 57.5647,-50.69732 5.82726,-12.69978 4.7646,-16.55544 4.7646,-16.55544"
           inkscape:path-effect="#path-effect1017"
           style="fill:#1d2848;fill-rule:nonzero;stroke:none;stroke-width:4;stroke-linecap:round;stroke-linejoin:round;stroke-miterlimit:4;stroke-dasharray:none"
           d="m 285.58489,249.24605 c 0.4194,-2.82265 -0.25781,-5.44239 -1.21495,-7.47353 -0.76712,-1.70187 -1.66724,-2.91246 -2.50638,-3.725 -0.79752,-0.77225 -1.37789,-1.05199 -1.37789,-1.05199 0,0 0.31359,0.56756 0.60513,1.53523 0.34447,1.1434 0.47273,2.17598 0.67217,3.97489 0.17165,1.99385 0.19814,4.1174 -0.13093,6.12804 -0.18346,1.1843 -0.55865,2.14986 -1.12206,2.8796 -2.87183,3.71968 -36.78257,22.2292 -61.31843,60.77879 -7.31513,11.49319 -6.99271,29.00419 0.66963,36.39941 7.94506,7.66806 28.81306,4.81416 33.20324,-9.05621 0.863,-2.72656 1.20235,-5.32875 1.19201,-7.75973 0,0 -0.0734,-8.48519 -4.66968,-15.09022 11.79296,-13.39998 50.90645,-37.02317 56.82566,-49.92332 0.96043,-2.09315 1.74091,-3.95889 2.37405,-5.61765 l 0.0685,-0.28557 c 1.21208,-5.73261 0.51283,-11.42203 0.50457,-11.48602 -3.3e-4,-3.3e-4 -2.8e-4,-2.8e-4 -2.8e-4,-2.8e-4 0,0 2e-5,-5e-5 -1.2e-4,2.9e-4 -0.0367,0.0651 -3.16312,5.36951 -4.37816,10.63075 l 0.0685,-0.28557 c -0.59922,1.56987 -1.34507,3.35449 -2.27259,5.37589 -5.52359,12.03797 -46.47967,36.58785 -57.31569,50.29085 a 2,2 0 0 0 0.032,2.52049 c 2.5836,3.10208 3.99849,8.25986 3.99849,8.25986 0.9018,3.37358 1.2127,7.57118 -0.24074,12.16319 -3.56858,11.27463 -20.98358,12.81717 -26.61188,7.38509 -5.91104,-5.70496 -6.61708,-21.09168 -0.073,-31.37347 24.42636,-38.37755 57.36218,-55.62765 61.11011,-60.4821 1.06517,-1.37964 1.6504,-3.04401 1.90875,-4.71171 z"
           id="path1015"
           inkscape:connector-curvature="0"
           sodipodi:nodetypes="ccssccsc" />
      </g>
      <g
         inkscape:label="wing"
         id="layer15"
         inkscape:groupmode="layer">
        <path
           inkscape:transform-center-y="3.7682792"
           inkscape:transform-center-x="10.649822"
           sodipodi:nodetypes="ccc"
           inkscape:connector-curvature="0"
           id="path2075"
           d="m 238.35403,277.40363 c -2.36231,6.85344 -2.4288,16.57237 -1.85129,19.98251 5.32184,-7.19356 9.44726,-14.7845 11.07703,-15.53798"
           style="fill:#3a3c3f;stroke:#292929;stroke-width:4;stroke-linecap:round;stroke-linejoin:round;stroke-miterlimit:4;stroke-dasharray:none" />
        <path
           style="fill:#292f75;stroke:none;stroke-width:4;stroke-linecap:round;stroke-linejoin:round;stroke-miterlimit:4;stroke-dasharray:none"
           d="m 373.0582,262.53478 c -11.466,11.0948 9.76555,44.41697 36.49567,53.44066 -28.98338,-0.46214 -18.85196,34.99883 -9.91539,42.62863 -28.44807,-3.37619 -36.75151,18.90179 -25.55733,29.63079 -51.34493,-16.53049 -96.07678,-58.50041 -124.14668,-109.88806 4.02059,-3.61234 11.57449,-4.00884 17.48407,-4.69166 5.90957,-0.68285 50.01415,-6.8251 57.16313,-11.92777 7.14898,-5.1027 10.45143,-11.506 8.03568,-17.86537 -2.41575,-6.35938 -12.75871,-18.64413 -12.75871,-18.64413"
           id="path2263"
           inkscape:connector-curvature="0"
           sodipodi:nodetypes="ccccccscc" />
        <path
           inkscape:original-d="m 310.04338,290.26065 c 38.71757,14.7149 75.38509,32.47989 105.68218,24.65132"
           inkscape:path-effect="#path-effect1023"
           sodipodi:nodetypes="cc"
           inkscape:connector-curvature="0"
           id="path2063"
           d="m 319.40158,291.73056 c -4.32247,-1.69022 -9.3582,-1.46991 -9.3582,-1.46991 0,0 3.60809,3.51641 7.9015,5.19523 32.80848,12.82899 64.30268,26.56177 91.61774,22.71236 3.46144,-0.4875 6.16294,-3.25627 6.16294,-3.25627 0,0 -3.66287,-1.13588 -6.72113,-0.70459 -26.01188,3.66576 -56.72809,-9.62192 -89.60285,-22.47682 z"
           style="fill:#3250b0;fill-rule:nonzero;stroke:none;stroke-width:4;stroke-linecap:round;stroke-linejoin:round;stroke-miterlimit:4;stroke-dasharray:none" />
        <path
           inkscape:original-d="m 285.79304,289.8825 c 27.34675,29.47835 75.48323,62.22667 119.21767,69.76634"
           inkscape:path-effect="#path-effect1025"
           sodipodi:nodetypes="cc"
           inkscape:connector-curvature="0"
           id="path2065"
           d="m 292.01626,293.47012 c -2.40139,-2.41371 -6.22322,-3.58762 -6.22322,-3.58762 0,0 0.89751,3.90608 3.38761,6.40883 26.62981,26.76574 68.87883,54.92524 108.71318,63.97236 3.41291,0.77521 7.11688,-0.61485 7.11688,-0.61485 0,0 -3.00294,-2.55274 -6.23097,-3.28581 -38.96861,-8.8505 -80.51056,-36.506 -106.76348,-62.89291 z"
           style="fill:#3250b0;fill-rule:nonzero;stroke:none;stroke-width:4;stroke-linecap:round;stroke-linejoin:round;stroke-miterlimit:4;stroke-dasharray:none" />
        <path
           inkscape:transform-center-y="-20.14847"
           inkscape:transform-center-x="-43.16787"
           sodipodi:nodetypes="cccscccccc"
           inkscape:connector-curvature="0"
           d="m 282.12774,225.13158 c 6.11217,0 31.49878,21.89004 31.102,25.22636 -11.08842,-0.75005 -53.4007,10.35255 -62.88318,13.98666 -8.47122,3.24656 -10.86555,8.34316 -11.61759,11.88775 -1.03165,4.86255 4.02499,10.47267 9.45872,4.62371 l 9.64335,-5.3954 c 24.92754,-4.37057 55.18039,-11.38471 65.10524,-13.38973 9.92481,-2.00501 10.97343,-10.66067 9.79219,-16.76295 -0.93885,-4.85006 -11.58822,-18.34319 -20.30806,-25.19682 -8.29815,-6.52215 -16.00367,-9.22851 -21.44205,-8.7779"
           style="fill:#3250b0;stroke:none;stroke-width:4;stroke-linecap:round;stroke-linejoin:round;stroke-miterlimit:4;stroke-dasharray:none"
           id="path930" />
        <path
           inkscape:transform-center-y="-14.278072"
           inkscape:transform-center-x="-33.579289"
           inkscape:original-d="m 279.38897,225.8314 c 6.11218,0 31.49877,21.89004 31.102,25.22636 -11.08842,-0.75005 -50.66193,9.65273 -60.14441,13.28684 -8.47122,3.24656 -10.86555,8.34316 -11.61759,11.88775 -1.03165,4.86255 5.41358,9.66429 13.23261,2.67443"
           inkscape:path-effect="#path-effect935"
           sodipodi:nodetypes="ccssc"
           inkscape:connector-curvature="0"
           id="path2069"
           d="m 291.65224,230.17144 c -2.3363,-1.70392 -4.84902,-2.92882 -7.14991,-3.69139 -1.49671,-0.53292 -2.62369,-0.80927 -3.68274,-0.82826 -0.93626,-0.0168 -1.43062,0.17961 -1.43062,0.17961 0,0 0.52133,0.12654 1.23093,0.55522 0.71254,0.43046 1.56256,1.25584 2.73986,2.16704 1.49639,1.25583 3.9345,3.39697 5.93898,4.85213 6.76267,4.92091 14.39203,11.72569 17.74085,15.69705 -14.5802,0.95251 -48.62351,10.00731 -57.40876,13.37421 -9.14064,3.50312 -11.98366,9.2177 -12.85831,13.34021 -1.43883,6.78174 6.63148,11.8275 14.79863,5.96785 0.9782,-0.70272 0.39043,-2.87833 0.39043,-2.87833 0,0 -2.07348,-0.83641 -2.72222,-0.37171 -6.0212,4.32 -9.0386,0.39676 -8.55394,-1.88763 0.62943,-2.96667 2.57507,-7.44529 10.37687,-10.43529 9.34614,-3.58186 48.59579,-13.88258 59.2937,-13.15895 a 2,2 0 0 0 2.12099,-1.75926 c 0.0909,-0.76404 -0.19614,-1.53092 -0.4451,-2.02706 -1.86489,-3.71642 -12.00665,-13.00278 -20.37964,-19.09544 z"
           style="fill:#1d2848;fill-rule:nonzero;stroke:none;stroke-width:4;stroke-linecap:round;stroke-linejoin:round;stroke-miterlimit:4;stroke-dasharray:none" />
        <path
           inkscape:transform-center-y="-19.674035"
           inkscape:transform-center-x="-53.534835"
           inkscape:original-d="m 257.83104,275.46066 c 24.92754,-4.37057 55.18039,-11.38471 65.10524,-13.38973 9.92481,-2.00501 10.97343,-10.66067 9.79219,-16.76295 -0.93885,-4.85006 -11.58822,-18.34319 -20.30806,-25.19682 -8.29815,-6.52215 -16.00367,-9.22851 -21.44205,-8.7779"
           inkscape:path-effect="#path-effect933"
           sodipodi:nodetypes="csssc"
           inkscape:connector-curvature="0"
           id="path2071"
           d="m 264.84605,272.15493 c -3.66825,0.68623 -7.01501,3.30573 -7.01501,3.30573 0,0 4.04318,1.31963 7.75056,0.62606 23.25444,-4.35038 48.84038,-10.25533 57.75072,-12.05539 11.32696,-2.28828 12.68405,-12.26188 11.3597,-19.10344 -1.09063,-5.63417 -12.17311,-19.42333 -21.03571,-26.38917 -6.41856,-5.04483 -12.65374,-7.98418 -17.90221,-8.91966 -1.21888,-0.22135 -2.47212,0.17081 -3.37694,0.66741 -0.89645,0.49202 -1.3988,1.04679 -1.3988,1.04679 0,0 0.60369,0.44409 1.37464,0.95183 0.75705,0.4986 1.73323,1.10361 2.69921,1.27191 4.47256,0.79718 10.05834,3.3526 16.1323,8.12659 8.57708,6.74143 18.79334,19.93853 19.58041,24.00448 1.03813,5.363 0.29798,12.70072 -8.22468,14.42246 -9.01344,1.8209 -34.50067,7.70542 -57.69419,12.0444 z"
           style="fill:#1d2848;fill-rule:nonzero;stroke:none;stroke-width:4;stroke-linecap:round;stroke-linejoin:round;stroke-miterlimit:4;stroke-dasharray:none" />
        <path
           inkscape:original-d="m 373.5007,261.76036 c -11.46601,11.09479 9.32305,45.19139 36.05317,54.21508 -28.98338,-0.46214 -18.85196,34.99883 -9.91539,42.62863 -28.44807,-3.37619 -36.75151,18.90179 -25.55733,29.63079"
           inkscape:path-effect="#path-effect1021"
           sodipodi:nodetypes="cccc"
           inkscape:connector-curvature="0"
           id="path2073"
           d="m 372.28075,270.75112 c -0.003,-2.39848 -0.0814,-4.14337 0.28823,-6.08633 0.32273,-1.69652 0.93172,-2.90443 0.93172,-2.90443 0,0 -1.29392,0.42292 -2.68576,1.98827 -1.42933,1.60752 -2.63952,4.16395 -2.53331,7.08596 0.29079,13.93271 14.8335,34.42156 33.49375,44.00015 -18.64353,4.95065 -14.64084,29.90458 -6.77939,41.43897 -20.4363,-0.41107 -30.11909,13.02217 -27.22986,24.90791 0.62064,2.53062 2.21623,4.42336 3.69354,5.57301 1.45188,1.12986 2.62148,1.48023 2.62148,1.48023 0,0 -0.49436,-1.11608 -1.00811,-2.66291 -0.61758,-1.85944 -0.90606,-3.19538 -1.4201,-5.33515 -2.28055,-9.38174 5.99235,-22.22883 27.74984,-19.64667 a 2,2 0 0 0 1.53433,-3.5071 c -7.08589,-6.04974 -18.69122,-39.54276 8.58487,-39.10784 a 2,2 0 0 0 0.67159,-3.89469 c -20.80968,-7.02503 -37.62627,-29.60003 -37.91282,-43.32938 z"
           style="fill:#1d2848;fill-rule:nonzero;stroke:none;stroke-width:4;stroke-linecap:round;stroke-linejoin:round;stroke-miterlimit:4;stroke-dasharray:none" />
        <path
           inkscape:original-d="m 249.56508,277.07855 c 21.47033,48.40766 88.73424,105.19663 128.73452,113.00007"
           inkscape:path-effect="#path-effect1027"
           sodipodi:nodetypes="cc"
           inkscape:connector-curvature="0"
           id="path2067"
           d="m 254.11054,281.96095 c -1.41462,-2.77352 -4.54546,-4.8824 -4.54546,-4.8824 0,0 -0.52068,3.75382 0.98225,6.69996 22.96282,45.01707 81.61798,95.05035 120.96396,106.67966 3.23725,0.95753 6.78831,-0.37955 6.78831,-0.37955 0,0 -2.73397,-2.59386 -5.65453,-3.4564 C 334.52935,375.35653 276.62912,326.1071 254.11054,281.96095 Z"
           style="fill:#1d2848;fill-rule:nonzero;stroke:none;stroke-width:4;stroke-linecap:round;stroke-linejoin:round;stroke-miterlimit:4;stroke-dasharray:none" />
      </g>
      <g
         style="opacity:1"
         inkscape:label="snoot"
         id="layer16"
         inkscape:groupmode="layer">
        <path
           sodipodi:nodetypes="ccc"
           inkscape:connector-curvature="0"
           id="path970"
           d="m 232.01144,160.98691 c 0.15253,2.1641 -0.70375,8.16533 -3.11509,12.19488 5.48419,-1.35081 9.1466,-5.77284 10.3768,-9.28162"
           style="fill:#ffffff;stroke:#bcdeea;stroke-width:4;stroke-linecap:round;stroke-linejoin:round;stroke-miterlimit:4;stroke-dasharray:none" />
        <path
           sodipodi:nodetypes="ccc"
           inkscape:connector-curvature="0"
           id="path968"
           d="m 191.85594,157.66021 c 0.42616,2.67385 4.45633,9.54041 8.11047,11.62165 -0.0615,-5.16844 1.91279,-11.38426 3.04394,-12.92506"
           style="fill:#ffffff;stroke:#bcdeea;stroke-width:4;stroke-linecap:round;stroke-linejoin:round;stroke-miterlimit:4;stroke-dasharray:none" />
        <path
           style="fill:#3250b0;stroke:none;stroke-width:4;stroke-linecap:round;stroke-linejoin:round;stroke-miterlimit:4;stroke-dasharray:none"
           d="m 225.93482,127.62374 c 6.83368,2.11195 22.15196,-4.69657 26.93533,-0.0536 6.16045,5.9797 0.86263,34.29139 -6.23637,36.9604 -8.16472,3.06968 -18.71784,-7.12005 -31.06356,-8.44791 -12.3457,-1.32786 -21.87816,5.23303 -28.86811,0.99031 -5.79948,-3.52014 -7.74111,-28.9188 0.13544,-34.05033 7.25192,-4.7246 16.9602,3.18503 27.20813,3.76455"
           id="path2165"
           inkscape:connector-curvature="0"
           sodipodi:nodetypes="csssssc" />
        <path
           inkscape:original-d="m 225.93482,127.62374 c 6.83368,2.11195 22.15196,-4.69657 26.93533,-0.0536 6.16045,5.9797 0.86263,34.29139 -6.23637,36.9604 -8.16472,3.06968 -18.71784,-7.12005 -31.06356,-8.44791 -12.3457,-1.32786 -21.87816,5.23303 -28.86811,0.99031 -5.79948,-3.52014 -7.74111,-28.9188 0.13544,-34.05033 7.25192,-4.7246 16.9602,3.18503 27.20813,3.76455"
           inkscape:path-effect="#path-effect2167"
           sodipodi:nodetypes="csssssc"
           inkscape:connector-curvature="0"
           id="path962"
           d="m 242.0501,124.33813 c -3.11224,0.43618 -6.38549,1.39443 -8.83829,2.05933 -2.49681,0.63449 -3.49321,0.98725 -5.17244,1.17604 -1.2897,0.14499 -2.10455,0.0502 -2.10455,0.0502 0,0 0.67684,0.45636 2.02158,0.84633 1.48711,0.43125 3.22192,0.61658 5.60138,0.59239 2.90583,0.003 5.88857,-0.32192 9.04654,-0.76291 4.36194,-0.61025 7.53185,-0.59592 8.87283,0.7057 5.15728,5.00597 0.0315,31.5558 -5.54721,33.65323 -7.13892,2.68401 -17.28011,-7.18059 -30.14584,-8.56438 -12.82384,-1.37929 -21.92786,4.98162 -28.04424,1.26914 -4.32178,-2.62321 -6.5593,-26.26813 0.18943,-30.66489 3.04777,-1.98561 6.83645,-1.18456 11.72699,0.42893 3.50244,1.17547 6.79806,1.86284 9.78336,1.98698 2.8014,0.11649 4.60604,-0.3271 4.60604,-0.3271 0,0 -1.76841,-0.56121 -4.16586,-1.61594 -1.95406,-0.85968 -5.97457,-2.87059 -8.9703,-3.84254 -5.0862,-1.67805 -10.46177,-3.0451 -15.16371,0.0182 -8.994,5.85954 -7.34504,33.02695 -0.0815,37.43577 7.81754,4.74505 17.79926,-1.99062 29.69198,-0.71148 11.8351,1.27294 22.80928,11.77983 31.98128,8.33144 8.61137,-3.23762 14.08392,-33.31921 6.92553,-40.26758 -2.78533,-2.70357 -7.66147,-2.43367 -12.21305,-1.79689 z"
           style="fill:#1d2848;fill-rule:nonzero;stroke:none;stroke-width:4;stroke-linecap:round;stroke-linejoin:round;stroke-miterlimit:4;stroke-dasharray:none" />
        <path
           sodipodi:nodetypes="csssssc"
           inkscape:connector-curvature="0"
           id="path964"
           d="m 188.30706,134.93817 c 2.15325,-3.81434 12.60519,-1.61987 14.85308,0.10646 2.24789,1.72632 1.45745,4.28796 1.0168,4.38791 -2.04396,0.46369 -3.65515,-1.68525 -7.94127,-2.29909 -2.40207,-0.34402 -4.33554,1.05134 -5.85593,0.93169 -1.72117,-0.13546 -2.07268,-2.12312 -2.07268,-3.12696 z"
           style="fill:#1d2848;stroke:none;stroke-width:4;stroke-linecap:round;stroke-linejoin:round;stroke-miterlimit:4;stroke-dasharray:none" />
        <path
           style="fill:#1d2848;stroke:none;stroke-width:4;stroke-linecap:round;stroke-linejoin:round;stroke-miterlimit:4;stroke-dasharray:none"
           d="m 247.34586,137.76995 c -1.77912,-4.00253 -11.6007,-2.78732 -14.00318,-1.28356 -2.40248,1.50375 -1.86027,4.12917 -1.4312,4.27075 1.99034,0.65679 3.41734,-1.09569 7.74247,-1.29741 2.42396,-0.11305 3.80523,1.19887 5.33009,1.22496 1.72625,0.0295 2.76958,-1.99743 2.36182,-2.91474 z"
           id="path966"
           inkscape:connector-curvature="0"
           sodipodi:nodetypes="ssssss" />
      </g>
    </g>
  </g>
  <g
     inkscape:label="text"
     id="layer20"
     inkscape:groupmode="layer">
    <text
       xml:space="preserve"
       style="font-weight:bold;font-size:94.86885834px;line-height:60.00000238%;font-family:Maya;-inkscape-font-specification:'Maya Bold';text-align:center;writing-mode:lr-tb;text-anchor:middle;fill:#f01d0a;stroke:#670d04;stroke-width:9;stroke-linecap:round;stroke-linejoin:round;stroke-miterlimit:4;stroke-dasharray:none"
       x="-14.522048"
       y="168.56139"
       id="text954"
       transform="rotate(-47.05102)"><tspan
         sodipodi:role="line"
         id="tspan952"
         x="-14.522051"
         y="168.56139"
         style="stroke:#670d04;stroke-width:9;stroke-miterlimit:4;stroke-dasharray:none"
         dx="0 -3.599998 2.3300002 -2.3300002 -4.2599988"
         dy="0 0">Nomp!</tspan></text>
    <text
       transform="rotate(-47.05102)"
       id="text946"
       y="168.56139"
       x="-14.522048"
       style="font-weight:bold;font-size:94.86885834px;line-height:60.00000238%;font-family:Maya;-inkscape-font-specification:'Maya Bold';text-align:center;writing-mode:lr-tb;text-anchor:middle;fill:#f01d0a;stroke:#f01d0a;stroke-width:1;stroke-linecap:round;stroke-linejoin:round;stroke-miterlimit:4;stroke-dasharray:none"
       xml:space="preserve"><tspan
         dy="0 0"
         dx="0 -3.599998 2.3300002 -2.3300002 -4.2599988"
         style="stroke:#f01d0a;stroke-width:1;stroke-miterlimit:4;stroke-dasharray:none"
         y="168.56139"
         x="-14.522051"
         id="tspan944"
         sodipodi:role="line">Nomp!</tspan></text>
  </g>
</svg>
