<?xml version="1.0" encoding="UTF-8" standalone="no"?>
<svg
   xmlns:dc="http://purl.org/dc/elements/1.1/"
   xmlns:cc="http://creativecommons.org/ns#"
   xmlns:rdf="http://www.w3.org/1999/02/22-rdf-syntax-ns#"
   xmlns:svg="http://www.w3.org/2000/svg"
   xmlns="http://www.w3.org/2000/svg"
   xmlns:sodipodi="http://sodipodi.sourceforge.net/DTD/sodipodi-0.dtd"
   xmlns:inkscape="http://www.inkscape.org/namespaces/inkscape"
   width="512"
   height="512"
   id="svg2950"
   sodipodi:version="0.32"
   inkscape:version="1.0alpha2 (1:0.92.0+devel+201906271916+a9c687c)"
   version="1.0"
   sodipodi:docname="adr.svg"
   inkscape:output_extension="org.inkscape.output.svg.inkscape">
  <defs
     id="defs14" />
  <sodipodi:namedview
     id="base"
     pagecolor="#ffffff"
     bordercolor="#666666"
     borderopacity="1.0"
     inkscape:pageopacity="0.0"
     inkscape:pageshadow="2"
     inkscape:zoom="0.79881641"
     inkscape:cx="447.89086"
     inkscape:cy="150.43919"
     inkscape:document-units="px"
     inkscape:current-layer="layer2"
     showgrid="false"
     inkscape:window-width="1024"
     inkscape:window-height="687"
     inkscape:window-x="-4"
     inkscape:window-y="-4"
     inkscape:document-rotation="0"
     inkscape:pagecheckerboard="true"
     borderlayer="true" />
  <metadata
     id="metadata2955">
    <rdf:RDF>
      <cc:Work
         rdf:about="">
        <dc:format>image/svg+xml</dc:format>
        <dc:type
           rdf:resource="http://purl.org/dc/dcmitype/StillImage" />
        <dc:title />
      </cc:Work>
    </rdf:RDF>
  </metadata>
  <g
     inkscape:label="bg"
     inkscape:groupmode="layer"
     id="layer1"
     style="display:inline">
    <path
       inkscape:connector-curvature="0"
       id="back"
       style="opacity:1;fill:#e77817;fill-opacity:1;fill-rule:evenodd;stroke:none;stroke-width:6.19705;stop-opacity:1"
       d="M 256,512 512,256 256,0 0,256 Z"
       sodipodi:nodetypes="ccccc" />
  </g>
  <g
     inkscape:groupmode="layer"
     id="layer2"
     inkscape:label="dragon"
     style="display:inline">
    <g
       transform="matrix(2.1583795,0.5228855,-0.5228855,2.1583795,156.27096,-69.044075)"
       id="durg"
       style="fill:#1f1a17;fill-opacity:1">
      <path
         style="fill-opacity:1;stroke-width:1.29168;stroke-linecap:round;stroke-linejoin:round;stroke-miterlimit:8"
         d="m 52.225073,76.221892 -23.025667,11.63771 c -2.35143,1.188408 -1.771001,2.741838 0.813183,2.567374 l 18.579629,-1.254672 c -0.439504,-5.165488 2.064145,-10.296737 3.632855,-12.950412 z"
         id="path915"
         inkscape:connector-curvature="0" />
      <path
         style="fill-opacity:1;stroke-width:1.29168;stroke-linecap:round;stroke-linejoin:round;stroke-miterlimit:8"
         d="m 92.661599,64.410744 c -0.382233,-0.0078 -0.799677,0.0395 -1.252152,0.158094 L 68.758849,70.505843 C 62.371932,70.252471 56.278067,73.183166 54.004632,76.136749 52.124356,78.579574 49.93313,83.92083 50.37263,89.086315 51.276503,99.709572 62.505762,102.67719 69.276023,102.5623 l 26.361647,-0.44736 c 3.790445,-0.0643 4.76356,-3.043264 5.12551,-4.69243 l 1.0108,-4.605806 L 77.6509,89.727107 C 74.450145,89.317224 73.902083,88.294199 76.117872,87.026865 L 99.399175,73.71149 95.684764,66.248184 C 95.317287,65.50981 94.317951,64.444767 92.661599,64.410744 Z M 67.190503,74.458239 a 3.4049597,4.7234769 81.347415 0 1 4.244201,2.729679 3.4049597,4.7234769 81.347415 0 1 -4.157586,4.076857 3.4049597,4.7234769 81.347415 0 1 -5.181842,-2.655675 3.4049597,4.7234769 81.347415 0 1 4.157581,-4.076857 3.4049597,4.7234769 81.347415 0 1 0.937646,-0.07401 z"
         id="path1572"
         inkscape:connector-curvature="0" />
      <path
         style="fill-opacity:1;stroke:none;stroke-width:1.36508;stroke-linecap:round;stroke-linejoin:round;stroke-miterlimit:8"
         d="m 95.635691,75.406788 -0.0498,6.852737 -3.843754,-5.35361"
         id="path1577"
         inkscape:connector-curvature="0" />
      <path
         inkscape:connector-curvature="0"
         id="path1579"
         d="m 89.282056,77.705433 -0.0498,6.852732 -3.843754,-5.353621"
         style="fill-opacity:1;stroke:none;stroke-width:1.36508;stroke-linecap:round;stroke-linejoin:round;stroke-miterlimit:8" />
    </g>
    <path
       style="fill:none;stroke:#000000;stroke-width:4.5;stroke-linecap:round;stroke-linejoin:round;stroke-miterlimit:10;stroke-dasharray:none"
       d="M 256.92821,32.649274 479.327,255.25797 256.92821,477.86667 32.672951,255.25797 Z"
       id="border_in"
       inkscape:connector-curvature="0" />
    <path
       d="m 265.43554,8.5019531 16.97071,16.9707029 0.65625,1.705078 -0.82617,1.628907 -1.76368,0.480468 -1.24804,-0.632812 -16.97071,-16.970703 -0.65625,-1.7050784 0.82618,-1.6308594 1.76367,-0.4785156 z m 33.94141,33.9394529 16.9707,16.970703 0.6543,1.707032 -0.82422,1.628906 -1.76367,0.480469 -1.25,-0.632813 -16.9707,-16.970703 -0.6543,-1.707031 0.82617,-1.628907 1.76172,-0.480468 z m 33.94141,33.941406 16.96875,16.970704 0.65625,1.705078 -0.82618,1.630859 -1.76171,0.478516 -1.25,-0.632813 -16.97071,-16.96875 -0.65625,-1.707031 0.82617,-1.628906 1.76368,-0.480469 z m 33.93945,33.941408 16.9707,16.9707 0.65625,1.70508 -0.82617,1.63086 -1.76367,0.47852 -1.24805,-0.63282 -16.9707,-16.9707 -0.65625,-1.70508 0.82617,-1.6289 1.76367,-0.48047 z m 33.94141,33.9414 16.9707,16.97071 0.65625,1.70508 -0.82617,1.63086 -1.76367,0.47851 -1.24805,-0.63281 -16.97071,-16.9707 -0.65624,-1.70508 0.82617,-1.63086 1.76367,-0.47852 z m 33.94141,33.94141 16.9707,16.9707 0.65625,1.70508 -0.82617,1.63086 -1.76368,0.47852 -1.24804,-0.63281 -16.97071,-16.97071 -0.65625,-1.70508 0.82618,-1.63086 1.76367,-0.47851 z m 33.9414,33.94141 16.9707,16.9707 0.65625,1.70508 -0.82617,1.6289 -1.76367,0.48047 -1.24805,-0.63281 -16.9707,-16.9707 -0.65625,-1.70508 0.82617,-1.63086 1.76367,-0.47852 z m 33.94141,33.9414 8.32031,8.31836 0.65625,1.70703 -0.65625,1.47657 -8.65234,8.65039 -1.70508,0.65625 -1.62891,-0.82617 -0.48047,-1.76368 0.63282,-1.24804 7.05859,-7.06055 -6.72656,-6.72852 -0.65625,-1.70507 0.82617,-1.63086 1.76367,-0.47852 z m -17.14844,34.11133 0.48047,1.76172 -0.63281,1.25 -16.97071,16.9707 -1.70703,0.6543 -1.6289,-0.82422 -0.48047,-1.76367 0.63281,-1.25 16.9707,-16.9707 1.70703,-0.6543 z m -33.94141,33.93945 0.48047,1.76368 -0.63281,1.24804 -16.9707,16.97071 -1.70508,0.65625 -1.63086,-0.82618 -0.47852,-1.76171 0.63282,-1.25 16.9707,-16.97071 1.70508,-0.65625 z m -33.9414,33.94141 0.48047,1.76367 -0.63282,1.24805 -16.9707,16.9707 -1.70508,0.65625 -1.63086,-0.82617 -0.47852,-1.76367 0.63282,-1.24805 16.9707,-16.9707 1.70508,-0.65625 z m -33.93946,33.94141 0.47852,1.76367 -0.63282,1.24805 -16.9707,16.9707 -1.70508,0.65625 -1.63086,-0.82617 -0.47851,-1.76367 0.63281,-1.24805 16.9707,-16.9707 1.70508,-0.65625 z m -33.9414,33.9414 0.47851,1.76368 -0.63281,1.24804 -16.9707,16.97071 -1.70508,0.65625 -1.63086,-0.82618 -0.47852,-1.76367 0.63281,-1.24805 16.97071,-16.9707 1.70508,-0.65625 z m -33.94141,33.94141 0.47851,1.76367 -0.63281,1.24805 -16.9707,16.9707 -1.70508,0.65625 -1.62891,-0.82617 -0.48046,-1.76367 0.63281,-1.24805 16.9707,-16.9707 1.70508,-0.65625 z m -33.94141,33.94141 0.47852,1.76367 -0.63281,1.24805 -16.97071,16.9707 -1.70508,0.65625 -1.6289,-0.82617 -0.48047,-1.76368 0.63281,-1.24804 16.9707,-16.97071 1.70508,-0.65625 z M 246.56641,8.5019531 229.5957,25.472656 l -0.65625,1.705078 0.82617,1.628907 1.76368,0.480468 1.24804,-0.632812 16.97071,-16.970703 0.65625,-1.7050784 -0.82618,-1.6308594 -1.76367,-0.4785156 z M 212.625,42.441406 195.6543,59.412109 195,61.119141 l 0.82422,1.628906 1.76367,0.480469 1.25,-0.632813 16.9707,-16.970703 0.6543,-1.707031 -0.82617,-1.628907 -1.76172,-0.480468 z m -33.94141,33.941406 -16.96875,16.970704 -0.65625,1.705078 0.82618,1.630859 1.76171,0.478516 1.25,-0.632813 16.97071,-16.96875 0.65625,-1.707031 -0.82617,-1.628906 L 179.93359,75.75 Z m -33.93945,33.941408 -16.9707,16.9707 -0.65625,1.70508 0.82617,1.63086 1.76367,0.47852 1.24805,-0.63282 16.9707,-16.9707 0.65625,-1.70508 -0.82617,-1.6289 -1.76367,-0.48047 z m -33.94141,33.9414 -16.970699,16.97071 -0.65625,1.70508 0.826172,1.63086 1.763672,0.47851 1.248047,-0.63281 16.970708,-16.9707 0.65624,-1.70508 -0.82617,-1.63086 -1.76367,-0.47852 z m -33.941402,33.94141 -16.970703,16.9707 -0.65625,1.70508 0.826172,1.63086 1.763672,0.47852 1.248047,-0.63281 16.970703,-16.97071 0.65625,-1.70508 -0.826172,-1.63086 -1.763672,-0.47851 z m -33.941406,33.94141 -16.970703,16.9707 -0.65625,1.70508 0.826172,1.6289 1.763671,0.48047 1.248047,-0.63281 16.970703,-16.9707 0.65625,-1.70508 -0.826171,-1.63086 -1.763672,-0.47852 z m -33.9414064,33.9414 -8.32031248,8.31836 -0.65624999,1.70703 0.65624999,1.47657 8.65234378,8.65039 1.7050781,0.65625 1.628906,-0.82617 L 13.125,264.30859 12.492188,263.06055 5.4335938,256 l 6.7265622,-6.72852 0.65625,-1.70507 -0.826172,-1.63086 -1.763672,-0.47852 z m 17.1484374,34.11133 -0.480469,1.76172 0.632813,1.25 16.970703,16.9707 1.707031,0.6543 1.628907,-0.82422 L 47.066406,298.25 46.433594,297 29.462891,280.0293 27.755859,279.375 Z m 33.941406,33.93945 -0.480468,1.76368 0.632812,1.24804 16.970703,16.97071 1.705078,0.65625 1.63086,-0.82618 0.478515,-1.76171 -0.632812,-1.25 -16.970703,-16.97071 -1.705078,-0.65625 z m 33.941407,33.94141 -0.480469,1.76367 0.632812,1.24805 16.970701,16.9707 1.70508,0.65625 1.63086,-0.82617 0.47852,-1.76367 -0.63282,-1.24805 -16.9707,-16.9707 -1.705078,-0.65625 z m 33.939454,33.94141 -0.47852,1.76367 0.63282,1.24805 16.9707,16.9707 1.70508,0.65625 1.63086,-0.82617 0.47851,-1.76367 -0.63281,-1.24805 -16.9707,-16.9707 -1.70508,-0.65625 z m 33.9414,33.9414 -0.47851,1.76368 0.63281,1.24804 16.9707,16.97071 1.70508,0.65625 1.63086,-0.82618 0.47852,-1.76367 -0.63281,-1.24805 -16.97071,-16.9707 -1.70508,-0.65625 z m 33.94141,33.94141 -0.47851,1.76367 0.63281,1.24805 16.9707,16.9707 1.70508,0.65625 1.62891,-0.82617 0.48046,-1.76367 -0.63281,-1.24805 -16.9707,-16.9707 -1.70508,-0.65625 z m 33.94141,33.94141 -0.47852,1.76367 0.63281,1.24805 16.97071,16.9707 1.70508,0.65625 1.6289,-0.82617 0.48047,-1.76368 -0.63281,-1.24804 -16.9707,-16.97071 -1.70508,-0.65625 z"
       style="color:#000000;font-style:normal;font-variant:normal;font-weight:normal;font-stretch:normal;font-size:medium;line-height:normal;font-family:sans-serif;font-variant-ligatures:normal;font-variant-position:normal;font-variant-caps:normal;font-variant-numeric:normal;font-variant-alternates:normal;font-variant-east-asian:normal;font-feature-settings:normal;font-variation-settings:normal;text-indent:0;text-align:start;text-decoration:none;text-decoration-line:none;text-decoration-style:solid;text-decoration-color:#000000;letter-spacing:normal;word-spacing:normal;text-transform:none;writing-mode:lr-tb;direction:ltr;text-orientation:mixed;dominant-baseline:auto;baseline-shift:baseline;text-anchor:start;white-space:normal;shape-padding:0;shape-margin:0;inline-size:0;clip-rule:nonzero;display:inline;overflow:visible;visibility:visible;opacity:1;isolation:auto;mix-blend-mode:normal;color-interpolation:sRGB;color-interpolation-filters:linearRGB;solid-color:#000000;solid-opacity:1;vector-effect:none;fill:#000000;fill-opacity:1;fill-rule:evenodd;stroke:none;stroke-width:4.5;stroke-linecap:round;stroke-linejoin:round;stroke-miterlimit:4;stroke-dasharray:24, 24;stroke-dashoffset:36;stroke-opacity:1;color-rendering:auto;image-rendering:auto;shape-rendering:auto;text-rendering:auto;enable-background:accumulate;stop-color:#000000;stop-opacity:1"
       id="border_out" />
  </g>
</svg>
