<?xml version="1.0" encoding="UTF-8" standalone="no"?>
<!-- Created with Inkscape (http://www.inkscape.org/) -->

<svg
   xmlns:dc="http://purl.org/dc/elements/1.1/"
   xmlns:cc="http://creativecommons.org/ns#"
   xmlns:rdf="http://www.w3.org/1999/02/22-rdf-syntax-ns#"
   xmlns:svg="http://www.w3.org/2000/svg"
   xmlns="http://www.w3.org/2000/svg"
   xmlns:xlink="http://www.w3.org/1999/xlink"
   xmlns:sodipodi="http://sodipodi.sourceforge.net/DTD/sodipodi-0.dtd"
   xmlns:inkscape="http://www.inkscape.org/namespaces/inkscape"
   width="128"
   height="128"
   viewBox="0 0 33.866666 33.866668"
   version="1.1"
   id="svg4575"
   inkscape:version="0.92+devel (bdcbac3f3e, 2017-08-14, custom)"
   sodipodi:docname="icon_image_svg.svg"
   inkscape:export-filename="../icons/32x32/image_svg.png"
   inkscape:export-xdpi="24"
   inkscape:export-ydpi="24">
  <defs
     id="defs4569">
    <inkscape:path-effect
       effect="taper_stroke"
       id="path-effect948"
       is_visible="true"
       stroke_width="0.26458335"
       attach_start="0.6335946"
       end_offset="0.74923041"
       smoothing="0.5"
       jointype="round"
       miter_limit="100" />
    <inkscape:path-effect
       effect="taper_stroke"
       id="path-effect944"
       is_visible="true"
       stroke_width="0.36"
       attach_start="0.69234583"
       end_offset="0.54496782"
       smoothing="0.5"
       jointype="extrapolated"
       miter_limit="100" />
    <clipPath
       clipPathUnits="userSpaceOnUse"
       id="clipPath917">
      <rect
         style="fill:#ff5704;stroke-width:2.11666679;stroke-linecap:round;stroke-linejoin:round"
         id="rect919"
         width="18.684454"
         height="17.930328"
         x="29.926601"
         y="240.67487"
         transform="rotate(-90)" />
    </clipPath>
  </defs>
  <sodipodi:namedview
     id="base"
     pagecolor="#ffffff"
     bordercolor="#666666"
     borderopacity="1.0"
     inkscape:pageopacity="0.0"
     inkscape:pageshadow="2"
     inkscape:zoom="4.0000001"
     inkscape:cx="12.384738"
     inkscape:cy="7.6595995"
     inkscape:document-units="px"
     inkscape:current-layer="layer3"
     showgrid="false"
     units="px"
     inkscape:pagecheckerboard="false"
     inkscape:window-width="2408"
     inkscape:window-height="1411"
     inkscape:window-x="30"
     inkscape:window-y="0"
     inkscape:window-maximized="1"
     inkscape:document-rotation="0"
     borderlayer="true"
     inkscape:snap-global="true"
     inkscape:object-paths="false"
     inkscape:snap-others="true"
     inkscape:snap-smooth-nodes="true"
     inkscape:snap-bbox="false"
     inkscape:snap-bbox-midpoints="true"
     inkscape:snap-object-midpoints="true" />
  <metadata
     id="metadata4572">
    <rdf:RDF>
      <cc:Work
         rdf:about="">
        <dc:format>image/svg+xml</dc:format>
        <dc:type
           rdf:resource="http://purl.org/dc/dcmitype/StillImage" />
        <dc:title />
      </cc:Work>
    </rdf:RDF>
  </metadata>
  <g
     inkscape:label="ref"
     inkscape:groupmode="layer"
     id="layer1"
     transform="translate(0,-263.13333)"
     style="display:none"
     sodipodi:insensitive="true">
    <image
       y="-171.03253"
       x="215.44983"
       width="130.67477"
       height="184.71442"
       preserveAspectRatio="none"
       xlink:href="file:///home/melano/Pictures/Dragons/Glax/sketches/icons.jpg"
       id="image911"
       sodipodi:absref="/home/melano/Pictures/Dragons/Glax/sketches/icons.jpg"
       transform="matrix(0.19298656,2.6481904,-2.6481904,0.19298656,-134.56625,-368.54268)"
       clip-path="url(#clipPath917)" />
  </g>
  <g
     inkscape:groupmode="layer"
     id="layer4"
     inkscape:label="file"
     style="display:inline">
    <path
       style="fill:#ffffff;stroke:#000000;stroke-width:0.34132376;stroke-linecap:round;stroke-linejoin:round;stroke-miterlimit:10"
       d="M 0.67121959,2.7037441 C 0.52743875,9.1232648 -0.03191351,28.410686 0.24872916,32.943551 4.7022988,31.730416 29.641931,33.215326 32.09616,33.696007 33.92689,27.84468 33.56014,4.1586696 33.696006,0.98092517 28.350037,1.8788015 21.699905,-0.23237998 16.15946,0.24172251 10.619016,0.71582511 4.5065205,2.8926684 0.67121959,2.7037441 Z"
       id="path847"
       inkscape:connector-curvature="0" />
  </g>
  <g
     inkscape:groupmode="layer"
     id="layer2"
     inkscape:label="dragon"
     style="display:inline">
    <path
       style="fill:none;stroke:#3250b0;stroke-width:1.0239712;stroke-linecap:round;stroke-linejoin:round;stroke-miterlimit:10;stroke-dasharray:none"
       d="M 26.625525,24.078848 C 25.755059,23.584402 21.528216,21.17495 18.741154,20.846807 15.382224,21.5075 9.3904965,23.046776 7.6477572,23.475101 5.7804252,22.783986 4.6671471,20.928751 5.4556103,17.233676 6.4741839,16.653605 9.1653365,15.866935 9.7219033,15.672915 11.365086,10.683593 15.169936,11.01776 17.857146,10.905458 21.287515,9.1304444 28.486311,7.619294 29.864118,7.3315435 c -3.717492,2.9147715 -6.086705,4.6800915 -6.789339,6.7347055 2.573213,0.38692 6.596918,2.592177 7.119745,3.177428"
       id="path850"
       inkscape:connector-curvature="0"
       sodipodi:nodetypes="ccccccccc" />
  </g>
  <g
     inkscape:groupmode="layer"
     id="layer3"
     inkscape:label="points"
     style="display:inline">
    <path
       style="fill:#b53147;stroke:#000000;stroke-width:0.68264753;stroke-linecap:round;stroke-linejoin:round;stroke-miterlimit:10;stroke-dasharray:none"
       d="M 5.4556107,17.233676 6.5190179,12.949839"
       id="path998"
       inkscape:connector-curvature="0" />
    <path
       style="fill:#ffffff;stroke:#000000;stroke-width:0.68264753;stroke-linecap:round;stroke-linejoin:round;stroke-miterlimit:10;stroke-dasharray:none"
       d="M 23.887355,21.059822 18.741154,20.846807"
       id="path957"
       inkscape:connector-curvature="0" />
    <path
       style="fill:none;stroke:#000000;stroke-width:0.68264753;stroke-linecap:round;stroke-linejoin:round;stroke-miterlimit:10;stroke-dasharray:none"
       d="M 12.182963,24.543939 7.6477576,23.475101 4.917001,24.847381"
       id="path959"
       inkscape:connector-curvature="0" />
    <path
       style="fill:none;stroke:#000000;stroke-width:0.68264753;stroke-linecap:round;stroke-linejoin:round;stroke-miterlimit:10;stroke-dasharray:none"
       d="m 3.08578,21.586036 2.3698304,-4.35236"
       id="path961"
       inkscape:connector-curvature="0" />
    <path
       style="fill:none;stroke:#000000;stroke-width:0.68264753;stroke-linecap:round;stroke-linejoin:round;stroke-miterlimit:10;stroke-dasharray:none"
       d="m 9.7219033,15.672915 -0.15026,-5.423874"
       id="path963"
       inkscape:connector-curvature="0"
       sodipodi:nodetypes="cc" />
    <path
       style="fill:none;stroke:#000000;stroke-width:0.68264753;stroke-linecap:round;stroke-linejoin:round;stroke-miterlimit:10;stroke-dasharray:none"
       d="m 13.715657,7.7159052 4.141489,3.1895528"
       id="path965"
       inkscape:connector-curvature="0" />
    <ellipse
       style="fill:#b53147;stroke:none;stroke-width:0.95950884;stroke-linecap:round;stroke-linejoin:round;stroke-miterlimit:10;stroke-dasharray:none"
       id="path853-5"
       cx="7.6477566"
       cy="23.475101"
       rx="1.2771848"
       ry="1.3383443" />
    <ellipse
       style="fill:#ffffff;stroke:#000000;stroke-width:0.34132376;stroke-linecap:round;stroke-linejoin:round;stroke-miterlimit:10;stroke-dasharray:none"
       id="path853-9"
       cx="13.715655"
       cy="7.7159047"
       rx="0.90865958"
       ry="0.9521718" />
    <ellipse
       style="fill:#ffffff;stroke:#000000;stroke-width:0.34132376;stroke-linecap:round;stroke-linejoin:round;stroke-miterlimit:10;stroke-dasharray:none"
       id="path853-9-1"
       cx="9.5716438"
       cy="10.24904"
       rx="0.90865958"
       ry="0.9521718" />
    <ellipse
       style="fill:#ffffff;stroke:#000000;stroke-width:0.34132376;stroke-linecap:round;stroke-linejoin:round;stroke-miterlimit:10;stroke-dasharray:none"
       id="path853-9-7"
       cx="3.0857801"
       cy="21.586035"
       rx="0.90865958"
       ry="0.9521718" />
    <ellipse
       style="fill:#ffffff;stroke:#000000;stroke-width:0.34132376;stroke-linecap:round;stroke-linejoin:round;stroke-miterlimit:10;stroke-dasharray:none"
       id="path853-9-0"
       cx="4.9170012"
       cy="24.847382"
       rx="0.90865958"
       ry="0.9521718" />
    <ellipse
       style="fill:#ffffff;stroke:#000000;stroke-width:0.34132376;stroke-linecap:round;stroke-linejoin:round;stroke-miterlimit:10;stroke-dasharray:none"
       id="path853-9-9"
       cx="12.182964"
       cy="24.543938"
       rx="0.90865958"
       ry="0.9521718" />
    <ellipse
       style="fill:#ffffff;stroke:#000000;stroke-width:0.34132376;stroke-linecap:round;stroke-linejoin:round;stroke-miterlimit:10;stroke-dasharray:none"
       id="path853-9-6"
       cx="23.887354"
       cy="21.05982"
       rx="0.90865958"
       ry="0.9521718" />
    <ellipse
       style="fill:#ffffff;stroke:#000000;stroke-width:0.34132376;stroke-linecap:round;stroke-linejoin:round;stroke-miterlimit:10;stroke-dasharray:none"
       id="path853-9-7-0"
       cx="6.5190177"
       cy="12.94984"
       rx="0.90865958"
       ry="0.9521718" />
    <use
       x="0"
       y="0"
       xlink:href="#path853-5"
       id="use1000"
       transform="translate(-2.1921464,-6.2414257)"
       width="100%"
       height="100%" />
    <use
       x="0"
       y="0"
       xlink:href="#path853-5"
       id="use1006"
       transform="translate(2.0741466,-7.8021861)"
       width="100%"
       height="100%" />
    <use
       x="0"
       y="0"
       xlink:href="#path853-5"
       id="use1008"
       transform="translate(10.209389,-12.569643)"
       width="100%"
       height="100%" />
    <use
       x="0"
       y="0"
       xlink:href="#path853-5"
       id="use1010"
       transform="translate(22.216362,-16.143558)"
       width="100%"
       height="100%" />
    <use
       x="0"
       y="0"
       xlink:href="#path853-5"
       id="use1012"
       transform="translate(15.427023,-9.4088521)"
       width="100%"
       height="100%" />
    <use
       x="0"
       y="0"
       xlink:href="#path853-5"
       id="use1014"
       transform="translate(11.093399,-2.6282941)"
       width="100%"
       height="100%" />
  </g>
</svg>
