<?xml version="1.0" encoding="UTF-8" standalone="no"?>
<svg
   xmlns:osb="http://www.openswatchbook.org/uri/2009/osb"
   xmlns:dc="http://purl.org/dc/elements/1.1/"
   xmlns:cc="http://creativecommons.org/ns#"
   xmlns:rdf="http://www.w3.org/1999/02/22-rdf-syntax-ns#"
   xmlns:svg="http://www.w3.org/2000/svg"
   xmlns="http://www.w3.org/2000/svg"
   xmlns:sodipodi="http://sodipodi.sourceforge.net/DTD/sodipodi-0.dtd"
   xmlns:inkscape="http://www.inkscape.org/namespaces/inkscape"
   inkscape:export-ydpi="96"
   inkscape:export-xdpi="96"
   inkscape:export-filename="glax2.png"
   inkscape:version="0.92+devel (unknown)"
   sodipodi:docname="glax.svg"
   viewBox="0 0 512 400"
   height="400"
   width="512"
   id="svg4683"
   version="1.1">
  <metadata
     id="metadata4689">
    <rdf:RDF>
      <cc:Work
         rdf:about="">
        <dc:format>image/svg+xml</dc:format>
        <dc:type
           rdf:resource="http://purl.org/dc/dcmitype/StillImage" />
        <dc:title />
      </cc:Work>
    </rdf:RDF>
  </metadata>
  <defs
     id="defs4687">
    <linearGradient
       gradientTransform="translate(0,-969.76941)"
       osb:paint="solid"
       id="flesh-outline-alt">
      <stop
         id="stop982"
         offset="0"
         style="stop-color:#fb6e98;stop-opacity:1;" />
    </linearGradient>
    <linearGradient
       gradientTransform="translate(0,-969.76977)"
       osb:paint="solid"
       id="flesh-shaded-outline">
      <stop
         id="stop972"
         offset="0"
         style="stop-color:#c12e53;stop-opacity:1;" />
    </linearGradient>
    <linearGradient
       gradientTransform="translate(0,-969.76977)"
       osb:paint="solid"
       id="flesh-shaded">
      <stop
         id="stop962"
         offset="0"
         style="stop-color:#e84577;stop-opacity:1;" />
    </linearGradient>
    <linearGradient
       gradientTransform="translate(0,-969.76977)"
       osb:paint="solid"
       id="flesh-outline">
      <stop
         id="stop952"
         offset="0"
         style="stop-color:#ec658c;stop-opacity:1;" />
    </linearGradient>
    <linearGradient
       gradientTransform="translate(0,-1939.5391)"
       osb:paint="solid"
       id="flesh">
      <stop
         id="stop946"
         offset="0"
         style="stop-color:#fa8cab;stop-opacity:1;" />
    </linearGradient>
    <linearGradient
       gradientTransform="translate(0,-1081.7693)"
       osb:paint="solid"
       id="horns-outline">
      <stop
         id="stop932"
         offset="0"
         style="stop-color:#2d2d2d;stop-opacity:1;" />
    </linearGradient>
    <linearGradient
       gradientTransform="translate(0,-1081.7693)"
       osb:paint="solid"
       id="horns">
      <stop
         id="stop922"
         offset="0"
         style="stop-color:#3a3c3f;stop-opacity:1;" />
    </linearGradient>
    <linearGradient
       gradientTransform="translate(0,-1081.7693)"
       osb:paint="solid"
       id="belly">
      <stop
         id="stop912"
         offset="0"
         style="stop-color:#a0c4f4;stop-opacity:1;" />
    </linearGradient>
    <linearGradient
       gradientTransform="translate(0,-111.99984)"
       osb:paint="solid"
       id="alt">
      <stop
         id="stop902"
         offset="0"
         style="stop-color:#233275;stop-opacity:1;" />
    </linearGradient>
    <linearGradient
       gradientTransform="translate(0,-7124.3851)"
       osb:paint="solid"
       id="outline">
      <stop
         id="stop892"
         offset="0"
         style="stop-color:#1d2d48;stop-opacity:1;" />
    </linearGradient>
    <linearGradient
       gradientTransform="translate(0,-1305.7685)"
       osb:paint="solid"
       id="main">
      <stop
         id="stop882"
         offset="0"
         style="stop-color:#295aa8;stop-opacity:1;" />
    </linearGradient>
    <inkscape:path-effect
       miter_limit="100"
       jointype="round"
       smoothing="0.5"
       end_offset="0.11021248"
       attach_start="0.031402786"
       stroke_width="6"
       is_visible="true"
       id="path-effect963"
       effect="taper_stroke" />
    <inkscape:path-effect
       miter_limit="100"
       jointype="round"
       smoothing="0.5"
       end_offset="0.41968968"
       attach_start="0.25651448"
       stroke_width="6"
       is_visible="true"
       id="path-effect888"
       effect="taper_stroke" />
    <inkscape:path-effect
       miter_limit="100"
       jointype="extrapolated"
       smoothing="0.5"
       end_offset="0.25306335"
       attach_start="0.45430786"
       stroke_width="6"
       is_visible="true"
       id="path-effect886"
       effect="taper_stroke" />
    <inkscape:path-effect
       miter_limit="100"
       jointype="extrapolated"
       smoothing="0.5"
       end_offset="0"
       attach_start="1.1071701"
       stroke_width="6"
       is_visible="true"
       id="path-effect882"
       effect="taper_stroke" />
    <inkscape:path-effect
       miter_limit="100"
       jointype="round"
       smoothing="0.5"
       end_offset="0"
       attach_start="0.46845049"
       stroke_width="6"
       is_visible="true"
       id="path-effect884-5"
       effect="taper_stroke" />
    <inkscape:path-effect
       miter_limit="100"
       jointype="extrapolated"
       smoothing="0.5"
       end_offset="0.2"
       attach_start="0.031402786"
       stroke_width="6"
       is_visible="true"
       id="path-effect963-3"
       effect="taper_stroke" />
  </defs>
  <sodipodi:namedview
     inkscape:pagecheckerboard="true"
     inkscape:snap-smooth-nodes="true"
     borderlayer="true"
     inkscape:snap-page="true"
     inkscape:measure-end="0,0"
     inkscape:measure-start="0,0"
     inkscape:bbox-nodes="true"
     inkscape:snap-nodes="true"
     inkscape:snap-bbox="false"
     inkscape:document-rotation="0"
     fit-margin-bottom="0"
     fit-margin-right="0"
     fit-margin-left="0"
     fit-margin-top="0"
     inkscape:snap-global="false"
     inkscape:current-layer="layer12"
     inkscape:window-maximized="1"
     inkscape:window-y="0"
     inkscape:window-x="30"
     inkscape:cy="44.655602"
     inkscape:cx="19.853824"
     inkscape:zoom="1.1396485"
     showgrid="false"
     id="namedview4685"
     inkscape:window-height="1411"
     inkscape:window-width="2408"
     inkscape:pageshadow="2"
     inkscape:pageopacity="0"
     guidetolerance="10"
     gridtolerance="10"
     objecttolerance="10"
     borderopacity="1"
     bordercolor="#666666"
     pagecolor="#ffffff" />
  <g
     style="display:none"
     sodipodi:insensitive="true"
     inkscape:label="bg"
     id="layer13"
     inkscape:groupmode="layer">
    <rect
       y="0"
       x="0"
       height="400"
       width="512"
       id="rect957"
       style="fill:#ffffff;stroke-width:6;stroke-linecap:round;stroke-linejoin:round" />
    <rect
       y="135"
       x="296"
       height="157"
       width="382"
       id="text_box_max_x"
       style="fill:green;stroke-width:6;stroke-linecap:round;stroke-linejoin:round" />
    <rect
       y="135"
       x="130"
       height="157"
       width="382"
       id="text_box"
       style="fill:red;stroke-width:6;stroke-linecap:round;stroke-linejoin:round" />
  </g>
  <g
     class="durg"
     style="display:inline"
     inkscape:label="dragon b"
     id="layer_durg_bottom"
     inkscape:groupmode="layer">
    <g
       style="display:inline"
       inkscape:label="jaw b"
       id="layer12"
       inkscape:groupmode="layer">
      <path
         style="display:inline;opacity:1;fill:#ffffff;fill-opacity:1;stroke:#bcdeea;stroke-width:4.47558737;stroke-linecap:round;stroke-linejoin:round;stroke-miterlimit:4;stroke-dasharray:none;stroke-opacity:1"
         d="m 405.48736,284.62343 c 2.69995,-1.8409 3.80448,-18.4086 -0.98178,-22.4585 -0.73634,4.9089 -6.87253,16.8132 -12.64057,16.6905"
         id="path1747"
         inkscape:connector-curvature="0"
         sodipodi:nodetypes="ccc" />
      <path
         style="display:inline;opacity:1;fill:#ffffff;fill-opacity:1;stroke:#bcdeea;stroke-width:4.47558737;stroke-linecap:round;stroke-linejoin:round;stroke-miterlimit:4;stroke-dasharray:none;stroke-opacity:1"
         d="m 379.93206,269.65903 c 2.20906,-1.8409 1.26007,-10.5823 -1.07171,-13.5276 -1.84086,3.9272 -6.50314,8.4524 -7.8531,8.3296"
         id="path1749"
         inkscape:connector-curvature="0"
         sodipodi:nodetypes="ccc" />
      <path
         style="display:inline;opacity:1;fill:#e84d66;stroke:#b53147;stroke-width:6.77128839;stroke-linecap:round;stroke-linejoin:round;stroke-miterlimit:8;stroke-dasharray:none"
         d="m 334.85066,179.01823 c -19.00012,17.8076 -16.07443,59.0446 -8.47217,67.0843 -26.64368,3.5518 -65.14434,4.7907 -65.14434,4.7907 l -11.4572,-61.7441 z"
         id="path1751"
         inkscape:connector-curvature="0"
         sodipodi:nodetypes="ccccc" />
      <path
         style="display:inline;opacity:1;fill:#e84d66;stroke:#b53147;stroke-width:6.77128839;stroke-linecap:round;stroke-linejoin:round;stroke-miterlimit:8;stroke-dasharray:none;stroke-opacity:1"
         d="m 274.81413,250.87543 c 14.4798,-13.3609 37.63158,-17.0484 61.71236,-7.8631 22.84382,8.7133 26.85724,24.496 55.36431,33.7826 28.02855,9.1307 41.50688,-3.911 53.61167,-10.4826 -8.90593,24.2448 -26.89587,36.0224 -49.82033,38.1351 -23.1563,2.1343 -95.20085,4.5717 -118.56065,-13.2496"
         id="path1753"
         inkscape:connector-curvature="0"
         sodipodi:nodetypes="csscsc"
         inkscape:transform-center-x="-7.7443305"
         inkscape:transform-center-y="3.0687597" />
      <path
         style="display:inline;opacity:1;fill:#ffffff;fill-opacity:1;stroke:#bcdeea;stroke-width:4.47558737;stroke-linecap:round;stroke-linejoin:round;stroke-miterlimit:4;stroke-dasharray:none;stroke-opacity:1"
         d="m 427.76859,134.61249 c 1.73557,5.0331 0.86776,16.6615 -4.33896,19.612 -0.86781,-6.4217 -2.95049,-14.926 -5.3803,-15.7938"
         id="path1759"
         inkscape:connector-curvature="0" />
    </g>
  </g>
  <g
     style="display:none"
     inkscape:label="text"
     id="layer_text"
     inkscape:groupmode="layer">
    <path
       sodipodi:nodetypes="ccccccccccccccssscscscscccccsscsccsscccscscscscsccccccccccccsccccccssccccc"
       inkscape:connector-curvature="0"
       id="path943"
       d="m 270.68706,189.28484 c -1.54291,0 -2.8729,0.7303 -3.84601,1.5996 -0.97308,0.8693 -1.7324,1.9249 -2.46647,3.186 -0.0479,0.082 -0.092,0.1669 -0.13218,0.2533 -1.73327,3.7282 -2.95512,6.584 -3.6997,8.7113 -1.98773,5.2245 -4.15135,10.7676 -6.49213,16.6355 l -6.53246,16.0643 c 0,0 -0.003,0.01 -0.003,0.01 -0.80021,1.9857 -1.66858,3.6137 -2.56233,4.8885 -0.86252,1.2 -1.68861,2.0789 -2.44526,2.7147 -0.14318,0.051 -0.32036,0.1139 -0.61358,0.2019 -0.71094,0.2132 -1.80249,0.5032 -3.21024,0.8477 -0.002,3e-4 -0.004,0 -0.006,0 -1.40392,0.3309 -2.6945,0.825 -3.80565,1.8054 -1.11284,0.9819 -1.87205,2.6085 -1.87205,4.1175 0,1.4686 0.89587,3.2619 2.20306,4.0993 1.30719,0.8374 2.63298,0.987 3.9974,0.987 1.10393,0 2.41569,-0.1296 4.13062,-0.3593 1.65136,-0.1868 2.88122,-0.2704 3.52309,-0.2704 0.91563,0 2.49871,0.088 4.61602,0.2775 2.19392,0.2285 3.8678,0.3522 5.16906,0.3522 1.40005,0 2.87868,-0.2491 4.15787,-1.2766 1.27921,-1.0276 1.89728,-2.7628 1.89728,-4.1972 0,-1.7808 -1.20822,-3.1428 -2.2525,-3.839 -1.04431,-0.6962 -2.16362,-1.1005 -3.50592,-1.4734 -0.62184,-0.1727 -0.77964,-0.2888 -1.02938,-0.4158 0.19412,-0.7738 0.68655,-2.6271 1.89022,-5.4607 0,0 0.003,-0.01 0.004,-0.01 1.43044,-3.3973 2.99546,-5.027 3.3152,-5.2286 0.20861,-0.1316 2.68802,-0.5763 6.85845,-0.5763 0.54253,0 1.4672,0.03 2.69959,0.093 1.28653,0.066 2.26726,0.1009 3.01644,0.1009 0.24332,0 0.29582,0 0.5924,0.2503 0.2951,0.2489 0.76545,0.8336 1.23123,1.8488 0.76859,1.7272 1.1313,3.4162 1.1313,5.1671 0,1.7688 -0.39466,2.655 -0.92138,3.2253 -0.0289,0.031 -0.84721,0.7366 -2.21013,1.3897 -0.0156,0.01 -0.0316,0.015 -0.0475,0.023 -0.77639,0.3882 -1.48291,0.8157 -2.1435,1.4946 -0.66059,0.6789 -1.31394,1.7851 -1.31394,3.0709 0,1.4957 0.46531,3.2012 1.71361,4.389 1.24825,1.1879 2.89711,1.5693 4.38995,1.5693 1.27899,0 2.75431,-0.1888 4.68165,-0.5197 1.82789,-0.2789 3.18516,-0.4007 3.844,-0.4007 0.86451,0 2.49491,0.1284 4.69068,0.4108 2.30996,0.3291 4.06558,0.5096 5.48192,0.5096 1.47841,0 3.15115,-1.2395 3.70276,-2.3867 0.55154,-1.1473 0.60849,-2.1444 0.60849,-3.2325 0,-1.4 -0.661,-2.7538 -1.51174,-3.6653 -0.85077,-0.9115 -1.85697,-1.5252 -2.99528,-2.0537 -1.24579,-0.5994 -2.20785,-1.067 -2.85095,-1.3847 -0.24649,-0.1217 -0.40048,-0.2 -0.55104,-0.2765 -0.33784,-0.3462 -1.74799,-2.6255 -2.90747,-6.6223 l -2.30297,-9.4056 c -0.005,-0.018 -0.01,-0.036 -0.0141,-0.053 -1.07525,-4.0729 -2.2791,-8.3359 -3.61191,-12.7895 -0.004,-0.013 -0.008,-0.026 -0.0121,-0.039 -1.69678,-5.4105 -2.98599,-9.4351 -3.90055,-12.182 -0.76421,-2.8031 -1.32479,-4.9322 -1.66514,-6.3246 -0.0138,-0.057 -0.0292,-0.1134 -0.0464,-0.1695 -0.43581,-1.4262 -0.99167,-2.6847 -1.9558,-3.7693 -0.96414,-1.0847 -2.54549,-1.9125 -4.10944,-1.9125 z m -2.27471,22.3354 c 0.413,1.0855 0.91796,2.5182 1.48958,4.389 0.003,0.01 0.005,0.017 0.008,0.026 1.10463,3.5032 1.52595,6.3047 1.50071,6.4619 -0.3946,0.071 -0.8174,0.1634 -1.45023,0.1634 h -2.17986 c -1.31974,0 -2.33505,-0.034 -3.06996,-0.086 0.145,-0.924 0.79225,-3.6788 2.33831,-7.7829 v -0.01 c 0.552,-1.4719 0.92953,-2.2067 1.36242,-3.1668 z"
       style="color:#000000;font-style:normal;font-variant:normal;font-weight:bold;font-stretch:normal;font-size:medium;line-height:100%;font-family:Maya;-inkscape-font-specification:'Maya Bold';font-variant-ligatures:normal;font-variant-position:normal;font-variant-caps:normal;font-variant-numeric:normal;font-variant-alternates:normal;font-feature-settings:normal;text-indent:0;text-align:start;text-decoration:none;text-decoration-line:none;text-decoration-style:solid;text-decoration-color:#000000;letter-spacing:16px;word-spacing:normal;text-transform:none;writing-mode:lr-tb;direction:ltr;text-orientation:mixed;dominant-baseline:auto;baseline-shift:baseline;text-anchor:start;white-space:normal;shape-padding:0;clip-rule:nonzero;display:inline;overflow:visible;visibility:visible;isolation:auto;mix-blend-mode:normal;color-interpolation:sRGB;color-interpolation-filters:linearRGB;solid-color:#000000;solid-opacity:1;vector-effect:none;fill:#ff210c;fill-opacity:1;fill-rule:nonzero;stroke:#670d04;stroke-width:6;stroke-linecap:butt;stroke-linejoin:round;stroke-miterlimit:4;stroke-dasharray:none;stroke-dashoffset:0;stroke-opacity:1;color-rendering:auto;image-rendering:auto;shape-rendering:auto;text-rendering:auto;enable-background:accumulate" />
    <path
       style="color:#000000;font-style:normal;font-variant:normal;font-weight:bold;font-stretch:normal;font-size:medium;line-height:100%;font-family:Maya;-inkscape-font-specification:'Maya Bold';font-variant-ligatures:normal;font-variant-position:normal;font-variant-caps:normal;font-variant-numeric:normal;font-variant-alternates:normal;font-feature-settings:normal;text-indent:0;text-align:start;text-decoration:none;text-decoration-line:none;text-decoration-style:solid;text-decoration-color:#000000;letter-spacing:16px;word-spacing:normal;text-transform:none;writing-mode:lr-tb;direction:ltr;text-orientation:mixed;dominant-baseline:auto;baseline-shift:baseline;text-anchor:start;white-space:normal;shape-padding:0;clip-rule:nonzero;display:inline;overflow:visible;visibility:visible;isolation:auto;mix-blend-mode:normal;color-interpolation:sRGB;color-interpolation-filters:linearRGB;solid-color:#000000;solid-opacity:1;vector-effect:none;fill:#ff210c;fill-opacity:1;fill-rule:nonzero;stroke:#670d04;stroke-width:6;stroke-linecap:butt;stroke-linejoin:round;stroke-miterlimit:4;stroke-dasharray:none;stroke-dashoffset:0;stroke-opacity:1;color-rendering:auto;image-rendering:auto;shape-rendering:auto;text-rendering:auto;enable-background:accumulate"
       d="m 347.68706,189.28484 c -1.54291,0 -2.8729,0.7303 -3.84601,1.5996 -0.97308,0.8693 -1.7324,1.9249 -2.46647,3.186 -0.0479,0.082 -0.092,0.1669 -0.13218,0.2533 -1.73327,3.7282 -2.95512,6.584 -3.6997,8.7113 -1.98773,5.2245 -4.15135,10.7676 -6.49213,16.6355 l -6.53246,16.0643 c 0,0 -0.003,0.01 -0.003,0.01 -0.80021,1.9857 -1.66858,3.6137 -2.56233,4.8885 -0.86252,1.2 -1.68861,2.0789 -2.44526,2.7147 -0.14318,0.051 -0.32036,0.1139 -0.61358,0.2019 -0.71094,0.2132 -1.80249,0.5032 -3.21024,0.8477 -0.002,3e-4 -0.004,0 -0.006,0 -1.40392,0.3309 -2.6945,0.825 -3.80565,1.8054 -1.11284,0.9819 -1.87205,2.6085 -1.87205,4.1175 0,1.4686 0.89587,3.2619 2.20306,4.0993 1.30719,0.8374 2.63298,0.987 3.9974,0.987 1.10393,0 2.41569,-0.1296 4.13062,-0.3593 1.65136,-0.1868 2.88122,-0.2704 3.52309,-0.2704 0.91563,0 2.49871,0.088 4.61602,0.2775 2.19392,0.2285 3.8678,0.3522 5.16906,0.3522 1.40005,0 2.87868,-0.2491 4.15787,-1.2766 1.27921,-1.0276 1.89728,-2.7628 1.89728,-4.1972 0,-1.7808 -1.20822,-3.1428 -2.2525,-3.839 -1.04431,-0.6962 -2.16362,-1.1005 -3.50592,-1.4734 -0.62184,-0.1727 -0.77964,-0.2888 -1.02938,-0.4158 0.19412,-0.7738 0.68655,-2.6271 1.89022,-5.4607 0,0 0.003,-0.01 0.004,-0.01 1.43044,-3.3973 2.99546,-5.027 3.3152,-5.2286 0.20861,-0.1316 2.68802,-0.5763 6.85845,-0.5763 0.54253,0 1.4672,0.03 2.69959,0.093 1.28653,0.066 2.26726,0.1009 3.01644,0.1009 0.24332,0 0.29582,0 0.5924,0.2503 0.2951,0.2489 0.76545,0.8336 1.23123,1.8488 0.76859,1.7272 1.1313,3.4162 1.1313,5.1671 0,1.7688 -0.39466,2.655 -0.92138,3.2253 -0.0289,0.031 -0.84721,0.7366 -2.21013,1.3897 -0.0156,0.01 -0.0316,0.015 -0.0475,0.023 -0.77639,0.3882 -1.48291,0.8157 -2.1435,1.4946 -0.66059,0.6789 -1.31394,1.7851 -1.31394,3.0709 0,1.4957 0.46531,3.2012 1.71361,4.389 1.24825,1.1879 2.89711,1.5693 4.38995,1.5693 1.27899,0 2.75431,-0.1888 4.68165,-0.5197 1.82789,-0.2789 3.18516,-0.4007 3.844,-0.4007 0.86451,0 2.49491,0.1284 4.69068,0.4108 2.30996,0.3291 4.06558,0.5096 5.48192,0.5096 1.47841,0 3.15115,-1.2395 3.70276,-2.3867 0.55154,-1.1473 0.60849,-2.1444 0.60849,-3.2325 0,-1.4 -0.661,-2.7538 -1.51174,-3.6653 -0.85077,-0.9115 -1.85697,-1.5252 -2.99528,-2.0537 -1.24579,-0.5994 -2.20785,-1.067 -2.85095,-1.3847 -0.24649,-0.1217 -0.40048,-0.2 -0.55104,-0.2765 -0.33784,-0.3462 -1.74799,-2.6255 -2.90747,-6.6223 l -2.30297,-9.4056 c -0.005,-0.018 -0.01,-0.036 -0.0141,-0.053 -1.07525,-4.0729 -2.2791,-8.3359 -3.61191,-12.7895 -0.004,-0.013 -0.008,-0.026 -0.0121,-0.039 -1.69678,-5.4105 -2.98599,-9.4351 -3.90055,-12.182 -0.76421,-2.8031 -1.32479,-4.9322 -1.66514,-6.3246 -0.0138,-0.057 -0.0292,-0.1134 -0.0464,-0.1695 -0.43581,-1.4262 -0.99167,-2.6847 -1.9558,-3.7693 -0.96414,-1.0847 -2.54549,-1.9125 -4.10944,-1.9125 z m -2.27471,22.3354 c 0.413,1.0855 0.91796,2.5182 1.48958,4.389 0.003,0.01 0.005,0.017 0.008,0.026 1.10463,3.5032 1.52595,6.3047 1.50071,6.4619 -0.3946,0.071 -0.8174,0.1634 -1.45023,0.1634 h -2.17986 c -1.31974,0 -2.33505,-0.034 -3.06996,-0.086 0.145,-0.924 0.79225,-3.6788 2.33831,-7.7829 v -0.01 c 0.552,-1.4719 0.92953,-2.2067 1.36242,-3.1668 z"
       id="path944"
       inkscape:connector-curvature="0"
       sodipodi:nodetypes="ccccccccccccccssscscscscccccsscsccsscccscscscscsccccccccccccsccccccssccccc" />
    <path
       sodipodi:nodetypes="ccccccccccccccssscscscscccccsscsccsscccscscscscsccccccccccccsccccccssccccc"
       inkscape:connector-curvature="0"
       id="path950"
       d="m 424.68706,189.28484 c -1.54291,0 -2.8729,0.7303 -3.84601,1.5996 -0.97308,0.8693 -1.7324,1.9249 -2.46647,3.186 -0.0479,0.082 -0.092,0.1669 -0.13218,0.2533 -1.73327,3.7282 -2.95512,6.584 -3.6997,8.7113 -1.98773,5.2245 -4.15135,10.7676 -6.49213,16.6355 l -6.53246,16.0643 c 0,0 -0.003,0.01 -0.003,0.01 -0.80021,1.9857 -1.66858,3.6137 -2.56233,4.8885 -0.86252,1.2 -1.68861,2.0789 -2.44526,2.7147 -0.14318,0.051 -0.32036,0.1139 -0.61358,0.2019 -0.71094,0.2132 -1.80249,0.5032 -3.21024,0.8477 -0.002,3e-4 -0.004,0 -0.006,0 -1.40392,0.3309 -2.6945,0.825 -3.80565,1.8054 -1.11284,0.9819 -1.87205,2.6085 -1.87205,4.1175 0,1.4686 0.89587,3.2619 2.20306,4.0993 1.30719,0.8374 2.63298,0.987 3.9974,0.987 1.10393,0 2.41569,-0.1296 4.13062,-0.3593 1.65136,-0.1868 2.88122,-0.2704 3.52309,-0.2704 0.91563,0 2.49871,0.088 4.61602,0.2775 2.19392,0.2285 3.8678,0.3522 5.16906,0.3522 1.40005,0 2.87868,-0.2491 4.15787,-1.2766 1.27921,-1.0276 1.89728,-2.7628 1.89728,-4.1972 0,-1.7808 -1.20822,-3.1428 -2.2525,-3.839 -1.04431,-0.6962 -2.16362,-1.1005 -3.50592,-1.4734 -0.62184,-0.1727 -0.77964,-0.2888 -1.02938,-0.4158 0.19412,-0.7738 0.68655,-2.6271 1.89022,-5.4607 0,0 0.003,-0.01 0.004,-0.01 1.43044,-3.3973 2.99546,-5.027 3.3152,-5.2286 0.20861,-0.1316 2.68802,-0.5763 6.85845,-0.5763 0.54253,0 1.4672,0.03 2.69959,0.093 1.28653,0.066 2.26726,0.1009 3.01644,0.1009 0.24332,0 0.29582,0 0.5924,0.2503 0.2951,0.2489 0.76545,0.8336 1.23123,1.8488 0.76859,1.7272 1.1313,3.4162 1.1313,5.1671 0,1.7688 -0.39466,2.655 -0.92138,3.2253 -0.0289,0.031 -0.84721,0.7366 -2.21013,1.3897 -0.0156,0.01 -0.0316,0.015 -0.0475,0.023 -0.77639,0.3882 -1.48291,0.8157 -2.1435,1.4946 -0.66059,0.6789 -1.31394,1.7851 -1.31394,3.0709 0,1.4957 0.46531,3.2012 1.71361,4.389 1.24825,1.1879 2.89711,1.5693 4.38995,1.5693 1.27899,0 2.75431,-0.1888 4.68165,-0.5197 1.82789,-0.2789 3.18516,-0.4007 3.844,-0.4007 0.86451,0 2.49491,0.1284 4.69068,0.4108 2.30996,0.3291 4.06558,0.5096 5.48192,0.5096 1.47841,0 3.15115,-1.2395 3.70276,-2.3867 0.55154,-1.1473 0.60849,-2.1444 0.60849,-3.2325 0,-1.4 -0.661,-2.7538 -1.51174,-3.6653 -0.85077,-0.9115 -1.85697,-1.5252 -2.99528,-2.0537 -1.24579,-0.5994 -2.20785,-1.067 -2.85095,-1.3847 -0.24649,-0.1217 -0.40048,-0.2 -0.55104,-0.2765 -0.33784,-0.3462 -1.74799,-2.6255 -2.90747,-6.6223 l -2.30297,-9.4056 c -0.005,-0.018 -0.01,-0.036 -0.0141,-0.053 -1.07525,-4.0729 -2.2791,-8.3359 -3.61191,-12.7895 -0.004,-0.013 -0.008,-0.026 -0.0121,-0.039 -1.69678,-5.4105 -2.98599,-9.4351 -3.90055,-12.182 -0.76421,-2.8031 -1.32479,-4.9322 -1.66514,-6.3246 -0.0138,-0.057 -0.0292,-0.1134 -0.0464,-0.1695 -0.43581,-1.4262 -0.99167,-2.6847 -1.9558,-3.7693 -0.96414,-1.0847 -2.54549,-1.9125 -4.10944,-1.9125 z m -2.27471,22.3354 c 0.413,1.0855 0.91796,2.5182 1.48958,4.389 0.003,0.01 0.005,0.017 0.008,0.026 1.10463,3.5032 1.52595,6.3047 1.50071,6.4619 -0.3946,0.071 -0.8174,0.1634 -1.45023,0.1634 h -2.17986 c -1.31974,0 -2.33505,-0.034 -3.06996,-0.086 0.145,-0.924 0.79225,-3.6788 2.33831,-7.7829 v -0.01 c 0.552,-1.4719 0.92953,-2.2067 1.36242,-3.1668 z"
       style="color:#000000;font-style:normal;font-variant:normal;font-weight:bold;font-stretch:normal;font-size:medium;line-height:100%;font-family:Maya;-inkscape-font-specification:'Maya Bold';font-variant-ligatures:normal;font-variant-position:normal;font-variant-caps:normal;font-variant-numeric:normal;font-variant-alternates:normal;font-feature-settings:normal;text-indent:0;text-align:start;text-decoration:none;text-decoration-line:none;text-decoration-style:solid;text-decoration-color:#000000;letter-spacing:16px;word-spacing:normal;text-transform:none;writing-mode:lr-tb;direction:ltr;text-orientation:mixed;dominant-baseline:auto;baseline-shift:baseline;text-anchor:start;white-space:normal;shape-padding:0;clip-rule:nonzero;display:inline;overflow:visible;visibility:visible;isolation:auto;mix-blend-mode:normal;color-interpolation:sRGB;color-interpolation-filters:linearRGB;solid-color:#000000;solid-opacity:1;vector-effect:none;fill:#ff210c;fill-opacity:1;fill-rule:nonzero;stroke:#670d04;stroke-width:6;stroke-linecap:butt;stroke-linejoin:round;stroke-miterlimit:4;stroke-dasharray:none;stroke-dashoffset:0;stroke-opacity:1;color-rendering:auto;image-rendering:auto;shape-rendering:auto;text-rendering:auto;enable-background:accumulate" />
    <path
       sodipodi:nodetypes="ccccccccccccccssscscscscccccsscsccsscccscscscscsccccccccccccsccccccssccccc"
       inkscape:connector-curvature="0"
       id="path954"
       d="m 501.68706,189.28484 c -1.54291,0 -2.8729,0.7303 -3.84601,1.5996 -0.97308,0.8693 -1.7324,1.9249 -2.46647,3.186 -0.0479,0.082 -0.092,0.1669 -0.13218,0.2533 -1.73327,3.7282 -2.95512,6.584 -3.6997,8.7113 -1.98773,5.2245 -4.15135,10.7676 -6.49213,16.6355 l -6.53246,16.0643 c 0,0 -0.003,0.01 -0.003,0.01 -0.80021,1.9857 -1.66858,3.6137 -2.56233,4.8885 -0.86252,1.2 -1.68861,2.0789 -2.44526,2.7147 -0.14318,0.051 -0.32036,0.1139 -0.61358,0.2019 -0.71094,0.2132 -1.80249,0.5032 -3.21024,0.8477 -0.002,3e-4 -0.004,0 -0.006,0 -1.40392,0.3309 -2.6945,0.825 -3.80565,1.8054 -1.11284,0.9819 -1.87205,2.6085 -1.87205,4.1175 0,1.4686 0.89587,3.2619 2.20306,4.0993 1.30719,0.8374 2.63298,0.987 3.9974,0.987 1.10393,0 2.41569,-0.1296 4.13062,-0.3593 1.65136,-0.1868 2.88122,-0.2704 3.52309,-0.2704 0.91563,0 2.49871,0.088 4.61602,0.2775 2.19392,0.2285 3.8678,0.3522 5.16906,0.3522 1.40005,0 2.87868,-0.2491 4.15787,-1.2766 1.27921,-1.0276 1.89728,-2.7628 1.89728,-4.1972 0,-1.7808 -1.20822,-3.1428 -2.2525,-3.839 -1.04431,-0.6962 -2.16362,-1.1005 -3.50592,-1.4734 -0.62184,-0.1727 -0.77964,-0.2888 -1.02938,-0.4158 0.19412,-0.7738 0.68655,-2.6271 1.89022,-5.4607 0,0 0.003,-0.01 0.004,-0.01 1.43044,-3.3973 2.99546,-5.027 3.3152,-5.2286 0.20861,-0.1316 2.68802,-0.5763 6.85845,-0.5763 0.54253,0 1.4672,0.03 2.69959,0.093 1.28653,0.066 2.26726,0.1009 3.01644,0.1009 0.24332,0 0.29582,0 0.5924,0.2503 0.2951,0.2489 0.76545,0.8336 1.23123,1.8488 0.76859,1.7272 1.1313,3.4162 1.1313,5.1671 0,1.7688 -0.39466,2.655 -0.92138,3.2253 -0.0289,0.031 -0.84721,0.7366 -2.21013,1.3897 -0.0156,0.01 -0.0316,0.015 -0.0475,0.023 -0.77639,0.3882 -1.48291,0.8157 -2.1435,1.4946 -0.66059,0.6789 -1.31394,1.7851 -1.31394,3.0709 0,1.4957 0.46531,3.2012 1.71361,4.389 1.24825,1.1879 2.89711,1.5693 4.38995,1.5693 1.27899,0 2.75431,-0.1888 4.68165,-0.5197 1.82789,-0.2789 3.18516,-0.4007 3.844,-0.4007 0.86451,0 2.49491,0.1284 4.69068,0.4108 2.30996,0.3291 4.06558,0.5096 5.48192,0.5096 1.47841,0 3.15115,-1.2395 3.70276,-2.3867 0.55154,-1.1473 0.60849,-2.1444 0.60849,-3.2325 0,-1.4 -0.661,-2.7538 -1.51174,-3.6653 -0.85077,-0.9115 -1.85697,-1.5252 -2.99528,-2.0537 -1.24579,-0.5994 -2.20785,-1.067 -2.85095,-1.3847 -0.24649,-0.1217 -0.40048,-0.2 -0.55104,-0.2765 -0.33784,-0.3462 -1.74799,-2.6255 -2.90747,-6.6223 l -2.30297,-9.4056 c -0.005,-0.018 -0.01,-0.036 -0.0141,-0.053 -1.07525,-4.0729 -2.2791,-8.3359 -3.61191,-12.7895 -0.004,-0.013 -0.008,-0.026 -0.0121,-0.039 -1.69678,-5.4105 -2.98599,-9.4351 -3.90055,-12.182 -0.76421,-2.8031 -1.32479,-4.9322 -1.66514,-6.3246 -0.0138,-0.057 -0.0292,-0.1134 -0.0464,-0.1695 -0.43581,-1.4262 -0.99167,-2.6847 -1.9558,-3.7693 -0.96414,-1.0847 -2.54549,-1.9125 -4.10944,-1.9125 z m -2.27471,22.3354 c 0.413,1.0855 0.91796,2.5182 1.48958,4.389 0.003,0.01 0.005,0.017 0.008,0.026 1.10463,3.5032 1.52595,6.3047 1.50071,6.4619 -0.3946,0.071 -0.8174,0.1634 -1.45023,0.1634 h -2.17986 c -1.31974,0 -2.33505,-0.034 -3.06996,-0.086 0.145,-0.924 0.79225,-3.6788 2.33831,-7.7829 v -0.01 c 0.552,-1.4719 0.92953,-2.2067 1.36242,-3.1668 z"
       style="color:#000000;font-style:normal;font-variant:normal;font-weight:bold;font-stretch:normal;font-size:medium;line-height:100%;font-family:Maya;-inkscape-font-specification:'Maya Bold';font-variant-ligatures:normal;font-variant-position:normal;font-variant-caps:normal;font-variant-numeric:normal;font-variant-alternates:normal;font-feature-settings:normal;text-indent:0;text-align:start;text-decoration:none;text-decoration-line:none;text-decoration-style:solid;text-decoration-color:#000000;letter-spacing:16px;word-spacing:normal;text-transform:none;writing-mode:lr-tb;direction:ltr;text-orientation:mixed;dominant-baseline:auto;baseline-shift:baseline;text-anchor:start;white-space:normal;shape-padding:0;clip-rule:nonzero;display:inline;overflow:visible;visibility:visible;isolation:auto;mix-blend-mode:normal;color-interpolation:sRGB;color-interpolation-filters:linearRGB;solid-color:#000000;solid-opacity:1;vector-effect:none;fill:#ff210c;fill-opacity:1;fill-rule:nonzero;stroke:#670d04;stroke-width:6;stroke-linecap:butt;stroke-linejoin:round;stroke-miterlimit:4;stroke-dasharray:none;stroke-dashoffset:0;stroke-opacity:1;color-rendering:auto;image-rendering:auto;shape-rendering:auto;text-rendering:auto;enable-background:accumulate" />
  </g>
  <g
     class="durg"
     style="display:inline"
     inkscape:label="dragon"
     id="layer_durg_top"
     inkscape:groupmode="layer">
    <g
       class="shaky"
       style="display:inline"
       inkscape:label="eye b"
       id="layer5"
       inkscape:groupmode="layer">
      <ellipse
         style="display:inline;opacity:1;fill:#ffffff;fill-opacity:1;stroke:#000000;stroke-width:6;stroke-linecap:round;stroke-linejoin:round;stroke-miterlimit:4;stroke-dasharray:none;stroke-opacity:1"
         id="ellipse1788"
         cx="276.70404"
         cy="112.08333"
         rx="32.890007"
         ry="32.521839" />
      <path
         style="display:inline;opacity:1;fill:#000000;fill-opacity:1;stroke:none;stroke-width:3.18154931;stroke-linecap:round;stroke-linejoin:round;stroke-miterlimit:4;stroke-dasharray:none;stroke-opacity:1"
         d="m 274.4888,94.948847 c 0.56918,4.160103 9.79266,11.705503 15.68891,8.036303 2.40925,-1.4993 1.09237,-8.831203 -3.70073,-12.752003 -3.89663,-3.1875 -12.97175,-2.4724 -11.98818,4.7157 z"
         id="path1814"
         inkscape:connector-curvature="0"
         sodipodi:nodetypes="ssss" />
    </g>
    <g
       transform="translate(0,-857.76993)"
       style="display:inline"
       inkscape:label="horn b"
       id="layer4"
       inkscape:groupmode="layer">
      <path
         sodipodi:nodetypes="ccc"
         inkscape:connector-curvature="0"
         id="path1743"
         d="m 187.78072,977.72456 c -43.56924,0.5215 -135.1123,32.38764 -149.798875,58.13254 24.131341,-13.1577 121.020595,-28.8114 148.717695,-23.6632"
         style="display:inline;opacity:1;fill:url(#horns);fill-opacity:1;stroke:url(#horns-outline);stroke-width:6;stroke-linecap:round;stroke-linejoin:round;stroke-miterlimit:4;stroke-dasharray:none;stroke-opacity:1" />
      <path
         inkscape:transform-center-y="3.064891"
         inkscape:transform-center-x="0.90095715"
         style="display:inline;opacity:1;fill:#3250b0;fill-opacity:1;fill-rule:nonzero;stroke:#1d2848;stroke-width:6.71338272;stroke-linecap:round;stroke-linejoin:round;stroke-miterlimit:4;stroke-dasharray:none;stroke-opacity:1"
         d="m 220.68029,973.10377 c -10.53703,-0.59024 -31.22159,-1.09421 -37.6326,1.78439 -16.93808,18.1097 -12.77153,51.16954 -9.1044,62.49244 7.60738,6.5693 19.95856,6.8411 24.88394,8.1327"
         id="path1755"
         inkscape:connector-curvature="0"
         sodipodi:nodetypes="cccc" />
    </g>
    <g
       transform="translate(0,-857.76993)"
       style="display:inline"
       inkscape:label="neck"
       id="layer2"
       inkscape:groupmode="layer">
      <path
         inkscape:connector-curvature="0"
         id="path1763-3"
         d="m 56.928704,1278.5056 c 1.403585,-112.838 60.912916,-270.2219 164.872836,-306.11584 8.96687,-1.40445 35.11871,-8.01041 40.81947,-4.33043 30.93228,19.9676 -0.31497,111.77977 -2.77221,138.47977 -3.40067,36.9511 -17.35581,48.5961 -40.95968,69.4231 -23.60381,20.8269 -35.96625,114.3842 -38.56939,131.8913"
         style="display:inline;opacity:1;fill:#3250b0;fill-opacity:1;stroke:none;stroke-width:6.71338272;stroke-linecap:round;stroke-linejoin:round;stroke-miterlimit:4;stroke-dasharray:none;stroke-opacity:1"
         sodipodi:nodetypes="ccsssc" />
      <path
         style="display:inline;opacity:1;fill:url(#alt);fill-opacity:1;stroke:none;stroke-width:6.71338272;stroke-linecap:round;stroke-linejoin:round;stroke-miterlimit:4;stroke-dasharray:none;stroke-opacity:1"
         d="m 259.62055,978.04786 c 0.62863,7.11944 -18.44961,9.0428 -31.0325,11.4695 -16.90743,3.2607 -21.8277,8.1339 -36.40976,15.79874 -18.95724,12.1236 -19.06386,21.3042 -19.08021,41.1568 -38.83093,28.7787 -76.906821,121.5219 -89.343561,232.959 l -25.712901,-5.5114 c 2.809708,-64.0152 43.774762,-272.124 163.855292,-302.71844 8.14681,-2.0756 36.85517,-2.98986 37.72364,6.8458 z"
         id="path1798"
         inkscape:connector-curvature="0"
         sodipodi:nodetypes="ssccccss" />
      <path
         sodipodi:nodetypes="ccccc"
         style="display:inline;opacity:1;fill:#c4d9f5;fill-opacity:1;stroke:#1d2848;stroke-width:6;stroke-linecap:round;stroke-linejoin:round;stroke-miterlimit:4;stroke-dasharray:none;stroke-opacity:1"
         d="m 233.13548,1120.6929 c 50.67889,20.1328 53.60183,17.8245 53.78837,42.0789 -52.8327,2.9938 -72.8258,104.9314 -76.28828,153.0222 l -61.83822,-5.6453 c 9.64786,-81.612 48.46772,-187.3587 84.33813,-189.4558 z"
         id="path1772-5"
         inkscape:connector-curvature="0" />
      <path
         style="display:inline;opacity:1;fill:none;fill-opacity:1;stroke:#1d2848;stroke-width:6;stroke-linecap:round;stroke-linejoin:round;stroke-miterlimit:4;stroke-dasharray:none;stroke-opacity:1"
         d="M 58.099969,1284.2357 C 58.480729,1159.7765 128.66867,991.76632 225.0891,971.24312"
         id="path1802-6"
         inkscape:connector-curvature="0"
         sodipodi:nodetypes="cc" />
    </g>
    <g
       style="display:inline"
       inkscape:label="jaw l"
       id="layer6"
       inkscape:groupmode="layer">
      <path
         style="display:inline;opacity:1;fill:#f797ab;fill-opacity:1;stroke:#de6881;stroke-width:6.71338272;stroke-linecap:round;stroke-linejoin:round;stroke-miterlimit:4;stroke-dasharray:none;stroke-opacity:1"
         d="m 311.15093,185.50779 c -12.49615,12.8432 -14.31301,50.3859 -9.80049,65.659 -13.88461,10.0663 -52.43187,-18.3801 -54.51459,-26.3637 -2.08268,-7.9837 37.93428,-46.2376 64.31508,-39.2953 z"
         id="path1757"
         inkscape:connector-curvature="0"
         sodipodi:nodetypes="cccc" />
      <path
         style="display:inline;opacity:1;fill:#ffffff;fill-opacity:1;stroke:#bcdeea;stroke-width:4.47558737;stroke-linecap:round;stroke-linejoin:round;stroke-miterlimit:4;stroke-dasharray:none;stroke-opacity:1"
         d="m 388.32945,312.40729 c 3.70284,-5.9134 -0.23699,-20.3819 -3.31534,-22.218 -1.17519,6.3347 -5.14894,21.808 -9.43905,23.0948"
         id="path1774"
         inkscape:connector-curvature="0"
         sodipodi:nodetypes="ccc" />
      <path
         style="display:inline;opacity:1;fill:#ffffff;fill-opacity:1;stroke:#bcdeea;stroke-width:4.47558737;stroke-linecap:round;stroke-linejoin:round;stroke-miterlimit:4;stroke-dasharray:none;stroke-opacity:1"
         d="m 363.48029,307.24839 c 2.2407,-2.9951 2.3919,-15.0812 -0.91126,-17.0041 -1.00558,3.4815 -6.18462,12.636 -9.27758,13.4296"
         id="path1776"
         inkscape:connector-curvature="0" />
      <path
         style="display:inline;opacity:1;fill:#ffffff;fill-opacity:1;stroke:#bcdeea;stroke-width:4.47558737;stroke-linecap:round;stroke-linejoin:round;stroke-miterlimit:4;stroke-dasharray:none;stroke-opacity:1"
         d="m 344.05507,294.36249 c 1.68968,-1.8791 1.50312,-9.2125 0.44383,-10.4055 -1.95057,3.0071 -5.95757,6.0725 -6.57772,6.1562"
         id="path1780"
         inkscape:connector-curvature="0" />
      <path
         style="display:inline;opacity:1;fill:#c4d9f5;fill-opacity:1;stroke:none;stroke-width:6.71338272;stroke-linecap:round;stroke-linejoin:round;stroke-miterlimit:4;stroke-dasharray:none;stroke-opacity:1"
         d="m 244.08482,232.36759 c 25.33948,-0.3471 52.71766,13.5883 65.95201,24.9924 16.31442,14.0582 29.6784,40.6125 49.81111,47.0342 13.76683,4.391 35.84366,7.514 58.0591,-1.164 3.10714,12.9639 -6.90175,43.4146 -42.79004,40.1374 -36.72195,-3.3532 -71.04791,-28.9938 -86.86871,-33.7973 -12.03919,-3.6554 -63.19271,-1.6025 -75.29498,-51.4138 -2.68052,-7.2512 1.27676,-27.9805 13.08185,-25.4411 4.0496,3.5217 14.66666,1.1498 18.04966,-0.3478 z"
         id="path1778"
         inkscape:connector-curvature="0"
         sodipodi:nodetypes="csscssccc" />
      <path
         inkscape:original-d="m 244.08482,232.36759 c 25.33948,-0.3471 52.71766,13.5883 65.95201,24.9924 16.31442,14.0582 30.62435,38.1779 49.81111,47.0342 20.1485,9.3 46.24344,6.184 58.28337,0.9335 4.52374,18.4479 -12.55557,41.0428 -42.9167,37.8418 -38.73451,-4.0839 -59.02318,-28.9719 -86.00472,-35.8249 -12.19468,-3.0973 -64.69132,-3.4464 -76.25658,-49.1881"
         inkscape:path-effect="#path-effect963"
         sodipodi:nodetypes="csscssc"
         inkscape:connector-curvature="0"
         id="path1782"
         d="m 246.54039,229.37728 c -1.29088,-0.0271 -2.45557,2.99031 -2.45557,2.99031 0,0 1.22797,2.98531 2.32987,3.00837 23.86949,0.50019 49.30591,13.60782 61.6638,24.25667 16.00028,13.7875 30.64218,38.31372 50.5122,47.4854 19.20927,8.86648 43.37546,6.9959 57.17542,2.32657 1.2523,15.46825 -13.54308,33.55578 -40.23694,30.74143 -38.15687,-4.023 -57.93327,-28.72697 -85.58077,-35.74912 -12.31137,-3.12694 -52.52571,-3.36891 -69.14828,-34.17093 -3.15559,-5.83761 -7.84681,-12.10949 -7.84681,-12.10949 0,0 -0.32051,1.94181 -0.1538,4.8337 0.16924,2.93584 0.86087,6.67435 2.72042,10.12529 18.25905,33.83444 63.56232,34.75207 72.95144,37.13679 26.31559,6.68385 47.11653,31.75588 86.42869,35.90068 32.04052,3.37806 51.25402,-20.70478 46.14493,-41.53974 a 3,3 0 0 0 -4.11288,-2.03541 c -11.24701,4.90471 -36.52321,8.00261 -55.82689,-0.90744 -18.50353,-8.54093 -32.48149,-32.25411 -49.11005,-46.58301 -13.27962,-11.44311 -40.01964,-25.17707 -65.45478,-25.71007 z"
         style="display:inline;opacity:1;fill:#1d2848;fill-opacity:1;fill-rule:nonzero;stroke:none;stroke-width:23.84720421;stroke-linecap:round;stroke-linejoin:round;stroke-miterlimit:4;stroke-dasharray:none;stroke-opacity:1" />
    </g>
    <g
       style="display:inline"
       inkscape:label="jaw u"
       id="layer7"
       inkscape:groupmode="layer">
      <path
         style="display:inline;opacity:1;fill:#ffffff;fill-opacity:1;stroke:#bcdeea;stroke-width:4.47558737;stroke-linecap:round;stroke-linejoin:round;stroke-miterlimit:4;stroke-dasharray:none;stroke-opacity:1"
         d="m 403.75802,164.33289 c 3.12407,6.7688 2.25626,20.827 -1.562,23.4303 -1.21489,-8.3307 -5.7274,-16.1408 -7.63653,-16.835"
         id="path1761"
         inkscape:connector-curvature="0"
         sodipodi:nodetypes="ccc" />
      <path
         style="display:inline;opacity:1;fill:#ffffff;fill-opacity:1;stroke:#bcdeea;stroke-width:4.47558737;stroke-linecap:round;stroke-linejoin:round;stroke-miterlimit:4;stroke-dasharray:none;stroke-opacity:1"
         d="m 379.39799,188.04099 c 4.66352,-1.7181 6.13619,-12.7632 4.90898,-15.2178 -1.22725,-2.4545 -11.7815,-1.718 -8.83613,2.7 2.94536,4.418 4.41807,8.8361 3.92715,12.5178 z"
         id="path1765"
         inkscape:connector-curvature="0" />
      <path
         style="display:inline;opacity:1;fill:#ffffff;fill-opacity:1;stroke:#bcdeea;stroke-width:4.47558737;stroke-linecap:round;stroke-linejoin:round;stroke-miterlimit:4;stroke-dasharray:none;stroke-opacity:1"
         d="m 366.70481,174.02719 c 0.90848,7.0768 -0.27583,12.8077 -3.86345,14.5338 -0.25962,-5.4745 -3.64795,-12.0373 -4.94743,-12.279"
         id="path1767"
         inkscape:connector-curvature="0"
         sodipodi:nodetypes="ccc" />
      <path
         style="display:inline;opacity:1;fill:#ffffff;fill-opacity:1;stroke:#bcdeea;stroke-width:4.47558737;stroke-linecap:round;stroke-linejoin:round;stroke-miterlimit:4;stroke-dasharray:none;stroke-opacity:1"
         d="m 341.10367,190.88729 c 0.34711,-5.5538 -4.33896,-15.2731 -6.42165,-15.9674 2.77691,-6.9423 7.81012,-5.3803 11.10768,0.1737 3.29761,5.5539 -1.56199,14.926 -4.68603,15.7939 z"
         id="path1769"
         inkscape:connector-curvature="0" />
      <path
         sodipodi:nodetypes="cccccsccscccc"
         inkscape:connector-curvature="0"
         id="path1784"
         d="m 393.24691,78.295487 c -8.69058,-0.10822 -26.46036,-0.34187 -34.34457,2.80073 -11.98401,4.7768 -14.17629,20.742413 -39.38281,29.441413 -11.99668,4.1402 -51.57558,-2.45783 -83.01509,-0.11873 -7.35655,0.54734 76.1695,5.30486 -22.34767,29.02801 -12.40931,31.82309 -16.67251,80.10732 11.87839,93.26848 3.80685,1.75485 11.03863,1.38288 16.04492,1.74802 17.63922,-4.6146 40.01377,-34.73454 63.28906,-45.65234 40.56138,-19.0264 66.54956,-5.97437 90.57813,-18.23047 17.4096,-8.88 11.32481,-25.31841 21.73828,-31.56641 10.41349,-6.2481 23.77233,-4.72438 23.48474,-22.33948 -5.20113,-16.746933 -19.36781,-25.815573 -34.14881,-31.869503 -0.57958,-2.61131 -5.084,-6.40151 -13.77457,-6.50972 z"
         style="display:inline;opacity:1;fill:#3250b0;fill-opacity:1;stroke:none;stroke-width:6.71338272;stroke-linecap:round;stroke-linejoin:round;stroke-miterlimit:4;stroke-dasharray:none;stroke-opacity:1" />
      <path
         inkscape:original-d="m 226.03483,232.71479 c 3.31712,3.526 12.01476,2.848 16.84329,1.4534 17.50217,-5.0553 39.2152,-34.4399 62.49049,-45.3577 40.56138,-19.0264 66.55078,-5.9734 90.57935,-18.2295 17.4096,-8.88 11.32335,-25.3184 21.73682,-31.5664 10.41349,-6.2481 23.44869,-3.7008 23.16113,-21.3158 -0.17472,-12.4172 -15.05453,-25.207803 -32.95494,-32.260903"
         inkscape:path-effect="#path-effect882"
         style="display:inline;opacity:1;fill:#1d2848;fill-opacity:1;fill-rule:nonzero;stroke:none;stroke-width:6.71338224;stroke-linecap:round;stroke-linejoin:round;stroke-miterlimit:4;stroke-dasharray:none;stroke-opacity:1"
         d="m 247.23768,229.10892 c -1.75369,0.92596 -3.41958,1.76819 -5.12291,2.41639 -2.82394,1.07871 -5.59724,1.73821 -8.17448,2.09489 -1.69923,0.22778 -3.02789,0.30082 -4.30655,0.18944 -2.33641,-0.22267 -3.59891,-1.09485 -3.59891,-1.09485 0,0 0.62988,1.4792 3.10541,2.72663 1.26856,0.65232 2.82049,1.17922 4.69886,1.51181 2.8342,0.51787 6.21478,0.63134 9.80237,-0.14216 2.25573,-0.4957 4.4132,-1.33288 6.415,-2.40551 16.99523,-9.04459 36.35181,-33.38765 56.58617,-42.87903 39.98408,-18.75561 65.67237,-5.52352 90.66843,-18.2731 18.50069,-9.43653 13.17629,-26.42188 21.9172,-31.66636 8.52892,-5.11736 24.94093,-4.10876 24.61734,-23.93049 -0.1997,-14.19241 -16.48694,-27.772528 -34.85487,-35.00984 l -2.19953,5.582299 c 17.43289,6.868888 30.90526,18.869971 31.0551,29.518721 0.2514,15.40007 -9.40573,11.31477 -21.705,18.69434 -12.08605,7.25153 -5.23795,23.14298 -21.55646,31.46645 -23.06108,11.76262 -49.35159,-1.11129 -90.49026,18.1859 -21.3274,10.0041 -41.04187,34.59796 -56.85691,43.01447 z"
         id="path1786"
         inkscape:connector-curvature="0"
         sodipodi:nodetypes="csssscc" />
      <path
         style="display:inline;opacity:1;fill:#1d2848;fill-opacity:1;stroke:none;stroke-width:4.47558737;stroke-linecap:round;stroke-linejoin:round;stroke-miterlimit:4;stroke-dasharray:none;stroke-opacity:1"
         d="m 353.86017,131.53049 c 0.84415,-4.7958 14.31852,-10.7606 23.95096,-6.8556 9.6325,3.9051 6.68584,10.438 2.77695,11.1945 -5.38032,1.0414 -8.39336,-1.392 -12.07328,-1.2782 -3.61643,0.112 -7.03958,1.5471 -12.00787,1.2349 -2.70712,-0.1701 -3.0103,-2.2302 -2.64676,-4.2956 z"
         id="path1792"
         inkscape:connector-curvature="0"
         sodipodi:nodetypes="ssssss" />
      <path
         transform="translate(0.31329767,-0.62661427)"
         inkscape:original-d="m 396.33388,114.89759 c -10.30882,3.3136 -15.96429,-2.4868 -23.31753,-3.1908 -6.60762,-0.6328 -36.08085,3.559 -48.96684,15.9541"
         inkscape:path-effect="#path-effect886"
         style="display:inline;opacity:1;fill:#1d2848;fill-opacity:1;fill-rule:nonzero;stroke:none;stroke-width:6.45563;stroke-linecap:round;stroke-linejoin:round;stroke-miterlimit:4;stroke-dasharray:none;stroke-opacity:1"
         d="m 383.77336,117.9954 c 3.42912,0.93971 6.76468,0.25306 9.11033,-0.81227 2.30494,-1.04684 3.45019,-2.28554 3.45019,-2.28554 0,0 -1.67439,-0.19858 -3.82045,-0.68431 -2.14777,-0.48611 -4.68216,-1.32006 -7.14776,-2.00273 -3.82544,-1.05297 -7.66583,-3.06908 -12.06332,-3.4901 -5.71761,-0.54756 -23.83599,1.85754 -38.15604,8.31682 -3.60788,1.60659 -6.50144,4.11425 -8.44848,6.48042 -1.89215,2.29948 -2.64832,4.1432 -2.64832,4.1432 0,0 1.83239,-0.78199 4.40238,-1.71624 2.11509,-0.76889 6.40846,-2.179 9.16145,-3.43804 13.697,-6.17824 30.96368,-8.21124 35.1171,-7.81348 3.62764,0.34732 6.80133,2.13475 11.04292,3.30227 z"
         id="path1794"
         inkscape:connector-curvature="0"
         sodipodi:nodetypes="csc" />
      <path
         style="display:inline;opacity:1;fill:#1d2848;fill-opacity:1;stroke:none;stroke-width:4.87367582;stroke-linecap:round;stroke-linejoin:round;stroke-miterlimit:4;stroke-dasharray:none;stroke-opacity:1"
         d="m 192.87553,227.95199 c -0.75502,2.6348 -0.82095,8.6623 2.88222,13.9856 3.02388,4.3469 8.76936,3.9196 9.3552,-2.1734 0.47252,-4.9139 -2.55142,-11.6232 -5.10286,-13.7966 -2.09727,-1.7866 -6.37787,-0.6563 -7.13456,1.9844 z"
         id="path1796"
         inkscape:connector-curvature="0"
         sodipodi:nodetypes="sssss" />
      <path
         inkscape:original-d="m 411.35101,104.77329 c -1.47269,-3.6817 -3.72691,-20.780803 -5.07686,-23.235203 -7.97705,-2.0863 -29.02902,-6.986 -44.79744,-0.7008 -11.98401,4.7768 -16.94784,21.140203 -42.15436,29.839203 -11.99668,4.1402 -61.2464,-5.9105 -94.23325,2.7967"
         inkscape:path-effect="#path-effect884-5"
         style="display:inline;opacity:1;fill:#1d2848;fill-opacity:1;fill-rule:nonzero;stroke:none;stroke-width:6.71338224;stroke-linecap:round;stroke-linejoin:round;stroke-miterlimit:4;stroke-dasharray:none;stroke-opacity:1"
         d="m 405.98852,94.187348 c 0.433,2.383603 1.3964,4.671705 2.41862,6.524622 0.73112,1.31073 1.30512,2.22229 1.95225,3.0178 0.57591,0.70798 0.99162,1.04352 0.99162,1.04352 0,0 0.41391,-1.93577 0.66029,-4.808157 0.20994,-2.02165 0.31054,-4.486695 -0.11952,-6.850885 -0.97511,-5.364211 -1.98494,-11.196435 -2.989,-13.021942 a 3,3 0 0 0 -1.86955,-1.456597 c -8.08027,-2.113295 -29.88545,-7.274355 -46.66732,-0.585197 -12.94617,5.160312 -17.30667,21.260534 -42.02225,29.790108 -11.04448,3.81158 -60.71754,-6.05864 -94.0202,2.73192 l 1.5313,5.8013 c 32.67104,-8.62383 81.4974,1.60734 94.44628,-2.86148 25.69746,-8.86843 31.26462,-25.49501 42.28646,-29.888294 13.88224,-5.53338 32.67185,-1.754804 41.40371,0.426627 0.49203,1.916149 1.23259,5.929797 1.99731,10.136655 z"
         id="path1800-2"
         inkscape:connector-curvature="0"
         sodipodi:nodetypes="ccssc" />
    </g>
    <g
       style="display:inline"
       inkscape:label="horn f"
       id="layer8"
       inkscape:groupmode="layer">
      <path
         style="display:inline;opacity:1;fill:url(#horns);fill-opacity:1;stroke:url(#horns-outline);stroke-width:6;stroke-linecap:round;stroke-linejoin:round;stroke-miterlimit:4;stroke-dasharray:none;stroke-opacity:1"
         d="M 159.89591,151.92879 C 113.03522,155.74699 16.884218,199.83059 2.9995714,228.64129 27.991904,212.67399 127.96123,194.97109 158.1603,198.44229"
         id="path1804"
         inkscape:connector-curvature="0"
         sodipodi:nodetypes="ccc" />
      <path
         style="display:inline;opacity:1;fill:#3250b0;fill-opacity:1;stroke:none;stroke-width:4.47558737;stroke-linecap:round;stroke-linejoin:round;stroke-miterlimit:4;stroke-dasharray:none;stroke-opacity:1"
         d="m 192.7544,147.80969 c -11.80189,1.0414 -30.78891,0.2332 -36.86342,1.9688 -6.24811,17.3558 -4.00006,38.5164 -0.70243,48.9299 6.9423,6.0744 20.17928,-1.2636 24.69182,-0.049"
         id="path1806"
         inkscape:connector-curvature="0"
         sodipodi:nodetypes="cccc" />
      <path
         inkscape:original-d="m 193.37308,147.51499 c -11.94159,-0.5237 -31.58114,-0.3398 -37.4821,2.2635 -6.24811,17.3558 -4.00006,38.5164 -0.70243,48.9299 7.51472,2.0623 19.64623,2.1708 26.80205,-0.035"
         inkscape:path-effect="#path-effect888"
         sodipodi:nodetypes="cccc"
         inkscape:connector-curvature="0"
         id="path1808"
         d="m 183.0158,150.28054 c 5.07013,0.017 10.35728,-2.76555 10.35728,-2.76555 0,0 -5.05395,-3.21708 -10.33737,-3.23442 -10.82518,-0.0359 -23.15004,0.45663 -28.35563,2.75316 a 3,3 0 0 0 -1.61176,1.7286 c -6.50379,18.06602 -4.21341,39.88249 -0.73979,50.85174 a 3,3 0 0 0 2.06607,1.98735 c 4.69545,1.2886 10.97421,1.84754 16.76779,1.65124 2.94015,-0.0861 5.71312,-1.114 7.75138,-2.28364 1.99675,-1.14582 3.07683,-2.29563 3.07683,-2.29563 0,0 -1.55249,-0.28124 -3.63318,-0.64898 -1.97821,-0.34962 -4.8512,-0.86718 -7.39821,-0.76831 -4.7165,0.1598 -9.55098,-0.21601 -13.38227,-1.05053 -2.77521,-10.06408 -4.45366,-28.55455 0.67979,-44.08686 4.50413,-1.29079 15.01723,-1.8705 24.75907,-1.83817 z"
         style="display:inline;opacity:1;fill:#1d2848;fill-opacity:1;fill-rule:nonzero;stroke:none;stroke-width:6.71338224;stroke-linecap:round;stroke-linejoin:round;stroke-miterlimit:4;stroke-dasharray:none;stroke-opacity:1" />
    </g>
    <g
       class="shaky"
       style="display:inline"
       inkscape:label="eye f"
       id="layer9"
       inkscape:groupmode="layer">
      <ellipse
         style="display:inline;opacity:1;fill:#ffffff;fill-opacity:1;stroke:#000000;stroke-width:6;stroke-linecap:round;stroke-linejoin:round;stroke-miterlimit:4;stroke-dasharray:none;stroke-opacity:1"
         id="ellipse1810"
         cx="243.91057"
         cy="141.89673"
         rx="41.971573"
         ry="43.198822" />
      <path
         style="display:inline;opacity:1;fill:#000000;fill-opacity:1;stroke:none;stroke-width:4.47558737;stroke-linecap:round;stroke-linejoin:round;stroke-miterlimit:4;stroke-dasharray:none;stroke-opacity:1"
         d="m 247.20892,162.33709 c 0.011,-5.9068 -11.38097,-18.2041 -20.30629,-14.2318 -3.64696,1.6231 -3.23012,12.0938 2.69012,18.4838 4.81305,5.195 17.59632,5.9538 17.61617,-4.252 z"
         id="path1812"
         inkscape:connector-curvature="0"
         sodipodi:nodetypes="ssss" />
    </g>
  </g>
</svg>
