<?xml version="1.0" encoding="UTF-8" standalone="no"?>
<!-- Created with Inkscape (http://www.inkscape.org/) -->

<svg
   xmlns:dc="http://purl.org/dc/elements/1.1/"
   xmlns:cc="http://creativecommons.org/ns#"
   xmlns:rdf="http://www.w3.org/1999/02/22-rdf-syntax-ns#"
   xmlns:svg="http://www.w3.org/2000/svg"
   xmlns="http://www.w3.org/2000/svg"
   xmlns:xlink="http://www.w3.org/1999/xlink"
   xmlns:sodipodi="http://sodipodi.sourceforge.net/DTD/sodipodi-0.dtd"
   xmlns:inkscape="http://www.inkscape.org/namespaces/inkscape"
   width="473.28073"
   height="226.21094"
   viewBox="0 0 125.22219 59.851646"
   version="1.1"
   id="svg4575"
   inkscape:version="0.92+devel (7c994332a7, 2017-08-14, custom)"
   sodipodi:docname="fire-exit2.svg"
   inkscape:export-filename="../stickers/fire-exit2.png"
   inkscape:export-xdpi="103.8538"
   inkscape:export-ydpi="103.8538">
  <defs
     id="defs4569" />
  <sodipodi:namedview
     id="base"
     pagecolor="#ffffff"
     bordercolor="#666666"
     borderopacity="1.0"
     inkscape:pageopacity="0.0"
     inkscape:pageshadow="2"
     inkscape:zoom="0.9899495"
     inkscape:cx="-142.23871"
     inkscape:cy="271.90826"
     inkscape:document-units="px"
     inkscape:current-layer="layer2"
     showgrid="false"
     units="px"
     inkscape:pagecheckerboard="false"
     inkscape:window-width="2408"
     inkscape:window-height="1411"
     inkscape:window-x="30"
     inkscape:window-y="0"
     inkscape:window-maximized="1"
     inkscape:document-rotation="0"
     inkscape:snap-global="false"
     inkscape:object-paths="true"
     fit-margin-top="0"
     fit-margin-left="0"
     fit-margin-right="0"
     fit-margin-bottom="0"
     inkscape:snap-smooth-nodes="true" />
  <metadata
     id="metadata4572">
    <rdf:RDF>
      <cc:Work
         rdf:about="">
        <dc:format>image/svg+xml</dc:format>
        <dc:type
           rdf:resource="http://purl.org/dc/dcmitype/StillImage" />
        <dc:title />
      </cc:Work>
    </rdf:RDF>
  </metadata>
  <g
     inkscape:groupmode="layer"
     id="layer2"
     inkscape:label="durg"
     transform="translate(-44.968845,-153.36703)">
    <rect
       style="fill:#32ab41;fill-opacity:1;stroke:none;stroke-width:0.81246614;stroke-linecap:round;stroke-linejoin:round;stroke-miterlimit:8;stroke-dasharray:none"
       id="rect1002"
       width="125.22219"
       height="59.851643"
       x="44.968845"
       y="153.36703" />
    <text
       xml:space="preserve"
       style="font-weight:bold;font-size:21.18221283px;line-height:80.00000119%;font-family:Maya;-inkscape-font-specification:'Maya Bold';writing-mode:lr-tb;fill:#ffffff;fill-opacity:1;stroke:none;stroke-width:0.74468714;stroke-linecap:round;stroke-linejoin:round;stroke-miterlimit:8;stroke-dasharray:none"
       x="57.721123"
       y="173.17175"
       id="text998"><tspan
         sodipodi:role="line"
         x="57.721123"
         y="173.17175"
         style="font-style:normal;font-variant:normal;font-weight:bold;font-stretch:normal;font-family:sans-serif;-inkscape-font-specification:'sans-serif Bold';fill:#ffffff;stroke-width:0.74468714"
         id="tspan1000">Fire exit</tspan></text>
    <g
       id="g992"
       transform="translate(-5.227866)">
      <rect
         y="189.24641"
         x="150.01215"
         height="7.0046377"
         width="16.381231"
         id="rect917"
         style="fill:#ffffff;stroke-width:0.84512973;stroke-linecap:round;stroke-linejoin:round;stroke-miterlimit:8" />
      <path
         sodipodi:nodetypes="ccccccc"
         inkscape:connector-curvature="0"
         d="m 160.88411,196.00285 -4.95025,6.80457 h 7.40402 l 7.47507,-10.05868 -7.47507,-10.05868 h -7.40402 l 4.95025,6.80457"
         style="fill:#ffffff;stroke-width:0.79375005;stroke-linecap:round;stroke-linejoin:round;stroke-miterlimit:8"
         id="path943" />
    </g>
    <g
       id="g988"
       transform="translate(-4.9175368)">
      <path
         sodipodi:nodetypes="ccccccc"
         inkscape:connector-curvature="0"
         d="m 141.7811,209.9129 -16.11947,-1e-5 2.86576,-5.22952 v -27.30792 h 16.11946 v 27.30792 z"
         style="fill:#ffffff;fill-opacity:1;stroke:none;stroke-width:0.81433403;stroke-linecap:round;stroke-linejoin:round;stroke-miterlimit:8;stroke-dasharray:none"
         id="path991" />
      <path
         transform="matrix(0.26458334,0,0,0.26458334,55.852276,153.36703)"
         d="m 302.85742,121.12305 -31.33008,0.0664 0.3418,0.0156 c -1.78023,-0.17096 -3.50943,-0.18954 -5.28516,0.56054 -1.77572,0.75009 -3.21536,2.44685 -3.87109,4.20508 l -6.95508,18.65821 c -0.57285,1.53622 -0.62601,3.25822 0.0664,4.88281 0.69241,1.62459 2.30896,3.04171 4.19336,3.49219 l -0.19336,-0.0527 5.01758,1.50781 a 3.4876007,3.4876007 0 0 0 0.1914,0.0508 c 2.92819,0.70106 6.78258,-0.9636 7.90039,-4.58594 l -0.0137,0.0469 3.76367,-11.62109 2.14844,0.004 -0.16601,31.53515 -17.50782,0.21094 a 3.4876007,3.4876007 0 0 0 -0.002,0 c -2.86309,0.0346 -5.32911,1.13028 -7.29492,2.45703 -1.96581,1.32675 -3.45875,2.79718 -4.42188,4.65625 a 3.4876007,3.4876007 0 0 0 -0.002,0 l -2.54883,4.92383 a 3.4876007,3.4876007 0 0 0 3.17188,5.08984 l 39.60937,-0.84961 a 3.4876007,3.4876007 0 0 0 0.0527,-0.002 c 1.90077,-0.0692 3.92132,-0.90838 5.15625,-2.43164 1.23447,-1.52271 1.62231,-3.36764 1.61718,-5.125 v -0.002 l -0.008,-2.63868 14.34766,25.02149 c 1.61234,2.81195 4.89351,4.35051 8.16406,4.05078 l 4.3125,-0.39648 c 1.59195,-0.14588 3.37112,-0.8129 4.58984,-2.59961 1.21872,-1.78672 1.18068,-4.40028 0.18555,-6.49024 a 3.4876007,3.4876007 0 0 0 -0.0606,-0.12109 l -18.43945,-35.13086 c 0.29888,0.16284 0.54532,0.44747 0.86523,0.55273 1.84995,0.6087 3.16943,0.27537 3.91797,0.23047 0.008,-4.9e-4 2.14032,-0.0343 4.63868,-0.0351 2.49835,-8.8e-4 5.6585,0.0101 8.75781,0.0234 6.19862,0.0267 12.1582,0.0664 12.1582,0.0664 a 3.4876007,3.4876007 0 0 0 3.50586,-3.65234 l -0.50195,-10.52149 a 3.4876007,3.4876007 0 0 0 -3.47071,-3.32031 l -20.02929,-0.0723 -8.37305,-17.54297 c -0.69455,-1.45559 -1.6005,-2.92866 -3.16797,-3.91992 -1.56747,-0.99126 -3.30596,-1.19697 -5.02344,-1.19726 a 3.4876007,3.4876007 0 0 0 -0.008,0 z"
         id="path958"
         style="fill:#ffffff;fill-opacity:1;stroke:none;stroke-width:3.07779789;stroke-linecap:round;stroke-linejoin:round;stroke-miterlimit:8;stroke-dasharray:none"
         inkscape:original="M 302.86523 124.60938 L 271.53516 124.67578 C 268.51255 124.38551 266.82232 124.93217 265.98047 127.18945 L 259.02539 145.84766 C 258.45189 147.38562 259.01739 149.17846 260.82812 149.61133 L 265.8457 151.11914 C 267.21121 151.44607 268.99121 150.87435 269.60156 148.89648 L 274.15039 134.85547 L 282.33594 134.875 L 282.13477 173.33398 L 261.19922 173.58594 C 257.32052 173.63284 253.60011 176.7608 252.53516 178.81641 L 249.98633 183.74023 L 289.5957 182.89062 C 291.8991 182.80673 293.01732 181.27871 293.00977 178.82812 L 292.9668 163.02539 L 313.86133 199.46484 C 314.77994 201.06691 316.57505 201.9704 318.68164 201.77734 L 322.99414 201.38086 C 324.51204 201.24177 326.23402 199.98251 324.93945 197.26367 L 303.44336 156.30664 L 303.44336 143.30859 L 309.1875 155.24414 C 310.77517 158.38757 312.22367 157.93071 314.16211 157.81445 C 316.10059 157.69804 339.94922 157.86328 339.94922 157.86328 L 339.44727 147.3418 L 317.22656 147.26367 L 307.91016 127.74219 C 306.75441 125.32004 305.72248 124.60987 302.86523 124.60938 z "
         inkscape:radius="3.487252"
         sodipodi:type="inkscape:offset" />
      <path
         sodipodi:nodetypes="ccccccccccccccccccccccccccccc"
         inkscape:connector-curvature="0"
         id="path978"
         transform="matrix(0.26458334,0,0,0.26458334,55.852276,153.36703)"
         d="m 271.53516,124.67578 c -3.02261,-0.29027 -4.71284,0.25639 -5.55469,2.51367 l -6.95508,18.65821 c -0.5735,1.53796 -0.008,3.3308 1.80273,3.76367 l 5.01758,1.50781 c 1.36551,0.32693 3.14551,-0.24479 3.75586,-2.22266 l 4.54883,-14.04101 8.18555,0.0195 -0.20117,38.45898 -20.93555,0.25196 c -3.8787,0.0469 -7.59911,3.17486 -8.66406,5.23047 l -2.54883,4.92382 39.60937,-0.84961 c 2.3034,-0.0839 3.42162,-1.61192 3.41407,-4.0625 l -0.043,-15.80273 20.89453,36.43945 c 0.91861,1.60207 2.71372,2.50556 4.82031,2.3125 l 4.3125,-0.39648 c 1.5179,-0.13909 3.23988,-1.39835 1.94531,-4.11719 l -21.49609,-40.95703 v -12.99805 l 5.74414,11.93555 c 1.58767,3.14343 3.03617,2.68657 4.97461,2.57031 1.93848,-0.11641 25.78711,0.0488 25.78711,0.0488 l -0.50195,-10.52148 -22.22071,-0.0781 -9.3164,-19.52148 c -1.15575,-2.42215 -2.18768,-3.13232 -5.04493,-3.13281 z"
         style="fill:#32ab41;fill-opacity:1;stroke:none;stroke-width:3.07779789;stroke-linecap:round;stroke-linejoin:round;stroke-miterlimit:8;stroke-dasharray:none" />
      <path
         sodipodi:nodetypes="csssscc"
         id="path1014"
         style="fill:#32ab41;fill-opacity:1;stroke:none;stroke-width:0.81433403;stroke-linecap:round;stroke-linejoin:round;stroke-miterlimit:8;stroke-dasharray:none"
         d="m 136.0273,212.63268 2.68519,-4.68298 c 0.24305,-0.42388 0.71712,-0.57775 1.27579,-0.61166 l 1.23506,-0.075 c 0.40255,-0.0244 0.85698,0.3701 0.51445,1.08945 l -2.24081,4.70603 z"
         inkscape:connector-curvature="0" />
      <ellipse
         ry="2.9214602"
         rx="2.9194229"
         cy="182.31009"
         cx="135.96643"
         id="path954"
         style="fill:#32ab41;fill-opacity:1;stroke-width:0.77111441;stroke-linecap:round;stroke-linejoin:round;stroke-miterlimit:8" />
      <rect
         y="190.93971"
         x="144.64685"
         height="5.9633074"
         width="2.5327435"
         id="rect1016"
         style="fill:#32ab41;fill-opacity:1;stroke:none;stroke-width:0.79374999;stroke-linecap:round;stroke-linejoin:round;stroke-miterlimit:8;stroke-dasharray:none" />
    </g>
    <g
       id="g980"
       transform="translate(0.15727889)">
      <path
         sodipodi:nodetypes="ccc"
         inkscape:connector-curvature="0"
         id="path962"
         d="m 96.409556,183.29876 c 1.842606,-0.14038 6.816424,-4.18413 7.830644,-7.09827 -0.23738,3.62483 -3.66769,11.95333 -7.986089,12.28406"
         style="fill:#ffffff;fill-opacity:1;stroke-width:0.79375005;stroke-linecap:round;stroke-linejoin:round;stroke-miterlimit:8" />
      <path
         sodipodi:nodetypes="ccc"
         inkscape:connector-curvature="0"
         id="path964"
         d="m 96.10696,195.22897 c 5.8885,-0.42522 16.07313,-5.90078 19.47548,-8.89581 -2.51009,6.73666 -12.57167,12.48319 -19.056204,13.08782"
         style="fill:#ffffff;fill-opacity:1;stroke-width:0.79375005;stroke-linecap:round;stroke-linejoin:round;stroke-miterlimit:8" />
      <path
         sodipodi:nodetypes="ccc"
         inkscape:connector-curvature="0"
         id="path966"
         d="m 96.286172,204.97897 c 2.615711,0.23623 11.763388,-0.83385 13.070878,-1.62888 -2.02173,3.93788 -9.426353,5.72781 -13.242251,5.49174"
         style="fill:#ffffff;fill-opacity:1;stroke-width:0.79375005;stroke-linecap:round;stroke-linejoin:round;stroke-miterlimit:8" />
      <path
         sodipodi:nodetypes="csscssc"
         inkscape:connector-curvature="0"
         id="path968"
         d="m 101.23172,189.56239 c 2.28617,0.29342 6.07029,-0.29834 7.47392,-1.55623 2.11283,-1.89343 2.72607,-4.18564 4.46223,-5.78875 1.58083,-1.45968 3.76715,-2.74005 5.32866,-3.06916 -1.76172,-0.75838 -5.52345,-0.83007 -8.21783,0.92544 -1.76964,1.15301 -3.78745,4.5756 -5.26399,6.46794 -1.02323,1.31136 -1.95411,2.04658 -3.78299,3.02076 z"
         style="fill:#ffffff;fill-opacity:1;stroke-width:0.79375005;stroke-linecap:round;stroke-linejoin:round;stroke-miterlimit:8" />
      <path
         sodipodi:nodetypes="csscssc"
         inkscape:connector-curvature="0"
         id="path970"
         d="m 101.68172,201.60221 c 1.64469,0.96718 6.05097,0.82286 7.72881,-0.47268 1.67784,-1.29553 1.87536,-3.29389 3.03555,-4.45277 0.90608,-0.90506 2.26388,-1.47867 3.43819,-1.22772 -0.79927,-0.97062 -3.87174,-1.47649 -5.29801,-0.54105 -2.30983,1.51492 -2.6486,3.5552 -4.31241,4.9049 -1.33178,1.08036 -2.63485,1.51655 -4.59213,1.78932 z"
         style="fill:#ffffff;fill-opacity:1;stroke-width:0.79375005;stroke-linecap:round;stroke-linejoin:round;stroke-miterlimit:8" />
      <rect
         y="179.838"
         x="91.968292"
         height="31.191687"
         width="4.6342039"
         id="rect972"
         style="fill:#32ab41;fill-opacity:1;stroke-width:0.79375005;stroke-linecap:round;stroke-linejoin:round;stroke-miterlimit:8" />
    </g>
    <path
       style="fill:#ffffff;stroke-width:0.79375005;stroke-linecap:round;stroke-linejoin:round;stroke-miterlimit:8"
       d="m 63.54044,189.86718 -14.149524,7.1515 c -1.444986,0.73029 -1.088305,1.68489 0.499711,1.57768 l 11.417391,-0.77101 c -0.27008,-3.17425 1.26844,-6.32746 2.232422,-7.95817 z"
       id="path915"
       inkscape:connector-curvature="0" />
    <path
       sodipodi:nodetypes="scsscsscsssss"
       inkscape:connector-curvature="0"
       id="path1572"
       d="m 64.634127,189.81464 c 1.397051,-1.81501 5.141477,-3.61577 9.066305,-3.46007 l 13.919174,-3.64854 c 1.482936,-0.38871 2.349374,0.47352 2.6273,1.03197 l 2.282545,4.58643 -14.306584,8.18273 c -1.361629,0.77879 -1.024953,1.40729 0.941953,1.65917 l 14.823909,1.89832 -0.621218,2.83054 c -0.222418,1.01343 -0.820272,2.84421 -3.149545,2.88372 l -16.199667,0.27481 c -4.160403,0.0706 -11.060921,-1.75307 -11.616364,-8.28118 -0.27008,-3.17425 1.07674,-6.45676 2.232192,-7.9579 z"
       style="fill:#ffffff;stroke-width:0.79375005;stroke-linecap:round;stroke-linejoin:round;stroke-miterlimit:8" />
    <ellipse
       style="fill:#32ab41;fill-opacity:1;stroke:none;stroke-width:1.14305592;stroke-linecap:round;stroke-linejoin:round;stroke-miterlimit:8"
       id="path1568"
       cx="42.931385"
       cy="199.62836"
       rx="2.9026294"
       ry="2.0923858"
       transform="rotate(-8.6525847)" />
    <path
       style="fill:#ffffff;fill-opacity:1;stroke:none;stroke-width:0.83885753;stroke-linecap:round;stroke-linejoin:round;stroke-miterlimit:8"
       d="m 90.216754,189.36629 -0.03058,4.21108 -2.362027,-3.28985"
       id="path1577"
       inkscape:connector-curvature="0" />
    <path
       inkscape:connector-curvature="0"
       id="path1579"
       d="m 86.312371,190.77883 -0.03058,4.21108 -2.362028,-3.28986"
       style="fill:#ffffff;fill-opacity:1;stroke:none;stroke-width:0.83885753;stroke-linecap:round;stroke-linejoin:round;stroke-miterlimit:8" />
  </g>
  <g
     inkscape:label="ref"
     inkscape:groupmode="layer"
     id="layer1"
     style="display:none;opacity:0.278"
     transform="translate(-44.968845,-153.36703)"
     sodipodi:insensitive="true">
    <rect
       style="fill:#32ab41;fill-opacity:1;stroke:none;stroke-width:1.58749998;stroke-linecap:round;stroke-linejoin:round;stroke-miterlimit:8"
       id="rect963"
       width="23.951193"
       height="23.73584"
       x="13.144799"
       y="156.19612" />
    <image
       y="-174.34425"
       x="146.42947"
       width="73.72258"
       height="131.28395"
       preserveAspectRatio="none"
       xlink:href="file:///home/melano/Pictures/Dragons/Glax/sketches/fire-exit1.jpeg"
       id="image907"
       sodipodi:absref="/home/melano/Pictures/Dragons/Glax/sketches/fire-exit1.jpeg"
       transform="rotate(90)" />
  </g>
</svg>
