<?xml version="1.0" encoding="UTF-8" standalone="no"?>
<!-- Created with Inkscape (http://www.inkscape.org/) -->

<svg
   xmlns:dc="http://purl.org/dc/elements/1.1/"
   xmlns:cc="http://creativecommons.org/ns#"
   xmlns:rdf="http://www.w3.org/1999/02/22-rdf-syntax-ns#"
   xmlns:svg="http://www.w3.org/2000/svg"
   xmlns="http://www.w3.org/2000/svg"
   version="1.1"
   width="24"
   height="40"
   id="svg3224">
  <metadata
     id="metadata3167">
    <rdf:RDF>
      <cc:Work
         rdf:about="">
        <dc:format>image/svg+xml</dc:format>
        <dc:type
           rdf:resource="http://purl.org/dc/dcmitype/StillImage" />
        <dc:title></dc:title>
      </cc:Work>
    </rdf:RDF>
  </metadata>
  <defs
     id="defs3226" />
  <g
     transform="translate(0,31.26)"
     id="layer1">
    <g
       id="text4426"
       style="font-size:40px;font-style:normal;font-weight:normal;line-height:125%;letter-spacing:0px;word-spacing:0px;fill:#000000;fill-opacity:1;stroke:none;font-family:Sans">
      <path
         d="M 15.04,-6.76 4.2,-6.76 4.2,-8.64 13.32,-24.16 16.68,-24.16 16.68,-8.4 18.04,-8.4 C 18.759981,-8.3999916 19.119981,-8.1199919 19.12,-7.56 19.119981,-7.0266596 18.759981,-6.7599932 18.04,-6.76 L 16.68,-6.76 16.68,-1.64 18.04,-1.64 C 18.759981,-1.6399984 19.119981,-1.373332 19.12,-0.84 19.119981,-0.27999972 18.759981,0 18.04,0 L 12,0 C 11.279989,0 10.919989,-0.27999972 10.92,-0.84 10.919989,-1.373332 11.279989,-1.6399984 12,-1.64 L 15.04,-1.64 15.04,-6.76 M 15.04,-8.4 15.04,-22.52 14.08,-22.52 5.76,-8.4 15.04,-8.4"
         id="path4409"
         style="font-variant:normal;font-stretch:normal;font-family:FreeMono;-inkscape-font-specification:FreeMono" />
    </g>
  </g>
</svg>
