<?xml version="1.0" encoding="UTF-8" standalone="no"?>
<!-- Created with Inkscape (http://www.inkscape.org/) -->

<svg
   xmlns:dc="http://purl.org/dc/elements/1.1/"
   xmlns:cc="http://creativecommons.org/ns#"
   xmlns:rdf="http://www.w3.org/1999/02/22-rdf-syntax-ns#"
   xmlns:svg="http://www.w3.org/2000/svg"
   xmlns="http://www.w3.org/2000/svg"
   version="1.1"
   width="24"
   height="40"
   id="svg3224">
  <metadata
     id="metadata3167">
    <rdf:RDF>
      <cc:Work
         rdf:about="">
        <dc:format>image/svg+xml</dc:format>
        <dc:type
           rdf:resource="http://purl.org/dc/dcmitype/StillImage" />
        <dc:title></dc:title>
      </cc:Work>
    </rdf:RDF>
  </metadata>
  <defs
     id="defs3226" />
  <g
     transform="translate(0,31.26)"
     id="layer1">
    <g
       id="text4426"
       style="font-size:40px;font-style:normal;font-weight:normal;line-height:125%;letter-spacing:0px;word-spacing:0px;fill:#000000;fill-opacity:1;stroke:none;font-family:Sans">
      <path
         d="M 6.6,-9.24 6.6,-1.64 12.12,-1.64 C 12.866654,-1.6399984 13.239987,-1.373332 13.24,-0.84 13.239987,-0.27999972 12.866654,0 12.12,0 L 2.8,0 C 2.0799979,0 1.7199983,-0.27999972 1.72,-0.84 1.7199983,-1.373332 2.0799979,-1.6399984 2.8,-1.64 L 4.96,-1.64 4.96,-20.88 2.8,-20.88 C 2.0799979,-20.879979 1.7199983,-21.159979 1.72,-21.72 1.7199983,-22.253311 2.0799979,-22.519977 2.8,-22.52 L 12.4,-22.52 C 14.533319,-22.519977 16.319984,-21.879978 17.76,-20.6 19.226647,-19.346647 19.95998,-17.786649 19.96,-15.92 19.95998,-14.053319 19.173314,-12.466654 17.6,-11.16 16.026651,-9.8799901 14.106653,-9.2399908 11.84,-9.24 L 6.6,-9.24 M 6.6,-10.88 11.96,-10.88 C 13.69332,-10.879989 15.186651,-11.373322 16.44,-12.36 17.693316,-13.346653 18.319982,-14.533319 18.32,-15.92 18.319982,-17.279983 17.746649,-18.439982 16.6,-19.4 15.479985,-20.386646 14.133319,-20.879979 12.56,-20.88 L 6.6,-20.88 6.6,-10.88"
         id="path3504"
         style="font-variant:normal;font-stretch:normal;font-family:FreeMono;-inkscape-font-specification:FreeMono" />
    </g>
  </g>
</svg>
