<?xml version="1.0" encoding="UTF-8" standalone="no"?>
<!-- Created with Inkscape (http://www.inkscape.org/) -->

<svg
   xmlns:dc="http://purl.org/dc/elements/1.1/"
   xmlns:cc="http://creativecommons.org/ns#"
   xmlns:rdf="http://www.w3.org/1999/02/22-rdf-syntax-ns#"
   xmlns:svg="http://www.w3.org/2000/svg"
   xmlns="http://www.w3.org/2000/svg"
   version="1.1"
   width="24"
   height="40"
   id="svg3224">
  <metadata
     id="metadata8">
    <rdf:RDF>
      <cc:Work
         rdf:about="">
        <dc:format>image/svg+xml</dc:format>
        <dc:type
           rdf:resource="http://purl.org/dc/dcmitype/StillImage" />
        <dc:title></dc:title>
      </cc:Work>
    </rdf:RDF>
  </metadata>
  <defs
     id="defs3226" />
  <g
     transform="translate(0,31.26)"
     id="layer1">
    <g
       id="text4426"
       style="font-size:40px;font-style:normal;font-weight:normal;line-height:125%;letter-spacing:0px;word-spacing:0px;fill:#000000;fill-opacity:1;stroke:none;font-family:Sans">
      <path
         d="M 13.96,-16.64 C 14.599985,-17.733316 15.279985,-18.279982 16,-18.28 16.479984,-18.279982 16.86665,-18.159982 17.16,-17.92 17.453316,-17.706649 17.599982,-17.386649 17.6,-16.96 17.599982,-16.533317 17.426649,-16.159984 17.08,-15.84 16.759983,-15.546651 16.399984,-15.399985 16,-15.4 15.626651,-15.399985 15.293318,-15.519984 15,-15.76 14.039986,-14.133319 13.319987,-12.919987 12.84,-12.12 12.386654,-11.319989 12.026655,-10.679989 11.76,-10.2 11.519988,-9.7466569 11.373322,-9.4799905 11.32,-9.4 11.293322,-9.3199907 11.279989,-9.2266574 11.28,-9.12 L 11.28,-3.72 C 11.279989,-3.3199967 11.506655,-2.9066638 11.96,-2.48 12.439988,-2.0799979 12.679987,-1.6933316 12.68,-1.32 12.679987,-0.7333326 12.439988,-0.31999968 11.96,-0.08 11.479989,0.15999984 10.719989,0.27999972 9.68,0.28 9.1466575,0.27999972 8.6933246,0.10666656 8.32,-0.24 7.9733254,-0.61333272 7.7999922,-1.1866655 7.8,-1.96 L 7.8,-8.72 3.68,-14.08 C 3.4399966,-14.399986 3.0666636,-14.666652 2.56,-14.88 2.0799979,-15.119985 1.6799983,-15.373318 1.36,-15.64 1.0666656,-15.933317 0.91999908,-16.38665 0.92,-17 0.91999908,-17.453316 1.2266654,-17.786649 1.84,-18 2.4533309,-18.239982 3.1866635,-18.359982 4.04,-18.36 4.5466621,-18.359982 5.0799949,-17.933315 5.64,-17.08 L 10.56,-10.72 13.96,-16.64"
         id="path3911"
         style="font-variant:normal;font-stretch:normal;font-family:FreeMono;-inkscape-font-specification:FreeMono" />
    </g>
  </g>
</svg>
