<?xml version="1.0" encoding="UTF-8" standalone="no"?>
<!-- Created with Inkscape (http://www.inkscape.org/) -->

<svg
   xmlns:dc="http://purl.org/dc/elements/1.1/"
   xmlns:cc="http://creativecommons.org/ns#"
   xmlns:rdf="http://www.w3.org/1999/02/22-rdf-syntax-ns#"
   xmlns:svg="http://www.w3.org/2000/svg"
   xmlns="http://www.w3.org/2000/svg"
   version="1.1"
   width="24"
   height="40"
   id="svg3224">
  <metadata
     id="metadata3167">
    <rdf:RDF>
      <cc:Work
         rdf:about="">
        <dc:format>image/svg+xml</dc:format>
        <dc:type
           rdf:resource="http://purl.org/dc/dcmitype/StillImage" />
        <dc:title></dc:title>
      </cc:Work>
    </rdf:RDF>
  </metadata>
  <defs
     id="defs3226" />
  <g
     transform="translate(0,31.26)"
     id="layer1">
    <g
       id="text4426"
       style="font-size:40px;font-style:normal;font-weight:normal;line-height:125%;letter-spacing:0px;word-spacing:0px;fill:#000000;fill-opacity:1;stroke:none;font-family:Sans">
      <path
         d="M 12.84,-24.48 12.84,-1.64 18.4,-1.64 C 19.119981,-1.6399984 19.479981,-1.373332 19.48,-0.84 19.479981,-0.27999972 19.119981,0 18.4,0 L 5.64,0 C 4.8933284,0 4.5199955,-0.27999972 4.52,-0.84 4.5199955,-1.373332 4.8933284,-1.6399984 5.64,-1.64 L 11.2,-1.64 11.2,-22.28 5.92,-20.6 C 5.5999944,-20.519979 5.4133279,-20.47998 5.36,-20.48 5.1733282,-20.47998 4.999995,-20.559979 4.84,-20.72 4.6799953,-20.906646 4.5999954,-21.093312 4.6,-21.28 4.5999954,-21.679978 4.8799951,-21.973311 5.44,-22.16 L 12.84,-24.48"
         id="path4343"
         style="font-variant:normal;font-stretch:normal;font-family:FreeMono;-inkscape-font-specification:FreeMono" />
    </g>
  </g>
</svg>
