<?xml version="1.0" encoding="UTF-8" standalone="no"?>
<!-- Created with Inkscape (http://www.inkscape.org/) -->

<svg
   xmlns:dc="http://purl.org/dc/elements/1.1/"
   xmlns:cc="http://creativecommons.org/ns#"
   xmlns:rdf="http://www.w3.org/1999/02/22-rdf-syntax-ns#"
   xmlns:svg="http://www.w3.org/2000/svg"
   xmlns="http://www.w3.org/2000/svg"
   version="1.1"
   width="24"
   height="40"
   id="svg3224">
  <defs
     id="defs3226" />
  <g
     transform="translate(0,31.26)"
     id="layer1">
    <g
       id="text4426"
       style="font-size:40px;font-style:normal;font-weight:normal;line-height:125%;letter-spacing:0px;word-spacing:0px;fill:#000000;fill-opacity:1;stroke:none;font-family:Sans">
      <path
         d="M 19.88,0 4.12,0 4.12,-2.36 17.24,-20.76 17.24,-20.88 6.48,-20.88 6.48,-16.16 C 6.4799935,-15.413318 6.2133271,-15.039985 5.68,-15.04 5.1199949,-15.039985 4.8399952,-15.413318 4.84,-16.16 L 4.84,-22.52 18.8,-22.52 18.8,-20.2 5.68,-1.8 5.68,-1.64 18.24,-1.64 18.24,-7.28 C 18.239982,-7.999992 18.506648,-8.3599916 19.04,-8.36 19.59998,-8.3599916 19.87998,-7.999992 19.88,-7.28 L 19.88,0"
         id="path6667"
         style="font-variant:normal;font-stretch:normal;font-family:FreeMono;-inkscape-font-specification:FreeMono" />
    </g>
  </g>
  <metadata
     id="metadata6688">
    <rdf:RDF>
      <cc:Work
         rdf:about="">
        <dc:title></dc:title>
      </cc:Work>
    </rdf:RDF>
  </metadata>
</svg>
