<?xml version="1.0" encoding="UTF-8" standalone="no"?>
<!-- Created with Inkscape (http://www.inkscape.org/) -->

<svg
   xmlns:dc="http://purl.org/dc/elements/1.1/"
   xmlns:cc="http://creativecommons.org/ns#"
   xmlns:rdf="http://www.w3.org/1999/02/22-rdf-syntax-ns#"
   xmlns:svg="http://www.w3.org/2000/svg"
   xmlns="http://www.w3.org/2000/svg"
   version="1.1"
   width="24"
   height="40"
   id="svg3224">
  <metadata
     id="metadata8">
    <rdf:RDF>
      <cc:Work
         rdf:about="">
        <dc:format>image/svg+xml</dc:format>
        <dc:type
           rdf:resource="http://purl.org/dc/dcmitype/StillImage" />
        <dc:title></dc:title>
      </cc:Work>
    </rdf:RDF>
  </metadata>
  <defs
     id="defs3226" />
  <g
     transform="translate(0,31.26)"
     id="layer1">
    <g
       id="text4426"
       style="font-size:40px;font-style:normal;font-weight:normal;line-height:125%;letter-spacing:0px;word-spacing:0px;fill:#000000;fill-opacity:1;stroke:none;font-family:Sans">
      <path
         d="M 15.56,3.96 6.12,3.96 C 5.3999946,3.959996 5.039995,3.6933296 5.04,3.16 5.039995,2.626664 5.3999946,2.3599976 6.12,2.36 L 15.56,2.36 C 16.279984,2.3599976 16.639983,2.626664 16.64,3.16 16.639983,3.6933296 16.279984,3.959996 15.56,3.96 M 7.44,-16.68 16.24,-16.68 C 16.959983,-16.679983 17.319983,-16.413317 17.32,-15.88 17.319983,-15.319985 16.959983,-15.039985 16.24,-15.04 L 7.44,-15.04 7.44,-4.36 C 7.4399926,-3.3466633 7.8399922,-2.5333308 8.64,-1.92 9.4399906,-1.3066654 10.533323,-0.999999 11.92,-1 13.039987,-0.999999 14.226652,-1.1466655 15.48,-1.44 16.759983,-1.7599982 17.786649,-2.1466645 18.56,-2.6 18.826648,-2.7599972 19.039981,-2.8399972 19.2,-2.84 19.386647,-2.8399972 19.55998,-2.7599972 19.72,-2.6 19.87998,-2.4399976 19.95998,-2.2533311 19.96,-2.04 19.95998,-1.4533319 19.053314,-0.85333248 17.24,-0.24 15.453318,0.34666632 13.706653,0.63999936 12,0.64 10.106657,0.63999936 8.5999914,0.1999998 7.48,-0.68 6.3599936,-1.5866651 5.7999942,-2.7866639 5.8,-4.28 L 5.8,-15.04 2.84,-15.04 C 2.0933312,-15.039985 1.7199983,-15.319985 1.72,-15.88 1.7199983,-16.413317 2.0933312,-16.679983 2.84,-16.68 L 5.8,-16.68 5.8,-21.44 C 5.7999942,-22.159978 6.0799939,-22.519977 6.64,-22.52 7.1733262,-22.519977 7.4399926,-22.159978 7.44,-21.44 L 7.44,-16.68"
         id="path3140"
         style="font-variant:normal;font-stretch:normal;font-family:FreeMono;-inkscape-font-specification:FreeMono" />
    </g>
  </g>
</svg>
