<?xml version="1.0" encoding="UTF-8" standalone="no"?>
<!-- Created with Inkscape (http://www.inkscape.org/) -->

<svg
   xmlns:dc="http://purl.org/dc/elements/1.1/"
   xmlns:cc="http://creativecommons.org/ns#"
   xmlns:rdf="http://www.w3.org/1999/02/22-rdf-syntax-ns#"
   xmlns:svg="http://www.w3.org/2000/svg"
   xmlns="http://www.w3.org/2000/svg"
   version="1.1"
   width="24"
   height="40"
   id="svg3224">
  <metadata
     id="metadata8">
    <rdf:RDF>
      <cc:Work
         rdf:about="">
        <dc:format>image/svg+xml</dc:format>
        <dc:type
           rdf:resource="http://purl.org/dc/dcmitype/StillImage" />
        <dc:title></dc:title>
      </cc:Work>
    </rdf:RDF>
  </metadata>
  <defs
     id="defs3226" />
  <g
     transform="translate(0,31.26)"
     id="layer1">
    <g
       id="text4426"
       style="font-size:40px;font-style:normal;font-weight:normal;line-height:125%;letter-spacing:0px;word-spacing:0px;fill:#000000;fill-opacity:1;stroke:none;font-family:Sans">
      <path
         d="M 11.16,-17.52 11.16,-23.08 C 11.159989,-23.799976 11.439989,-24.159976 12,-24.16 12.533321,-24.159976 12.799987,-23.799976 12.8,-23.08 L 12.8,-17.52 18.12,-19.24 C 18.306648,-19.319981 18.506648,-19.359981 18.72,-19.36 18.906648,-19.359981 19.079981,-19.279981 19.24,-19.12 19.399981,-18.959981 19.479981,-18.773315 19.48,-18.56 19.479981,-18.159982 19.199981,-17.866649 18.64,-17.68 L 13.32,-16 16.56,-11.52 C 16.74665,-11.199989 16.839983,-10.959989 16.84,-10.8 16.839983,-10.586656 16.759983,-10.39999 16.6,-10.24 16.439984,-10.07999 16.253317,-9.99999 16.04,-10 15.773318,-9.99999 15.506651,-10.186656 15.24,-10.56 L 11.96,-15.04 8.72,-10.56 C 8.4266582,-10.186656 8.1466585,-9.99999 7.88,-10 7.666659,-9.99999 7.4799925,-10.07999 7.32,-10.24 7.1599928,-10.39999 7.0799929,-10.599989 7.08,-10.84 7.0799929,-10.999989 7.1866595,-11.226655 7.4,-11.52 L 10.64,-16 5.32,-17.68 C 4.7866619,-17.813316 4.5199955,-18.093315 4.52,-18.52 4.5199955,-18.733315 4.5999954,-18.919981 4.76,-19.08 4.9199951,-19.239981 5.1066616,-19.319981 5.32,-19.32 5.3999946,-19.319981 5.5733278,-19.279981 5.84,-19.2 L 11.16,-17.52"
         id="path2986"
         style="font-variant:normal;font-stretch:normal;font-family:FreeMono;-inkscape-font-specification:FreeMono" />
    </g>
  </g>
</svg>
