<?xml version="1.0" encoding="UTF-8" standalone="no"?>
<!-- Created with Inkscape (http://www.inkscape.org/) -->

<svg
   xmlns:dc="http://purl.org/dc/elements/1.1/"
   xmlns:cc="http://creativecommons.org/ns#"
   xmlns:rdf="http://www.w3.org/1999/02/22-rdf-syntax-ns#"
   xmlns:svg="http://www.w3.org/2000/svg"
   xmlns="http://www.w3.org/2000/svg"
   version="1.1"
   width="24"
   height="40"
   id="svg3224">
  <metadata
     id="metadata3167">
    <rdf:RDF>
      <cc:Work
         rdf:about="">
        <dc:format>image/svg+xml</dc:format>
        <dc:type
           rdf:resource="http://purl.org/dc/dcmitype/StillImage" />
        <dc:title></dc:title>
      </cc:Work>
    </rdf:RDF>
  </metadata>
  <defs
     id="defs3226" />
  <g
     transform="translate(0,31.26)"
     id="layer1">
    <g
       id="text4426"
       style="font-size:40px;font-style:normal;font-weight:normal;line-height:125%;letter-spacing:0px;word-spacing:0px;fill:#000000;fill-opacity:1;stroke:none;font-family:Sans">
      <path
         d="M 17.56,0 17.56,-2.64 C 15.319985,-0.45333288 12.89332,0.63999936 10.28,0.64 8.6799913,0.63999936 7.3866593,0.15999984 6.4,-0.8 5.4399946,-1.7599982 4.959995,-3.0266636 4.96,-4.6 L 4.96,-15.04 2.8,-15.04 C 2.0799979,-15.039985 1.7199983,-15.319985 1.72,-15.88 1.7199983,-16.413317 2.0799979,-16.679983 2.8,-16.68 L 6.6,-16.68 6.6,-4.6 C 6.5999934,-3.5866631 6.9466597,-2.7333306 7.64,-2.04 8.3599916,-1.3466653 9.2266574,-0.999999 10.24,-1 12.906654,-0.999999 15.346651,-2.1999978 17.56,-4.6 L 17.56,-15.04 14.6,-15.04 C 13.853319,-15.039985 13.479987,-15.319985 13.48,-15.88 13.479987,-16.413317 13.853319,-16.679983 14.6,-16.68 L 19.2,-16.68 19.2,-1.64 20.56,-1.64 C 21.279979,-1.6399984 21.639978,-1.373332 21.64,-0.84 21.639978,-0.27999972 21.279979,0 20.56,0 L 17.56,0"
         id="path3900"
         style="font-variant:normal;font-stretch:normal;font-family:FreeMono;-inkscape-font-specification:FreeMono" />
    </g>
  </g>
</svg>
