<?xml version="1.0" encoding="UTF-8" standalone="no"?>
<!-- Created with Inkscape (http://www.inkscape.org/) -->

<svg
   xmlns:dc="http://purl.org/dc/elements/1.1/"
   xmlns:cc="http://creativecommons.org/ns#"
   xmlns:rdf="http://www.w3.org/1999/02/22-rdf-syntax-ns#"
   xmlns:svg="http://www.w3.org/2000/svg"
   xmlns="http://www.w3.org/2000/svg"
   version="1.1"
   width="24"
   height="40"
   id="svg3224">
  <metadata
     id="metadata3167">
    <rdf:RDF>
      <cc:Work
         rdf:about="">
        <dc:format>image/svg+xml</dc:format>
        <dc:type
           rdf:resource="http://purl.org/dc/dcmitype/StillImage" />
        <dc:title></dc:title>
      </cc:Work>
    </rdf:RDF>
  </metadata>
  <defs
     id="defs3226" />
  <g
     transform="translate(0,31.26)"
     id="layer1">
    <g
       id="text4426"
       style="font-size:40px;font-style:normal;font-weight:normal;line-height:125%;letter-spacing:0px;word-spacing:0px;fill:#000000;fill-opacity:1;stroke:none;font-family:Sans">
      <path
         d="M 19.48,-14.04 19.48,-10.04 C 19.479981,-6.8933264 18.786648,-4.333329 17.4,-2.36 16.013317,-0.38666628 14.213319,0.5999994 12,0.6 9.7866569,0.5999994 7.9866587,-0.38666628 6.6,-2.36 5.2133281,-4.333329 4.5199955,-6.8933264 4.52,-10.04 L 4.52,-14.04 C 4.5199955,-17.213316 5.2133281,-19.786647 6.6,-21.76 7.9866587,-23.73331 9.7866569,-24.719975 12,-24.72 14.213319,-24.719975 16.013317,-23.73331 17.4,-21.76 18.786648,-19.786647 19.479981,-17.213316 19.48,-14.04 M 12,-23.08 C 10.186656,-23.079977 8.7599912,-22.159978 7.72,-20.32 6.6799933,-18.506648 6.1599938,-16.34665 6.16,-13.84 L 6.16,-10.28 C 6.1599938,-7.666659 6.6933266,-5.4666612 7.76,-3.68 8.8533245,-1.9199981 10.266656,-1.039999 12,-1.04 13.81332,-1.039999 15.239985,-1.9466647 16.28,-3.76 17.319983,-5.5999944 17.839982,-7.7733256 17.84,-10.28 L 17.84,-13.84 C 17.839982,-16.453317 17.293316,-18.639981 16.2,-20.4 15.133318,-22.186644 13.73332,-23.079977 12,-23.08"
         id="path4321"
         style="font-variant:normal;font-stretch:normal;font-family:FreeMono;-inkscape-font-specification:FreeMono" />
    </g>
  </g>
</svg>
