<?xml version='1.0' encoding ='UTF-8' standalone='yes'?>
<svg width='16.061674' height='17.983217' xmlns='http://www.w3.org/2000/svg' xmlns:xlink='http://www.w3.org/1999/xlink' xmlns:inkscape='http://www.inkscape.org/namespaces/inkscape'>
<path style='fill:#000000; stroke:none' d=' M 8.946718 13.702675  L 5.244628 11.118925  L 4.415514 11.118925  Q 4.916839 12.063729 4.781867 14.955987  L 8.946718 13.702675  Z  M 11.87754 13.52914  L 7.134237 14.76317  Q 4.338387 16.22858 4.164852 16.864878  Q 5.958052 16.055046 7.963351 16.623856  Q 9.96865 17.192667 11.356934 16.382833  Q 12.301738 15.168086 11.87754 13.52914  Z  M 10.817045 2.538559  Q 10.739919 2.422869 10.913454 2.152925  Q 11.086989 1.882981 11.308729 1.815495  Q 11.530469 1.748008 11.597955 1.87334  Q 11.665441 1.998671 11.569033 2.239692  Q 11.472624 2.480714 11.173758 2.750658  Q 10.87489 3.020602 10.720636 2.962757  Q 10.566383 2.904912 10.604946 2.760299  Q 10.64351 2.615686 10.817045 2.538559  Z  M 11.183398 2.056516  Q 11.029144 2.191488 10.952018 2.345742  Q 10.87489 2.499995 11.000221 2.451791  Q 11.125553 2.403587 11.000221 2.577122  Q 10.87489 2.750658 11.000221 2.683172  Q 11.125553 2.615686 11.270165 2.451791  Q 11.414779 2.287897 11.443701 2.10472  Q 11.472624 1.921544 11.183398 2.056516  Z  M 10.87489 1.593755  Q 11.742568 1.169557 12.002872 1.670882  Q 12.263174 2.172206 11.742568 2.692813  Q 11.221961 3.213419 11.414779 3.483363  Q 11.607595 3.772589 12.253533 3.155574  Q 12.899471 2.538559 12.899471 1.6516  Q 12.899471 0.745359 11.935385 0.494697  Q 10.971299 0.244034 10.325361 0.398288  Q 9.679423 0.552542 9.467325 1.09243  Q 10.566383 1.265965 10.87489 1.593755  Z  M 10.778481 2.692813  Q 10.662791 2.76994 10.710996 2.847067  Q 10.7592 2.924193 10.845968 2.856707  Q 10.932735 2.789221 10.778481 2.692813  Z  M 8.888873 2.345742  L 8.888873 2.191488  L 9.100972 2.017953  Q 9.428761 1.825135 9.930086 2.21077  L 10.238594 2.230052  L 10.238594 2.403587  L 9.910805 2.345742  Q 9.40948 2.538559 8.985282 2.345742  L 8.888873 2.345742  Z  M 9.081691 2.21077  Q 9.158817 2.249333 9.274508 2.287897  Q 9.197381 2.172206 9.274508 2.075798  Q 9.100972 2.133643 9.081691 2.21077  Z  M 9.486607 2.307178  Q 9.640861 2.307178 9.795115 2.268615  L 9.52517 2.114361  Q 9.602297 2.230052 9.486607 2.307178  Z  M 8.561084 3.020602  Q 8.541802 2.962757 8.561084 2.943475  Q 8.580366 2.924193 8.618929 2.924193  Q 8.676774 2.924193 8.74426 3.00132  Q 8.811747 3.078447 8.859951 3.059165  Q 8.908154 3.039884 8.908154 2.982038  Q 8.908154 2.924193 8.937078 2.904912  Q 8.966001 2.88563 8.985282 2.982038  Q 9.004563 3.078447 8.908154 3.136292  Q 8.811747 3.194138 8.715338 3.088088  Q 8.618929 2.982038 8.561084 3.020602  Z  M 9.023846 3.483363  L 8.638211 3.541209  Q 8.580366 3.579772 8.599648 3.608695  Q 8.618929 3.637617 8.696056 3.618335  Q 8.773183 3.618335 8.879232 3.570131  Q 8.985282 3.521927 9.023846 3.483363  Z  M 9.043127 3.425518  Q 9.081691 3.425518 8.937078 3.406236  Q 8.792464 3.386955 8.676774 3.367673  Q 8.561084 3.348391 8.541802 3.386955  Q 8.52252 3.425518 8.580366 3.4448  L 9.043127 3.425518  Z  M 10.739919 1.882981  Q 10.180749 1.478064 9.293789 1.420219  Q 9.197381 1.53591 9.062408 1.728727  Q 9.428761 1.613036 9.756551 1.796213  Q 10.08434 1.979389 10.315721 1.998671  L 10.315721 2.133643  Q 9.96865 2.075798 9.63122 1.921544  Q 9.293789 1.76729 8.985282 1.921544  Q 8.676774 2.21077 8.348985 2.943475  Q 8.696056 3.078447 8.676774 3.271264  Q 9.023846 3.290546 9.149177 3.396595  Q 9.274508 3.502645 8.831028 3.753307  Q 8.715338 4.293196 9.438402 4.216069  Q 10.161467 4.138942 10.161467 4.987338  Q 10.142185 5.662198 9.110613 5.662198  Q 8.079041 5.662198 8.098323 6.279213  Q 8.001914 8.14954 8.281499 8.535174  Q 8.561084 8.920809 9.96865 13.490577  L 11.781132 13.08566  Q 11.858258 9.692078 12.590963 7.686779  Q 13.323668 5.681479 12.542759 5.662198  Q 11.761849 5.642916 11.491905 5.623634  Q 11.221961 5.604352 11.241243 4.061815  Q 11.164116 3.849716 10.990581 3.56049  Q 10.817045 3.271264 11.144835 2.982038  Q 11.472624 2.692813 11.675082 2.278256  Q 11.87754 1.863699 11.597955 1.728727  Q 11.31837 1.593755 11.019504 1.911903  Q 10.720636 2.230052 10.739919 1.882981  Z  M 13.342951 7.281862  Q 12.436709 9.692078 12.398147 13.047097  Q 13.053725 14.589634 12.340302 15.9972  Q 13.092288 15.418749 13.420077 16.421398  Q 13.747867 17.424047 14.654108 17.22159  Q 15.560349 17.019131 16.061674 17.983217  L 0 17.983217  Q 0.134972 17.520456 0.597733 17.549379  Q 1.060495 17.5783 1.523256 17.375843  Q 1.986017 17.173386 2.525905 17.076977  Q 2.448779 15.573002 3.644245 15.245213  L 3.085075 11.234615  Q 2.892258 9.942739 4.473359 9.923458  Q 5.051811 9.923458 5.784516 10.598318  L 9.120254 13.066379  Q 8.040478 9.306443 7.760892 8.834041  Q 7.481308 8.361639 7.481308 7.725342  L 7.539153 7.358989  Q 6.902856 7.397552 5.562777 7.918159  Q 4.222697 8.438766 2.217398 8.477329  Q 1.986017 6.973355 5.572417 4.389604  Q 6.150869 3.56049 7.221004 3.541209  Q 8.29114 3.521927 8.271858 3.743667  Q 8.252577 3.965406 7.462026 4.023252  Q 7.462026 4.929492 6.960701 4.968056  Q 6.459376 5.006619 5.919488 5.045183  Q 5.109656 6.182804 3.972034 7.243299  Q 5.49529 6.452748 7.114955 5.835733  Q 7.828379 5.083746 9.679423 5.064465  L 9.583015 4.466731  Q 9.390198 4.505294 8.985282 4.505294  Q 8.599648 4.505294 8.599648 4.177505  Q 8.599648 3.830434 8.474317 3.762948  Q 8.348985 3.695462 8.455034 3.599054  Q 8.561084 3.502645 8.503239 3.521927  Q 8.387548 3.502645 8.368267 3.425518  Q 8.348985 3.348391 8.464675 3.271264  Q 8.348985 3.174856 8.18509 3.126652  Q 8.021195 3.078447 8.214013 2.673531  Q 8.541802 2.075798 8.831028 1.728727  Q 9.293789 0.186189 10.392847 0.041576  Q 11.491905 -0.103037 12.388506 0.244034  Q 13.285106 0.591105 13.285106 1.613036  Q 13.285106 2.634968 12.812703 3.213419  Q 12.340302 3.791871 11.800413 4.00397  L 11.819695 4.948774  Q 13.188697 4.929492 13.844275 5.720043  Q 15.57963 8.419484 16.042391 9.634233  Q 15.926702 11.138206 15.541067 13.394168  Q 15.791729 14.165437 15.791729 14.705325  Q 15.791729 15.264495 14.827643 15.264495  Q 14.711953 16.055046 14.509495 16.064686  Q 14.307036 16.074327 14.307036 15.071677  Q 14.307036 14.069028 14.750516 13.413449  Q 14.750516 11.099643 15.001179 9.749923  Q 13.728585 8.072412 13.342951 7.281862  Z '/></svg>
