<?xml version="1.0" encoding="UTF-8" standalone="no"?>
<!-- Created with Inkscape (http://www.inkscape.org/) -->

<svg
   xmlns:dc="http://purl.org/dc/elements/1.1/"
   xmlns:cc="http://creativecommons.org/ns#"
   xmlns:rdf="http://www.w3.org/1999/02/22-rdf-syntax-ns#"
   xmlns:svg="http://www.w3.org/2000/svg"
   xmlns="http://www.w3.org/2000/svg"
   version="1.1"
   width="24"
   height="40"
   id="svg3224">
  <metadata
     id="metadata8">
    <rdf:RDF>
      <cc:Work
         rdf:about="">
        <dc:format>image/svg+xml</dc:format>
        <dc:type
           rdf:resource="http://purl.org/dc/dcmitype/StillImage" />
        <dc:title></dc:title>
      </cc:Work>
    </rdf:RDF>
  </metadata>
  <defs
     id="defs3226" />
  <g
     transform="translate(0,31.26)"
     id="layer1">
    <g
       id="text4426"
       style="font-size:40px;font-style:normal;font-weight:normal;line-height:125%;letter-spacing:0px;word-spacing:0px;fill:#000000;fill-opacity:1;stroke:none;font-family:Sans">
      <path
         d="M 2.24,-14.32 C 2.2399978,-14.719985 2.0133313,-15.119985 1.56,-15.52 1.1066656,-15.946651 0.87999912,-16.34665 0.88,-16.72 0.87999912,-17.333316 1.1199989,-17.746649 1.6,-17.96 2.0799979,-18.199982 2.8399972,-18.319982 3.88,-18.32 4.3866623,-18.319982 4.8133285,-18.133315 5.16,-17.76 5.5066612,-17.413316 5.6799943,-16.86665 5.68,-16.12 L 5.68,-13.72 C 6.5066602,-12.253321 7.3599926,-11.053322 8.24,-10.12 9.1199909,-9.2133241 9.9466567,-8.7599912 10.72,-8.76 11.466655,-8.7599912 12.293321,-9.2133241 13.2,-10.12 14.133319,-11.053322 14.973318,-12.186654 15.72,-13.52 L 15.72,-14.32 C 15.719984,-14.719985 15.479985,-15.119985 15,-15.52 14.546652,-15.946651 14.319986,-16.34665 14.32,-16.72 14.319986,-17.333316 14.559985,-17.746649 15.04,-17.96 15.519984,-18.199982 16.279984,-18.319982 17.32,-18.32 17.826649,-18.319982 18.253315,-18.133315 18.6,-17.76 18.973314,-17.413316 19.159981,-16.86665 19.16,-16.12 L 19.16,-3.72 C 19.159981,-3.3199967 19.386647,-2.9066638 19.84,-2.48 20.31998,-2.0799979 20.559979,-1.6933316 20.56,-1.32 20.559979,-0.7333326 20.31998,-0.31999968 19.84,-0.08 19.359981,0.15999984 18.599981,0.27999972 17.56,0.28 17.02665,0.27999972 16.58665,0.10666656 16.24,-0.24 15.893317,-0.61333272 15.719984,-1.1866655 15.72,-1.96 L 15.72,-11.04 C 14.973318,-9.8933234 14.199986,-8.999991 13.4,-8.36 12.626654,-7.7199923 11.733322,-7.3999926 10.72,-7.4 9.039991,-7.3999926 7.3599926,-8.666658 5.68,-11.2 L 5.68,-3.72 C 5.6799943,-3.3199967 5.9199941,-2.9066638 6.4,-2.48 6.8799931,-2.0799979 7.1199929,-1.6933316 7.12,-1.32 7.1199929,-0.7333326 6.8799931,-0.31999968 6.4,-0.08 5.9199941,0.15999984 5.1599948,0.27999972 4.12,0.28 3.5866631,0.27999972 3.1333302,0.10666656 2.76,-0.24 2.4133309,-0.61333272 2.2399978,-1.1866655 2.24,-1.96 L 2.24,-14.32"
         id="path3540"
         style="font-variant:normal;font-stretch:normal;font-family:FreeMono;-inkscape-font-specification:FreeMono" />
    </g>
  </g>
</svg>
