<?xml version='1.0' encoding ='UTF-8' standalone='yes'?>
<svg width='12.52' height='12.96' xmlns='http://www.w3.org/2000/svg' xmlns:xlink='http://www.w3.org/1999/xlink' xmlns:inkscape='http://www.inkscape.org/namespaces/inkscape'>
<path style='fill:#000000; stroke:none' d=' M 9.31 1.6  C 10.61 1.65 10.93 2.08 10.87 2.88  L 10.88 11.27  L 3.6 11.27  C 4.68 10.22 6.87 6.82 7.72 2.88  C 7.85 2.03 8.43 1.6 9.31 1.6  Z  M 9.28 0  C 7.42 0 6.47 0.61 6.29 1.84  C 5.91 3.07 5.46 4.85 4.6 6.7  C 3.31 9.47 1.2 11.47 0 12.96  L 12.52 12.95  L 12.51 2.24  C 12.54 0.75 11.6 0 9.28 0  Z '/></svg>
