<?xml version="1.0" encoding="UTF-8" standalone="no"?>
<!-- Created with Inkscape (http://www.inkscape.org/) -->

<svg
   xmlns:dc="http://purl.org/dc/elements/1.1/"
   xmlns:cc="http://creativecommons.org/ns#"
   xmlns:rdf="http://www.w3.org/1999/02/22-rdf-syntax-ns#"
   xmlns:svg="http://www.w3.org/2000/svg"
   xmlns="http://www.w3.org/2000/svg"
   version="1.1"
   width="24"
   height="40"
   id="svg3224">
  <metadata
     id="metadata3167">
    <rdf:RDF>
      <cc:Work
         rdf:about="">
        <dc:format>image/svg+xml</dc:format>
        <dc:type
           rdf:resource="http://purl.org/dc/dcmitype/StillImage" />
        <dc:title></dc:title>
      </cc:Work>
    </rdf:RDF>
  </metadata>
  <defs
     id="defs3226" />
  <g
     transform="translate(0,31.26)"
     id="layer1">
    <g
       id="text4426"
       style="font-size:40px;font-style:normal;font-weight:normal;line-height:125%;letter-spacing:0px;word-spacing:0px;fill:#000000;fill-opacity:1;stroke:none;font-family:Sans">
      <path
         d="M 12,-24.6 19.12,-15.68 C 19.359981,-15.413318 19.479981,-15.173318 19.48,-14.96 19.479981,-14.746652 19.399981,-14.559985 19.24,-14.4 19.079981,-14.239986 18.893314,-14.159986 18.68,-14.16 18.413315,-14.159986 18.146649,-14.333319 17.88,-14.68 L 12,-22.08 6.12,-14.68 C 5.8799941,-14.333319 5.6133277,-14.159986 5.32,-14.16 5.1066616,-14.159986 4.9199951,-14.239986 4.76,-14.4 4.5999954,-14.559985 4.5199955,-14.746652 4.52,-14.96 4.5199955,-15.173318 4.6399954,-15.413318 4.88,-15.68 L 12,-24.6"
         id="path4849"
         style="font-variant:normal;font-stretch:normal;font-family:FreeMono;-inkscape-font-specification:FreeMono" />
    </g>
  </g>
</svg>
