<?xml version="1.0" encoding="UTF-8" standalone="no"?>
<!-- Created with Inkscape (http://www.inkscape.org/) -->

<svg
   xmlns:dc="http://purl.org/dc/elements/1.1/"
   xmlns:cc="http://creativecommons.org/ns#"
   xmlns:rdf="http://www.w3.org/1999/02/22-rdf-syntax-ns#"
   xmlns:svg="http://www.w3.org/2000/svg"
   xmlns="http://www.w3.org/2000/svg"
   version="1.1"
   width="24"
   height="40"
   id="svg3224">
  <metadata
     id="metadata3167">
    <rdf:RDF>
      <cc:Work
         rdf:about="">
        <dc:format>image/svg+xml</dc:format>
        <dc:type
           rdf:resource="http://purl.org/dc/dcmitype/StillImage" />
        <dc:title></dc:title>
      </cc:Work>
    </rdf:RDF>
  </metadata>
  <defs
     id="defs3226" />
  <g
     transform="translate(0,31.26)"
     id="layer1">
    <g
       id="text4426"
       style="font-size:40px;font-style:normal;font-weight:normal;line-height:125%;letter-spacing:0px;word-spacing:0px;fill:#000000;fill-opacity:1;stroke:none;font-family:Sans">
      <path
         d="M 7.4,-7.2 7.4,0 3.6,0 C 2.8799971,0 2.5199975,-0.27999972 2.52,-0.84 2.5199975,-1.373332 2.8799971,-1.6399984 3.6,-1.64 L 5.76,-1.64 5.76,-22.52 3.6,-22.52 C 2.8799971,-22.519977 2.5199975,-22.799977 2.52,-23.36 2.5199975,-23.893309 2.8799971,-24.159976 3.6,-24.16 L 7.4,-24.16 7.4,-9.16 14.32,-15.04 13.44,-15.04 C 12.719987,-15.039985 12.359988,-15.319985 12.36,-15.88 12.359988,-16.413317 12.719987,-16.679983 13.44,-16.68 L 18.64,-16.68 C 19.359981,-16.679983 19.71998,-16.413317 19.72,-15.88 19.71998,-15.319985 19.359981,-15.039985 18.64,-15.04 L 16.76,-15.04 10.48,-9.8 18.76,-1.64 20.56,-1.64 C 21.279979,-1.6399984 21.639978,-1.373332 21.64,-0.84 21.639978,-0.27999972 21.279979,0 20.56,0 L 15.32,0 C 14.599985,0 14.239986,-0.27999972 14.24,-0.84 14.239986,-1.373332 14.599985,-1.6399984 15.32,-1.64 L 16.44,-1.64 9.24,-8.76 7.4,-7.2"
         id="path4126"
         style="font-variant:normal;font-stretch:normal;font-family:FreeMono;-inkscape-font-specification:FreeMono" />
    </g>
  </g>
</svg>
