<?xml version="1.0" encoding="UTF-8" standalone="no"?>
<!-- Created with Inkscape (http://www.inkscape.org/) -->

<svg
   xmlns:dc="http://purl.org/dc/elements/1.1/"
   xmlns:cc="http://creativecommons.org/ns#"
   xmlns:rdf="http://www.w3.org/1999/02/22-rdf-syntax-ns#"
   xmlns:svg="http://www.w3.org/2000/svg"
   xmlns="http://www.w3.org/2000/svg"
   version="1.1"
   width="24"
   height="40"
   id="svg3224">
  <metadata
     id="metadata3167">
    <rdf:RDF>
      <cc:Work
         rdf:about="">
        <dc:format>image/svg+xml</dc:format>
        <dc:type
           rdf:resource="http://purl.org/dc/dcmitype/StillImage" />
        <dc:title></dc:title>
      </cc:Work>
    </rdf:RDF>
  </metadata>
  <defs
     id="defs3226" />
  <g
     transform="translate(0,31.26)"
     id="layer1">
    <g
       id="text4426"
       style="font-size:40px;font-style:normal;font-weight:normal;line-height:125%;letter-spacing:0px;word-spacing:0px;fill:#000000;fill-opacity:1;stroke:none;font-family:Sans">
      <path
         d="M 12,-23.04 C 14.826652,-23.039977 17.186649,-21.879978 19.08,-19.56 20.999979,-17.266649 21.959978,-14.426652 21.96,-11.04 21.959978,-7.8133255 20.986646,-5.0533283 19.04,-2.76 17.093316,-0.49333284 14.746652,0.63999936 12,0.64 9.2266574,0.63999936 6.8666598,-0.50666616 4.92,-2.8 2.999997,-5.0933282 2.039998,-7.8933254 2.04,-11.2 2.039998,-14.506652 2.999997,-17.306649 4.92,-19.6 6.8666598,-21.893311 9.2266574,-23.039977 12,-23.04 M 12,-21.4 C 9.706657,-21.399979 7.7466589,-20.39998 6.12,-18.4 4.4933288,-16.399984 3.6799963,-13.999986 3.68,-11.2 3.6799963,-8.3999916 4.4933288,-5.999994 6.12,-4 7.7466589,-1.999998 9.706657,-0.999999 12,-1 14.266652,-0.999999 16.213317,-1.9866647 17.84,-3.96 19.493314,-5.959994 20.31998,-8.333325 20.32,-11.08 20.31998,-13.959986 19.506647,-16.399984 17.88,-18.4 16.279984,-20.39998 14.319986,-21.399979 12,-21.4"
         id="path3482"
         style="font-variant:normal;font-stretch:normal;font-family:FreeMono;-inkscape-font-specification:FreeMono" />
    </g>
  </g>
</svg>
