<?xml version="1.0" encoding="UTF-8" standalone="no"?>
<!-- Created with Inkscape (http://www.inkscape.org/) -->

<svg
   xmlns:dc="http://purl.org/dc/elements/1.1/"
   xmlns:cc="http://creativecommons.org/ns#"
   xmlns:rdf="http://www.w3.org/1999/02/22-rdf-syntax-ns#"
   xmlns:svg="http://www.w3.org/2000/svg"
   xmlns="http://www.w3.org/2000/svg"
   version="1.1"
   width="24"
   height="40"
   id="svg3224">
  <metadata
     id="metadata3167">
    <rdf:RDF>
      <cc:Work
         rdf:about="">
        <dc:format>image/svg+xml</dc:format>
        <dc:type
           rdf:resource="http://purl.org/dc/dcmitype/StillImage" />
        <dc:title></dc:title>
      </cc:Work>
    </rdf:RDF>
  </metadata>
  <defs
     id="defs3226" />
  <g
     transform="translate(0,31.26)"
     id="layer1">
    <g
       id="text4426"
       style="font-size:40px;font-style:normal;font-weight:normal;line-height:125%;letter-spacing:0px;word-spacing:0px;fill:#000000;fill-opacity:1;stroke:none;font-family:Sans">
      <path
         d="M 19.96,-20.88 19.96,-7.4 C 19.95998,-5.1333282 19.186647,-3.2266634 17.64,-1.68 16.119984,-0.1333332 14.239986,0.63999936 12,0.64 9.7333236,0.63999936 7.8399922,-0.11999988 6.32,-1.64 4.7999952,-3.1866635 4.039996,-5.1066616 4.04,-7.4 L 4.04,-20.88 2.68,-20.88 C 1.959998,-20.879979 1.5999984,-21.159979 1.6,-21.72 1.5999984,-22.253311 1.959998,-22.519977 2.68,-22.52 L 8.64,-22.52 C 9.3599906,-22.519977 9.7199903,-22.253311 9.72,-21.72 9.7199903,-21.159979 9.3599906,-20.879979 8.64,-20.88 L 5.68,-20.88 5.68,-7.4 C 5.6799943,-5.5866611 6.2799937,-4.0666626 7.48,-2.84 8.706658,-1.6133317 10.213323,-0.999999 12,-1 13.759986,-0.999999 15.253318,-1.6133317 16.48,-2.84 17.706649,-4.0933292 18.319982,-5.6133277 18.32,-7.4 L 18.32,-20.88 15.36,-20.88 C 14.639985,-20.879979 14.279986,-21.159979 14.28,-21.72 14.279986,-22.253311 14.639985,-22.519977 15.36,-22.52 L 21.32,-22.52 C 22.039978,-22.519977 22.399978,-22.253311 22.4,-21.72 22.399978,-21.159979 22.039978,-20.879979 21.32,-20.88 L 19.96,-20.88"
         id="path3614"
         style="font-variant:normal;font-stretch:normal;font-family:FreeMono;-inkscape-font-specification:FreeMono" />
    </g>
  </g>
</svg>
