<?xml version="1.0" encoding="UTF-8" standalone="no"?>
<!-- Created with Inkscape (http://www.inkscape.org/) -->

<svg
   xmlns:dc="http://purl.org/dc/elements/1.1/"
   xmlns:cc="http://creativecommons.org/ns#"
   xmlns:rdf="http://www.w3.org/1999/02/22-rdf-syntax-ns#"
   xmlns:svg="http://www.w3.org/2000/svg"
   xmlns="http://www.w3.org/2000/svg"
   version="1.1"
   width="24"
   height="40"
   id="svg3224">
  <metadata
     id="metadata8">
    <rdf:RDF>
      <cc:Work
         rdf:about="">
        <dc:format>image/svg+xml</dc:format>
        <dc:type
           rdf:resource="http://purl.org/dc/dcmitype/StillImage" />
        <dc:title></dc:title>
      </cc:Work>
    </rdf:RDF>
  </metadata>
  <defs
     id="defs3226" />
  <g
     transform="translate(0,31.26)"
     id="layer1">
    <g
       id="text4426"
       style="font-size:40px;font-style:normal;font-weight:normal;line-height:125%;letter-spacing:0px;word-spacing:0px;fill:#000000;fill-opacity:1;stroke:none;font-family:Sans">
      <path
         d="M 19.44,-24.48 C 20.373313,-26.079974 21.373312,-26.879973 22.44,-26.88 23.13331,-26.879973 23.69331,-26.70664 24.12,-26.36 24.546642,-26.039974 24.759975,-25.573308 24.76,-24.96 24.759975,-24.319976 24.506642,-23.77331 24,-23.32 23.519976,-22.866644 22.986644,-22.639977 22.4,-22.64 22.026645,-22.639977 21.546645,-22.906644 20.96,-23.44 L 15.48,-14.28 C 15.479985,-14.146653 15.479985,-14.053319 15.48,-14 15.479985,-13.973319 15.479985,-13.933319 15.48,-13.88 L 15.48,-5.48 C 15.479985,-4.8933284 15.813318,-4.293329 16.48,-3.68 17.173316,-3.0666636 17.519982,-2.4933308 17.52,-1.96 17.519982,-1.0533323 17.239983,-0.42666624 16.68,-0.08 16.119984,0.23999976 15.106652,0.3999996 13.64,0.4 12.173321,0.3999996 11.439989,-0.69333264 11.44,-2.88 L 11.44,-12.8 5.36,-20.72 C 4.9866617,-21.199979 4.4399956,-21.599978 3.72,-21.92 2.999997,-22.239978 2.4133309,-22.599977 1.96,-23 1.5066652,-23.426643 1.2799987,-24.093309 1.28,-25 1.2799987,-25.639974 1.6533317,-26.133307 2.4,-26.48 3.1733302,-26.82664 3.9733294,-26.999973 4.8,-27 5.5733278,-26.999973 6.3599936,-26.373307 7.16,-25.12 L 14.4,-15.72 19.44,-24.48"
         id="path3889"
         style="font-variant:normal;font-stretch:normal;font-family:FreeMono;-inkscape-font-specification:FreeMono" />
    </g>
  </g>
</svg>
