<?xml version="1.0" encoding="UTF-8" standalone="no"?>
<!-- Created with Inkscape (http://www.inkscape.org/) -->

<svg
   xmlns:dc="http://purl.org/dc/elements/1.1/"
   xmlns:cc="http://creativecommons.org/ns#"
   xmlns:rdf="http://www.w3.org/1999/02/22-rdf-syntax-ns#"
   xmlns:svg="http://www.w3.org/2000/svg"
   xmlns="http://www.w3.org/2000/svg"
   version="1.1"
   width="24"
   height="40"
   id="svg3224">
  <metadata
     id="metadata8">
    <rdf:RDF>
      <cc:Work
         rdf:about="">
        <dc:format>image/svg+xml</dc:format>
        <dc:type
           rdf:resource="http://purl.org/dc/dcmitype/StillImage" />
        <dc:title></dc:title>
      </cc:Work>
    </rdf:RDF>
  </metadata>
  <defs
     id="defs3226" />
  <g
     transform="translate(0,31.26)"
     id="layer1">
    <g
       id="text4426"
       style="font-size:40px;font-style:normal;font-weight:normal;line-height:125%;letter-spacing:0px;word-spacing:0px;fill:#000000;fill-opacity:1;stroke:none;font-family:Sans">
      <path
         d="M 16.64,-3.04 C 15.839984,-1.9466647 14.853318,-1.0933322 13.68,-0.48 12.506654,0.10666656 11.253322,0.3999996 9.92,0.4 7.3066594,0.3999996 5.1333282,-0.49333284 3.4,-2.28 1.6933316,-4.0666626 0.83999916,-6.2666604 0.84,-8.88 0.83999916,-11.653322 1.6933316,-13.933319 3.4,-15.72 5.1333282,-17.506649 7.3866593,-18.399982 10.16,-18.4 12.159988,-18.399982 13.719986,-17.973315 14.84,-17.12 15.959984,-16.26665 16.519983,-15.319985 16.52,-14.28 16.519983,-13.799986 16.373317,-13.399987 16.08,-13.08 15.786651,-12.759987 15.386651,-12.599987 14.88,-12.6 14.186652,-12.599987 13.666653,-13.21332 13.32,-14.44 L 13.08,-15.32 C 12.733321,-16.62665 11.719988,-17.279983 10.04,-17.28 9.0533243,-17.279983 8.1999918,-17.039983 7.48,-16.56 6.7599932,-16.079984 6.1999938,-15.439985 5.8,-14.64 5.4266612,-13.866653 5.1466615,-13.066654 4.96,-12.24 4.7999952,-11.413322 4.7199953,-10.559989 4.72,-9.68 L 14,-9.68 C 14.959985,-9.6799903 15.626651,-9.5866571 16,-9.4 16.399984,-9.2399908 16.599983,-8.9733244 16.6,-8.6 16.599983,-7.9066588 16.46665,-7.3999926 16.2,-7.08 15.933317,-6.7866599 15.466651,-6.6399934 14.8,-6.64 14.453319,-6.6399934 13.999986,-6.9066598 13.44,-7.44 12.906654,-7.999992 12.399988,-8.2799917 11.92,-8.28 L 4.76,-8.28 C 5.1333282,-3.3199967 6.8533265,-0.83999916 9.92,-0.84 11.253322,-0.83999916 12.319988,-1.039999 13.12,-1.44 13.919986,-1.8666648 14.746652,-2.626664 15.6,-3.72 L 16.64,-3.04"
         id="path3188"
         style="font-variant:normal;font-stretch:normal;font-family:FreeMono;-inkscape-font-specification:FreeMono" />
    </g>
  </g>
</svg>
