<?xml version="1.0" encoding="UTF-8" standalone="no"?>
<!-- Created with Inkscape (http://www.inkscape.org/) -->

<svg
   xmlns:dc="http://purl.org/dc/elements/1.1/"
   xmlns:cc="http://creativecommons.org/ns#"
   xmlns:rdf="http://www.w3.org/1999/02/22-rdf-syntax-ns#"
   xmlns:svg="http://www.w3.org/2000/svg"
   xmlns="http://www.w3.org/2000/svg"
   version="1.1"
   width="24"
   height="40"
   id="svg3224">
  <metadata
     id="metadata8">
    <rdf:RDF>
      <cc:Work
         rdf:about="">
        <dc:format>image/svg+xml</dc:format>
        <dc:type
           rdf:resource="http://purl.org/dc/dcmitype/StillImage" />
        <dc:title></dc:title>
      </cc:Work>
    </rdf:RDF>
  </metadata>
  <defs
     id="defs3226" />
  <g
     transform="translate(0,31.26)"
     id="layer1">
    <g
       id="text4426"
       style="font-size:40px;font-style:normal;font-weight:normal;line-height:125%;letter-spacing:0px;word-spacing:0px;fill:#000000;fill-opacity:1;stroke:none;font-family:Sans">
      <path
         d="M 2.28,-14.32 C 2.2799977,-14.719985 2.0533313,-15.119985 1.6,-15.52 1.1466655,-15.946651 0.91999908,-16.34665 0.92,-16.72 0.91999908,-17.333316 1.1599988,-17.746649 1.64,-17.96 2.1199979,-18.199982 2.8799971,-18.319982 3.92,-18.32 4.4266622,-18.319982 4.8533285,-18.133315 5.2,-17.76 5.5466611,-17.413316 5.7199943,-16.86665 5.72,-16.12 L 5.72,-11.04 14.76,-11.04 14.76,-14.32 C 14.759985,-14.719985 14.519985,-15.119985 14.04,-15.52 13.586653,-15.946651 13.359987,-16.34665 13.36,-16.72 13.359987,-17.333316 13.599986,-17.746649 14.08,-17.96 14.559985,-18.199982 15.319985,-18.319982 16.36,-18.32 16.86665,-18.319982 17.293316,-18.133315 17.64,-17.76 18.013315,-17.413316 18.199982,-16.86665 18.2,-16.12 L 18.2,-3.72 C 18.199982,-3.3199967 18.426648,-2.9066638 18.88,-2.48 19.359981,-2.0799979 19.59998,-1.6933316 19.6,-1.32 19.59998,-0.7333326 19.359981,-0.31999968 18.88,-0.08 18.399982,0.15999984 17.639982,0.27999972 16.6,0.28 16.066651,0.27999972 15.626651,0.10666656 15.28,-0.24 14.933318,-0.61333272 14.759985,-1.1866655 14.76,-1.96 L 14.76,-9.72 5.72,-9.72 5.72,-3.72 C 5.7199943,-3.3199967 5.959994,-2.9066638 6.44,-2.48 6.9199931,-2.0799979 7.1599928,-1.6933316 7.16,-1.32 7.1599928,-0.7333326 6.9199931,-0.31999968 6.44,-0.08 5.959994,0.15999984 5.1999948,0.27999972 4.16,0.28 3.626663,0.27999972 3.1733302,0.10666656 2.8,-0.24 2.4533309,-0.61333272 2.2799977,-1.1866655 2.28,-1.96 L 2.28,-14.32"
         id="path3320"
         style="font-variant:normal;font-stretch:normal;font-family:FreeMono;-inkscape-font-specification:FreeMono" />
    </g>
  </g>
</svg>
