<?xml version="1.0" encoding ="US-ASCII" standalone="yes"?>
<svg width="17.85442" height="10.08">
<path style="fill:#000000; stroke:none" d=" M 2.305219 8.040477  Q 1.869202 7.65036 1.180757 7.122546  Q 1.203705 7.420873 1.846254 8.040477  L 2.305219 8.040477  Z  M 1.088964 8.086373  L 0.308725 7.397924  Q 0.285777 7.948685 0.515259 8.40765  L 1.088964 8.086373  Z  M 16.372467 2.257529  Q 15.844661 3.01482 15.523387 3.198404  Q 15.202106 3.38199 14.731668 3.037768  Q 14.26123 2.693546 14.215333 3.026294  Q 14.169436 3.359041 14.605453 4.55235  Q 14.146487 6.06693 13.148242 6.973383  Q 12.149996 7.879839 11.232073 8.155218  Q 10.314145 8.430599 7.90458 8.545339  Q 5.127849 8.683027 1.364343 8.499444  Q 0.171036 9.623905 1.364343 9.486216  L 11.39271 9.486216  Q 13.802263 9.486216 15.133261 7.971632  Q 16.14299 6.20462 16.923227 2.487012  Q 17.405136 1.156016 17.141237 0.846215  Q 16.877329 0.536414 16.590479 0.811792  Q 16.303623 1.087171 16.406889 1.385498  Q 16.510159 1.683824 16.372467 2.257529  Z  M 10.405934 7.627409  L 10.36004 6.984858  Q 9.901076 7.168444 9.648645 7.053703  L 9.717489 7.765099  L 10.405934 7.627409  Z  M 8.707768 7.833944  L 8.753662 7.237287  Q 8.294699 7.397924 8.04227 7.260236  L 8.111115 7.902788  L 8.707768 7.833944  Z  M 12.149996 6.893065  Q 11.966411 6.479998 11.73693 6.594736  Q 11.507446 6.709479 11.209124 6.686532  L 11.300918 7.306133  L 12.149996 6.893065  Z  M 9.166732 7.810996  L 9.212627 7.810996  Q 9.281472 7.673306 9.132309 7.248762  Q 8.983148 6.82422 9.32737 6.640635  Q 9.625696 6.57179 9.843707 6.62916  Q 10.061714 6.686532 10.394464 6.594736  Q 10.72721 6.502945 10.715735 6.950436  Q 10.704265 7.397924 10.796056 7.535615  Q 10.796056 7.329082 10.69279 6.893065  Q 10.589521 6.457048 10.910797 6.273464  Q 11.507446 6.227568 11.931988 6.112827  Q 12.356529 5.998086 12.368003 6.250516  Q 12.379478 6.502945 12.49422 6.709479  Q 12.654856 6.594736 12.861386 6.411153  Q 13.458042 5.883345 13.98585 4.483505  Q 13.412145 2.854184 13.664577 2.337848  Q 13.917006 1.821513 14.180909 2.11984  Q 14.444814 2.418167 15.225055 2.601753  Q 16.051193 2.257529 15.810239 1.500239  Q 15.569283 0.742948 16.223305 0.249562  Q 16.877329 -0.243825 17.405136 0.238088  Q 17.932943 0.72 17.841154 1.270757  Q 17.749361 1.821513 17.428082 2.578805  Q 16.71669 5.837448 16.418362 6.663583  Q 15.867609 8.201115 15.133261 8.889563  Q 14.031746 9.945179 12.035255 10.05992  Q 3.016613 10.128765 0.607052 9.968127  Q -0.287928 9.853385 0.308725 8.705975  Q -0.058446 8.109323 0.010398 7.352029  Q 0.033347 6.916011 0.285777 6.916011  Q 0.515259 6.893065 0.710319 7.237287  Q 0.905378 7.581511 1.547927 8.040477  Q 0.790637 7.374977 0.82506 6.984858  Q 0.859482 6.594736 1.295498 6.893065  Q 1.754461 7.21434 2.156055 7.535615  Q 2.557649 7.856893 2.970716 8.040477  Q 6.504738 7.994581 7.675099 7.925737  Q 7.65215 7.810996 7.514459 7.420873  Q 7.37677 7.030754 7.720995 6.847169  Q 8.019321 6.778324 8.237329 6.847169  Q 8.455338 6.916011 8.788086 6.835695  Q 9.120837 6.755374 9.166732 7.810996  Z "/></svg>
