<?xml version="1.0" encoding="UTF-8" standalone="no"?>
<!-- Created with Inkscape (http://www.inkscape.org/) -->

<svg
   xmlns:dc="http://purl.org/dc/elements/1.1/"
   xmlns:cc="http://creativecommons.org/ns#"
   xmlns:rdf="http://www.w3.org/1999/02/22-rdf-syntax-ns#"
   xmlns:svg="http://www.w3.org/2000/svg"
   xmlns="http://www.w3.org/2000/svg"
   version="1.1"
   width="24"
   height="40"
   id="svg3224">
  <metadata
     id="metadata3167">
    <rdf:RDF>
      <cc:Work
         rdf:about="">
        <dc:format>image/svg+xml</dc:format>
        <dc:type
           rdf:resource="http://purl.org/dc/dcmitype/StillImage" />
        <dc:title></dc:title>
      </cc:Work>
    </rdf:RDF>
  </metadata>
  <defs
     id="defs3226" />
  <g
     transform="translate(0,31.26)"
     id="layer1">
    <g
       id="text4426"
       style="font-size:40px;font-style:normal;font-weight:normal;line-height:125%;letter-spacing:0px;word-spacing:0px;fill:#000000;fill-opacity:1;stroke:none;font-family:Sans">
      <path
         d="M 4.16,-18.8 C 4.1599958,-19.99998 4.8799951,-21.279979 6.32,-22.64 7.7866589,-24.026643 9.5466571,-24.719975 11.6,-24.72 13.546653,-24.719975 15.253318,-24.026643 16.72,-22.64 18.213315,-21.253312 18.959981,-19.653314 18.96,-17.84 18.959981,-16.66665 18.613315,-15.586651 17.92,-14.6 17.253316,-13.61332 15.679984,-11.906655 13.2,-9.48 9.7866569,-6.1199939 7.0266596,-3.5466631 4.92,-1.76 L 4.92,-1.64 17.48,-1.64 17.48,-3.08 C 17.479983,-3.7999962 17.759982,-4.1599958 18.32,-4.16 18.853314,-4.1599958 19.119981,-3.7999962 19.12,-3.08 L 19.12,0 3.36,0 3.36,-2.4 12.8,-11.28 C 14.666652,-13.119987 15.879984,-14.453319 16.44,-15.28 17.02665,-16.106651 17.319983,-16.973316 17.32,-17.88 17.319983,-19.266647 16.74665,-20.47998 15.6,-21.52 14.453319,-22.559977 13.119987,-23.079977 11.6,-23.08 10.23999,-23.079977 8.999991,-22.679977 7.88,-21.88 6.7866599,-21.079979 6.0799939,-20.07998 5.76,-18.88 5.5999944,-18.346648 5.3199947,-18.079982 4.92,-18.08 4.7333286,-18.079982 4.5599954,-18.146649 4.4,-18.28 4.2399958,-18.439982 4.1599958,-18.613315 4.16,-18.8"
         id="path4365"
         style="font-variant:normal;font-stretch:normal;font-family:FreeMono;-inkscape-font-specification:FreeMono" />
    </g>
  </g>
</svg>
