<?xml version="1.0" encoding="UTF-8" standalone="no"?>
<!-- Created with Inkscape (http://www.inkscape.org/) -->

<svg
   xmlns:dc="http://purl.org/dc/elements/1.1/"
   xmlns:cc="http://creativecommons.org/ns#"
   xmlns:rdf="http://www.w3.org/1999/02/22-rdf-syntax-ns#"
   xmlns:svg="http://www.w3.org/2000/svg"
   xmlns="http://www.w3.org/2000/svg"
   version="1.1"
   width="24"
   height="40"
   id="svg3224">
  <metadata
     id="metadata3167">
    <rdf:RDF>
      <cc:Work
         rdf:about="">
        <dc:format>image/svg+xml</dc:format>
        <dc:type
           rdf:resource="http://purl.org/dc/dcmitype/StillImage" />
        <dc:title></dc:title>
      </cc:Work>
    </rdf:RDF>
  </metadata>
  <defs
     id="defs3226" />
  <g
     transform="translate(0,31.26)"
     id="layer1">
    <g
       id="text4426"
       style="font-size:40px;font-style:normal;font-weight:normal;line-height:125%;letter-spacing:0px;word-spacing:0px;fill:#000000;fill-opacity:1;stroke:none;font-family:Sans">
      <path
         d="M 20.88,-2.68 C 20.879979,-2.4933308 20.799979,-2.293331 20.64,-2.08 20.47998,-1.8666648 20.293313,-1.7599982 20.08,-1.76 19.946647,-1.7599982 19.773314,-1.8266648 19.56,-1.96 L 2.88,-11.24 19.6,-20.52 C 19.813314,-20.653313 19.973313,-20.719979 20.08,-20.72 20.266646,-20.719979 20.43998,-20.626646 20.6,-20.44 20.786646,-20.253313 20.879979,-20.053313 20.88,-19.84 20.879979,-19.546647 20.706646,-19.306647 20.36,-19.12 L 6.16,-11.24 20.36,-3.36 C 20.706646,-3.1733302 20.879979,-2.9466637 20.88,-2.68"
         id="path5135"
         style="font-variant:normal;font-stretch:normal;font-family:FreeMono;-inkscape-font-specification:FreeMono" />
    </g>
  </g>
</svg>
