<?xml version="1.0" encoding="UTF-8" standalone="no"?>
<!-- Created with Inkscape (http://www.inkscape.org/) -->

<svg
   xmlns:dc="http://purl.org/dc/elements/1.1/"
   xmlns:cc="http://creativecommons.org/ns#"
   xmlns:rdf="http://www.w3.org/1999/02/22-rdf-syntax-ns#"
   xmlns:svg="http://www.w3.org/2000/svg"
   xmlns="http://www.w3.org/2000/svg"
   version="1.1"
   width="24"
   height="40"
   id="svg3224">
  <metadata
     id="metadata3167">
    <rdf:RDF>
      <cc:Work
         rdf:about="">
        <dc:format>image/svg+xml</dc:format>
        <dc:type
           rdf:resource="http://purl.org/dc/dcmitype/StillImage" />
        <dc:title></dc:title>
      </cc:Work>
    </rdf:RDF>
  </metadata>
  <defs
     id="defs3226" />
  <g
     transform="translate(0,31.26)"
     id="layer1">
    <g
       id="text4426"
       style="font-size:40px;font-style:normal;font-weight:normal;line-height:125%;letter-spacing:0px;word-spacing:0px;fill:#000000;fill-opacity:1;stroke:none;font-family:Sans">
      <path
         d="M 11.8,-4.64 12.2,-4.64 C 12.97332,-4.6399954 13.626653,-4.3866623 14.16,-3.88 14.693319,-3.3999966 14.959985,-2.7866639 14.96,-2.04 14.959985,-1.293332 14.693319,-0.666666 14.16,-0.16 13.626653,0.34666632 12.97332,0.5999994 12.2,0.6 L 11.8,0.6 C 11.026656,0.5999994 10.373323,0.34666632 9.84,-0.16 9.3066574,-0.666666 9.039991,-1.293332 9.04,-2.04 9.039991,-2.7866639 9.3066574,-3.3999966 9.84,-3.88 10.373323,-4.3866623 11.026656,-4.6399954 11.8,-4.64 M 11.8,-16.68 12.2,-16.68 C 12.97332,-16.679983 13.626653,-16.42665 14.16,-15.92 14.693319,-15.413318 14.959985,-14.786652 14.96,-14.04 14.959985,-13.29332 14.693319,-12.666654 14.16,-12.16 13.626653,-11.653322 12.97332,-11.399989 12.2,-11.4 L 11.8,-11.4 C 11.026656,-11.399989 10.373323,-11.653322 9.84,-12.16 9.3066574,-12.666654 9.039991,-13.29332 9.04,-14.04 9.039991,-14.786652 9.3066574,-15.413318 9.84,-15.92 10.373323,-16.42665 11.026656,-16.679983 11.8,-16.68"
         id="path5047"
         style="font-variant:normal;font-stretch:normal;font-family:FreeMono;-inkscape-font-specification:FreeMono" />
    </g>
  </g>
</svg>
