<?xml version="1.0" encoding="UTF-8" standalone="no"?>
<!-- Created with Inkscape (http://www.inkscape.org/) -->

<svg
   xmlns:dc="http://purl.org/dc/elements/1.1/"
   xmlns:cc="http://creativecommons.org/ns#"
   xmlns:rdf="http://www.w3.org/1999/02/22-rdf-syntax-ns#"
   xmlns:svg="http://www.w3.org/2000/svg"
   xmlns="http://www.w3.org/2000/svg"
   version="1.1"
   width="24"
   height="40"
   id="svg3224">
  <metadata
     id="metadata8">
    <rdf:RDF>
      <cc:Work
         rdf:about="">
        <dc:format>image/svg+xml</dc:format>
        <dc:type
           rdf:resource="http://purl.org/dc/dcmitype/StillImage" />
        <dc:title></dc:title>
      </cc:Work>
    </rdf:RDF>
  </metadata>
  <defs
     id="defs3226" />
  <g
     transform="translate(0,31.26)"
     id="layer1">
    <g
       id="text4426"
       style="font-size:40px;font-style:normal;font-weight:normal;line-height:125%;letter-spacing:0px;word-spacing:0px;fill:#000000;fill-opacity:1;stroke:none;font-family:Sans">
      <path
         d="M 12.32,1.84 C 12.879987,1.8399982 13.346653,2.039998 13.72,2.44 14.119986,2.8399972 14.319986,3.3199967 14.32,3.88 14.319986,4.4133289 14.119986,4.8666618 13.72,5.24 13.319987,5.6399944 12.85332,5.8399942 12.32,5.84 11.786655,5.8399942 11.319989,5.6399944 10.92,5.24 10.519989,4.8399952 10.31999,4.373329 10.32,3.84 10.31999,3.3066634 10.519989,2.8399972 10.92,2.44 11.319989,2.039998 11.786655,1.8399982 12.32,1.84 M 6.6,-8.84 6.6,-1.64 9.6,-1.64 C 10.31999,-1.6399984 10.679989,-1.373332 10.68,-0.84 10.679989,-0.27999972 10.31999,0 9.6,0 L 2.8,0 C 2.0799979,0 1.7199983,-0.27999972 1.72,-0.84 1.7199983,-1.373332 2.0799979,-1.6399984 2.8,-1.64 L 4.96,-1.64 4.96,-20.88 2.8,-20.88 C 2.0799979,-20.879979 1.7199983,-21.159979 1.72,-21.72 1.7199983,-22.253311 2.0799979,-22.519977 2.8,-22.52 L 9.6,-22.52 C 10.31999,-22.519977 10.679989,-22.253311 10.68,-21.72 10.679989,-21.159979 10.31999,-20.879979 9.6,-20.88 L 6.6,-20.88 6.6,-10.92 17.8,-20.88 16,-20.88 C 15.253318,-20.879979 14.879985,-21.159979 14.88,-21.72 14.879985,-22.253311 15.253318,-22.519977 16,-22.52 L 20.72,-22.52 C 21.466645,-22.519977 21.839978,-22.253311 21.84,-21.72 21.839978,-21.159979 21.466645,-20.879979 20.72,-20.88 L 20.08,-20.88 11.2,-12.96 C 13.146654,-12.159988 14.653319,-11.026656 15.72,-9.56 16.78665,-8.1199919 18.066649,-5.4799945 19.56,-1.64 L 21.8,-1.64 C 22.519977,-1.6399984 22.879977,-1.373332 22.88,-0.84 22.879977,-0.27999972 22.519977,0 21.8,0 L 18.32,0 C 16.853316,-4.0533293 15.546651,-6.8666598 14.4,-8.44 13.25332,-10.03999 11.733322,-11.146656 9.84,-11.76 L 6.6,-8.84"
         id="path3161"
         style="font-variant:normal;font-stretch:normal;font-family:FreeMono;-inkscape-font-specification:FreeMono" />
    </g>
  </g>
</svg>
