<?xml version="1.0" encoding="UTF-8" standalone="no"?>
<!-- Created with Inkscape (http://www.inkscape.org/) -->

<svg
   xmlns:dc="http://purl.org/dc/elements/1.1/"
   xmlns:cc="http://creativecommons.org/ns#"
   xmlns:rdf="http://www.w3.org/1999/02/22-rdf-syntax-ns#"
   xmlns:svg="http://www.w3.org/2000/svg"
   xmlns="http://www.w3.org/2000/svg"
   version="1.1"
   width="24"
   height="40"
   id="svg3224">
  <metadata
     id="metadata3167">
    <rdf:RDF>
      <cc:Work
         rdf:about="">
        <dc:format>image/svg+xml</dc:format>
        <dc:type
           rdf:resource="http://purl.org/dc/dcmitype/StillImage" />
        <dc:title></dc:title>
      </cc:Work>
    </rdf:RDF>
  </metadata>
  <defs
     id="defs3226" />
  <g
     transform="translate(0,31.26)"
     id="layer1">
    <g
       id="text4426"
       style="font-size:40px;font-style:normal;font-weight:normal;line-height:125%;letter-spacing:0px;word-spacing:0px;fill:#000000;fill-opacity:1;stroke:none;font-family:Sans">
      <path
         d="M 12.84,-1.64 17.04,-1.64 C 17.759982,-1.6399984 18.119982,-1.373332 18.12,-0.84 18.119982,-0.27999972 17.759982,0 17.04,0 L 7,0 C 6.2799937,0 5.9199941,-0.27999972 5.92,-0.84 5.9199941,-1.373332 6.2799937,-1.6399984 7,-1.64 L 11.2,-1.64 11.2,-20.88 4.52,-20.88 4.52,-17.96 C 4.5199955,-17.239983 4.2399958,-16.879983 3.68,-16.88 3.1466635,-16.879983 2.8799971,-17.239983 2.88,-17.96 L 2.88,-22.52 21.12,-22.52 21.12,-17.96 C 21.119979,-17.239983 20.853312,-16.879983 20.32,-16.88 20.07998,-16.879983 19.87998,-16.973316 19.72,-17.16 19.55998,-17.373316 19.479981,-17.639982 19.48,-17.96 L 19.48,-20.88 12.84,-20.88 12.84,-1.64"
         id="path3592"
         style="font-variant:normal;font-stretch:normal;font-family:FreeMono;-inkscape-font-specification:FreeMono" />
    </g>
  </g>
</svg>
