<?xml version="1.0" encoding="UTF-8" standalone="no"?>
<!-- Created with Inkscape (http://www.inkscape.org/) -->

<svg
   xmlns:dc="http://purl.org/dc/elements/1.1/"
   xmlns:cc="http://creativecommons.org/ns#"
   xmlns:rdf="http://www.w3.org/1999/02/22-rdf-syntax-ns#"
   xmlns:svg="http://www.w3.org/2000/svg"
   xmlns="http://www.w3.org/2000/svg"
   version="1.1"
   width="24"
   height="40"
   id="svg3224">
  <metadata
     id="metadata8">
    <rdf:RDF>
      <cc:Work
         rdf:about="">
        <dc:format>image/svg+xml</dc:format>
        <dc:type
           rdf:resource="http://purl.org/dc/dcmitype/StillImage" />
        <dc:title></dc:title>
      </cc:Work>
    </rdf:RDF>
  </metadata>
  <defs
     id="defs3226" />
  <g
     transform="translate(0,31.26)"
     id="layer1">
    <g
       id="text4426"
       style="font-size:40px;font-style:normal;font-weight:normal;line-height:125%;letter-spacing:0px;word-spacing:0px;fill:#000000;fill-opacity:1;stroke:none;font-family:Sans">
      <path
         d="M 8.0078125,-3.0859375 16.992187,-3.0859375 12.539063,-9.1796875 8.0078125,-3.0859375 M 4.3164062,-3.828125 10.429688,-12.03125 5.7617187,-18.222656 C 5.4882758,-18.587221 5.2408802,-18.860658 5.0195312,-19.042969 4.6419224,-19.36847 4.1015584,-19.53123 3.3984375,-19.53125 3.1249969,-19.53123 2.8645805,-19.511699 2.6171875,-19.472656 L 1.484375,-19.335937 1.484375,-22.089844 C 1.8489565,-22.193988 2.207029,-22.272113 2.5585938,-22.324219 2.8971325,-22.37628 3.222653,-22.402321 3.5351563,-22.402344 5.2408802,-22.402321 6.5104102,-22.07029 7.34375,-21.40625 7.825513,-21.015604 8.3268146,-20.47524 8.8476563,-19.785156 L 12.695313,-14.667969 16.542969,-19.785156 C 17.063785,-20.47524 17.565087,-21.015604 18.046875,-21.40625 18.880189,-22.07029 20.149719,-22.402321 21.855469,-22.402344 22.167947,-22.402321 22.493467,-22.37628 22.832031,-22.324219 23.183571,-22.272113 23.541643,-22.193988 23.90625,-22.089844 L 23.90625,-19.335937 22.773437,-19.472656 C 22.526019,-19.511699 22.265603,-19.53123 21.992187,-19.53125 21.289041,-19.53123 20.748677,-19.36847 20.371094,-19.042969 20.149719,-18.860658 19.902324,-18.587221 19.628906,-18.222656 L 14.824219,-11.816406 20.703125,-3.828125 C 20.781229,-3.7239546 20.852844,-3.6393193 20.917969,-3.5742188 21.243468,-3.2486947 21.783832,-3.0859344 22.539062,-3.0859375 L 23.964844,-3.0859375 23.964844,0 1.0546875,0 1.0546875,-3.0859375 2.4804688,-3.0859375 C 3.2356738,-3.0859344 3.7760379,-3.2486947 4.1015625,-3.5742188 4.1666625,-3.6393193 4.238277,-3.7239546 4.3164062,-3.828125"
         id="path4402"
         style="font-variant:normal;font-stretch:normal;font-family:FreeMono;-inkscape-font-specification:FreeMono" />
    </g>
  </g>
</svg>
