<?xml version="1.0" encoding="UTF-8" standalone="no"?>
<!-- Created with Inkscape (http://www.inkscape.org/) -->

<svg
   xmlns:dc="http://purl.org/dc/elements/1.1/"
   xmlns:cc="http://creativecommons.org/ns#"
   xmlns:rdf="http://www.w3.org/1999/02/22-rdf-syntax-ns#"
   xmlns:svg="http://www.w3.org/2000/svg"
   xmlns="http://www.w3.org/2000/svg"
   version="1.1"
   width="24"
   height="40"
   id="svg3224">
  <metadata
     id="metadata3167">
    <rdf:RDF>
      <cc:Work
         rdf:about="">
        <dc:format>image/svg+xml</dc:format>
        <dc:type
           rdf:resource="http://purl.org/dc/dcmitype/StillImage" />
        <dc:title></dc:title>
      </cc:Work>
    </rdf:RDF>
  </metadata>
  <defs
     id="defs3226" />
  <g
     transform="translate(0,31.26)"
     id="layer1">
    <g
       id="text4426"
       style="font-size:40px;font-style:normal;font-weight:normal;line-height:125%;letter-spacing:0px;word-spacing:0px;fill:#000000;fill-opacity:1;stroke:none;font-family:Sans">
      <path
         d="M 5,-15.12 C 4.999995,-15.706651 5.9066608,-16.199984 7.72,-16.6 9.5333238,-17.02665 10.946656,-17.239983 11.96,-17.24 13.826653,-17.239983 15.359985,-16.773317 16.56,-15.84 17.786649,-14.906652 18.399982,-13.73332 18.4,-12.32 L 18.4,-1.64 20.56,-1.64 C 21.279979,-1.6399984 21.639978,-1.373332 21.64,-0.84 21.639978,-0.27999972 21.279979,0 20.56,0 L 16.76,0 16.76,-2.68 C 14.386652,-0.4666662 11.839988,0.63999936 9.12,0.64 7.2533261,0.63999936 5.7466609,0.17333316 4.6,-0.76 3.4533299,-1.7199983 2.8799971,-2.959997 2.88,-4.48 2.8799971,-6.2133271 3.6533297,-7.6133257 5.2,-8.68 6.7733266,-9.7733236 8.8133245,-10.31999 11.32,-10.32 12.89332,-10.31999 14.706652,-10.03999 16.76,-9.48 L 16.76,-12.32 C 16.759983,-13.306653 16.30665,-14.093319 15.4,-14.68 14.493319,-15.293318 13.306653,-15.599984 11.84,-15.6 10.613323,-15.599984 9.3466573,-15.386651 8.04,-14.96 6.7333266,-14.533319 5.9733274,-14.319986 5.76,-14.32 5.5466611,-14.319986 5.3599946,-14.399986 5.2,-14.56 5.0666616,-14.719985 4.999995,-14.906652 5,-15.12 M 16.76,-4.48 16.76,-8.08 C 15.159985,-8.4799915 13.45332,-8.6799913 11.64,-8.68 9.5333238,-8.6799913 7.8133255,-8.2799917 6.48,-7.48 5.1733282,-6.70666 4.5199955,-5.6933276 4.52,-4.44 4.5199955,-3.3999966 4.9333284,-2.5599974 5.76,-1.92 6.5866601,-1.3066654 7.6933256,-0.999999 9.08,-1 10.493323,-0.999999 11.786655,-1.2666654 12.96,-1.8 14.159986,-2.333331 15.426651,-3.2266634 16.76,-4.48"
         id="path3724"
         style="font-variant:normal;font-stretch:normal;font-family:FreeMono;-inkscape-font-specification:FreeMono" />
    </g>
  </g>
</svg>
