<?xml version="1.0" encoding="UTF-8" standalone="no"?>
<!-- Created with Inkscape (http://www.inkscape.org/) -->

<svg
   xmlns:dc="http://purl.org/dc/elements/1.1/"
   xmlns:cc="http://creativecommons.org/ns#"
   xmlns:rdf="http://www.w3.org/1999/02/22-rdf-syntax-ns#"
   xmlns:svg="http://www.w3.org/2000/svg"
   xmlns="http://www.w3.org/2000/svg"
   version="1.1"
   width="24"
   height="40"
   id="svg3224">
  <metadata
     id="metadata8">
    <rdf:RDF>
      <cc:Work
         rdf:about="">
        <dc:format>image/svg+xml</dc:format>
        <dc:type
           rdf:resource="http://purl.org/dc/dcmitype/StillImage" />
        <dc:title></dc:title>
      </cc:Work>
    </rdf:RDF>
  </metadata>
  <defs
     id="defs3226" />
  <g
     transform="translate(0,31.26)"
     id="layer1">
    <g
       id="text4426"
       style="font-size:40px;font-style:normal;font-weight:normal;line-height:125%;letter-spacing:0px;word-spacing:0px;fill:#000000;fill-opacity:1;stroke:none;font-family:Sans">
      <path
         d="M 12.24,-19.6 6.96,-23.96 C 6.6133267,-24.199976 6.4399936,-24.466642 6.44,-24.76 6.4399936,-24.973308 6.5199935,-25.159975 6.68,-25.32 6.8399932,-25.479975 7.0266596,-25.559974 7.24,-25.56 7.4266592,-25.559974 7.666659,-25.453308 7.96,-25.24 L 12.24,-21.72 16.52,-25.24 C 16.813317,-25.453308 17.053316,-25.559974 17.24,-25.56 17.426649,-25.559974 17.599982,-25.466641 17.76,-25.28 17.946649,-25.119975 18.039982,-24.946642 18.04,-24.76 18.039982,-24.493309 17.866649,-24.213309 17.52,-23.92 L 12.24,-19.6 M 18.08,-4.68 C 18.079982,-5.666661 17.626649,-6.4266602 16.72,-6.96 15.813318,-7.4933258 14.719985,-7.8533255 13.44,-8.04 12.159988,-8.2266584 10.879989,-8.4266582 9.6,-8.64 8.3199917,-8.8533245 7.2266594,-9.293324 6.32,-9.96 5.4133279,-10.626656 4.959995,-11.546655 4.96,-12.72 4.959995,-14.026653 5.5999944,-15.106652 6.88,-15.96 8.1866585,-16.813317 9.8266568,-17.239983 11.8,-17.24 14.066653,-17.239983 15.893317,-16.62665 17.28,-15.4 L 17.28,-15.56 C 17.279983,-16.30665 17.559982,-16.679983 18.12,-16.68 18.653315,-16.679983 18.919981,-16.30665 18.92,-15.56 L 18.92,-12.8 C 18.919981,-12.079988 18.653315,-11.719988 18.12,-11.72 17.639982,-11.719988 17.359983,-12.026655 17.28,-12.64 17.173316,-13.546653 16.639983,-14.266652 15.68,-14.8 14.719985,-15.333318 13.479987,-15.599984 11.96,-15.6 10.466656,-15.599984 9.2266574,-15.306651 8.24,-14.72 7.2533261,-14.159986 6.7599932,-13.45332 6.76,-12.6 6.7599932,-11.799988 7.1733262,-11.199989 8,-10.8 8.8266578,-10.39999 9.7733236,-10.146657 10.84,-10.04 11.933321,-9.95999 13.17332,-9.7733236 14.56,-9.48 15.946651,-9.1866575 17.053316,-8.7733246 17.88,-8.24 19.213314,-7.333326 19.87998,-6.1333272 19.88,-4.64 19.87998,-3.1199969 19.133314,-1.8533315 17.64,-0.84 16.173317,0.14666652 14.306652,0.63999936 12.04,0.64 9.4799905,0.63999936 7.3866593,-0.07999992 5.76,-1.52 L 5.76,-1.08 C 5.7599942,-0.35999964 5.4933278,0 4.96,0 4.3999956,0 4.1199959,-0.35999964 4.12,-1.08 L 4.12,-4.4 C 4.1199959,-5.1199949 4.3999956,-5.4799945 4.96,-5.48 5.4933278,-5.4799945 5.7599942,-5.1866615 5.76,-4.6 L 5.76,-4.32 C 5.7599942,-3.4133299 6.3599936,-2.626664 7.56,-1.96 8.7599912,-1.3199987 10.213323,-0.999999 11.92,-1 13.679986,-0.999999 15.146652,-1.3466653 16.32,-2.04 17.493316,-2.7333306 18.079982,-3.6133297 18.08,-4.68"
         id="path3118"
         style="font-variant:normal;font-stretch:normal;font-family:FreeMono;-inkscape-font-specification:FreeMono" />
    </g>
  </g>
</svg>
