<?xml version='1.0' encoding ='UTF-8' standalone='yes'?>
<svg width='16.678759' height='7.200583' xmlns='http://www.w3.org/2000/svg' xmlns:xlink='http://www.w3.org/1999/xlink' xmlns:inkscape='http://www.inkscape.org/namespaces/inkscape'>
<path style='fill:#000000; stroke:none' d=' M 8.332306 7.200583  L 12.618704 7.200583  Q 14.853856 7.25717 15.787527 6.351792  Q 16.692905 5.474707 16.678759 3.593218  L 16.678759 3.607365  Q 16.692905 1.725877 15.77338 0.848792  Q 14.853856 -0.056586 12.618704 0  L 4.060054 0  Q 1.824902 -0.056586 0.891231 0.848792  Q -0.014147 1.725877 0 3.607365  L 0 3.593218  Q -0.014147 5.474707 0.891231 6.351792  Q 1.824902 7.25717 4.060054 7.200583  L 8.332306 7.200583  Z  M 12.830902 0.608301  Q 15.165079 0.636594 15.674355 1.768316  Q 16.056311 2.461496 16.056311 3.593218  L 16.056311 3.607365  Q 16.056311 4.739087 15.674355 5.432267  Q 15.165079 6.56399 12.830902 6.592283  L 3.847856 6.592283  Q 1.499532 6.56399 1.004404 5.432267  Q 0.608301 4.739087 0.608301 3.607365  L 0.608301 3.593218  Q 0.608301 2.461496 1.004404 1.768316  Q 1.499532 0.636594 3.847856 0.608301  L 12.830902 0.608301  Z  M 6.88936 0.919524  Q 8.714262 0.919524 11.826498 1.867342  Q 13.071393 2.121979 14.273848 2.121979  L 14.273848 3.013211  L 13.835305 3.013211  Q 12.802609 3.013211 11.486981 3.324434  Q 9.25183 4.583476 6.88936 4.583476  Q 5.771784 4.583476 4.76738 4.357131  Q 3.762977 4.130786 1.980514 4.173226  Q 1.768316 4.173226 1.768316 3.579072  Q 1.768316 2.984918 2.022954 2.984918  Q 2.574668 2.900038 3.381021 2.256371  Q 4.187373 1.612704 4.781527 1.372213  Q 5.913249 0.919524 6.88936 0.919524  Z  M 5.531293 2.857599  Q 5.531293 3.918589 6.88936 3.918589  Q 8.219133 3.918589 8.247427 2.871745  Q 8.247427 2.093686 7.914983 1.824902  Q 7.58254 1.556118 6.88936 1.556118  Q 6.210326 1.556118 5.87081 1.824902  Q 5.531293 2.093686 5.531293 2.857599  Z  M 8.601089 1.725877  Q 8.898167 2.291738 8.898167 2.836379  Q 8.898167 3.381021 8.516211 3.904442  Q 10.468431 3.409313 11.614301 2.588815  L 11.614301 2.574668  Q 10.468431 1.994661 8.601089 1.725877  Z  M 2.871745 3.366874  L 2.871745 3.508339  L 5.347388 3.890296  Q 4.908845 3.451753 4.908845 2.857599  Q 4.908845 2.334177 5.17763 1.867342  Q 4.555182 1.994661 2.871745 3.366874  Z  M 14.330434 4.739087  Q 12.052843 4.739087 11.02722 5.227142  Q 10.001596 5.715198 8.714262 5.927396  Q 7.426928 6.139594 6.19618 6.075934  Q 4.965432 6.012275 4.328838 5.87081  Q 3.692244 5.729344 2.560522 5.715198  Q 1.824902 5.729344 1.839049 5.333241  Q 1.824902 4.866406 2.419056 4.866406  Q 3.692244 4.866406 4.477376 5.106897  Q 5.262509 5.347388 6.344718 5.403974  Q 7.426928 5.46056 8.693042 5.241289  Q 9.959157 5.022018 10.98478 4.498596  Q 12.010404 3.975175 14.330434 3.989321  L 14.330434 4.739087  L 14.330434 4.739087  Z '/></svg>
