<?xml version='1.0' encoding ='UTF-8' standalone='yes'?>
<svg width='15.981707' height='9.704423' xmlns='http://www.w3.org/2000/svg' xmlns:xlink='http://www.w3.org/1999/xlink' xmlns:inkscape='http://www.inkscape.org/namespaces/inkscape'>
<path style='fill:#000000; stroke:none' d=' M 1.184784 5.233846  Q 0.247861 4.393846 0.005553 2.439231  Q -0.042909 2.035385 0.32863 1.986923  Q 0.700168 1.938462 0.74863 2.358462  Q 0.990937 4.329231 1.814784 4.539231  L 1.184784 5.233846  Z  M 9.35863 2.681538  Q 9.794784 2.148462 9.924014 0.759231  Q 9.956322 0.355385 10.263246 0.379615  Q 10.570168 0.403846 10.521707 0.807692  Q 10.376322 2.374615 9.794784 3.133846  L 9.35863 2.681538  Z  M 10.715553 3.020769  Q 11.232476 2.665385 11.507092 1.033846  Q 11.571707 0.63 11.870553 0.678462  Q 12.169399 0.726923 12.104784 1.130769  Q 11.765553 3.182308 11.054784 3.666923  L 10.715553 3.020769  Z  M 12.040168 3.602308  Q 12.71863 3.408462 13.05786 1.453846  Q 13.122476 1.05 13.421322 1.098462  Q 13.720168 1.146923 13.655553 1.550769  Q 13.316322 3.489231 12.492476 4.313077  L 12.040168 3.602308  Z  M 7.694784 2.503846  Q 8.066322 1.922308 8.066322 0.533077  Q 8.066322 0.113077 8.373245 0.113077  Q 8.680168 0.113077 8.664015 0.533077  Q 8.664015 2.1 8.163245 2.907692  L 7.694784 2.503846  Z  M 6.273245 2.390769  Q 6.289399 1.809231 6.289399 0.403846  Q 6.289399 0 6.596322 0  Q 6.903245 0 6.887091 0.403846  Q 6.887091 1.970769 6.887091 2.649231  L 6.273245 2.390769  Z  M 5.15863 2.843077  Q 4.657861 2.035385 4.657861 0.468462  Q 4.641707 0.048462 4.94863 0.048462  Q 5.255553 0.048462 5.255553 0.468462  Q 5.255553 1.857692 5.643245 2.439231  L 5.15863 2.843077  Z  M 2.460938 4.313077  Q 1.685553 3.456923 1.410938 1.502308  Q 1.362476 1.098462 1.661322 1.058077  Q 1.960168 1.017692 2.024784 1.421538  Q 2.267091 3.408462 2.945553 3.618462  L 2.460938 4.313077  Z  M 3.930938 3.537692  Q 3.236322 3.036923 2.961707 0.969231  Q 2.897091 0.565385 3.195937 0.516923  Q 3.494784 0.468462 3.559399 0.872308  Q 3.785553 2.52 4.286322 2.891538  L 3.930938 3.537692  Z  M 6.596322 2.358462  Q 8.906322 2.358462 12.880168 3.683077  Q 14.447091 4.054615 15.981707 4.054615  L 15.981707 5.314615  L 15.416322 5.314615  Q 14.124015 5.314615 12.444015 5.750769  Q 9.584784 7.511539 6.580168 7.511539  Q 5.15863 7.511539 3.890553 7.196538  Q 2.622476 6.881538 0.344784 6.93  Q 0.070168 6.93 0.070168 6.106154  Q 0.070168 5.282308 0.393245 5.282308  Q 1.104014 5.153077 2.129784 4.240385  Q 3.155553 3.327692 3.89863 2.988461  Q 5.352476 2.358462 6.596322 2.358462  Z  M 4.867861 5.088461  Q 4.867861 6.574615 6.596322 6.590769  Q 8.276322 6.590769 8.30863 5.104615  Q 8.30863 4.006154 7.88863 3.626539  Q 7.46863 3.246923 6.596322 3.246923  Q 5.724014 3.246923 5.295938 3.626539  Q 4.867861 4.006154 4.867861 5.088461  Z  M 8.760938 3.473077  Q 9.14863 4.280769 9.14863 5.048077  Q 9.14863 5.815384 8.647861 6.558462  Q 11.135553 5.863846 12.605553 4.716923  L 12.605553 4.684616  Q 11.135553 3.860769 8.760938 3.473077  Z  M 1.475553 5.799231  L 1.475553 5.993077  L 4.625553 6.542308  Q 4.076322 5.912308 4.076322 5.088461  Q 4.076322 4.345385 4.415553 3.699231  Q 3.624014 3.860769 1.475553 5.799231  Z  M 15.965553 7.786154  Q 13.074015 7.786154 11.765553 8.480769  Q 10.457091 9.175385 8.825553 9.474231  Q 7.194015 9.773077 5.627091 9.684231  Q 4.060168 9.595385 3.244399 9.393461  Q 2.42863 9.191539 0.990937 9.175385  Q 0.054014 9.191539 0.054014 8.626154  Q 0.054014 7.98 0.813245 7.98  Q 2.42863 7.98 3.430168 8.311153  Q 4.431707 8.642307 5.81286 8.723077  Q 7.194015 8.803846 8.801322 8.496923  Q 10.408629 8.19 11.709015 7.455  Q 13.009399 6.72 15.965553 6.736154  L 15.965553 7.786154  L 15.965553 7.786154  Z '/></svg>
