<?xml version="1.0" encoding="UTF-8" standalone="no"?>
<!-- Created with Inkscape (http://www.inkscape.org/) -->

<svg
   xmlns:dc="http://purl.org/dc/elements/1.1/"
   xmlns:cc="http://creativecommons.org/ns#"
   xmlns:rdf="http://www.w3.org/1999/02/22-rdf-syntax-ns#"
   xmlns:svg="http://www.w3.org/2000/svg"
   xmlns="http://www.w3.org/2000/svg"
   version="1.1"
   width="24"
   height="40"
   id="svg3224">
  <metadata
     id="metadata3167">
    <rdf:RDF>
      <cc:Work
         rdf:about="">
        <dc:format>image/svg+xml</dc:format>
        <dc:type
           rdf:resource="http://purl.org/dc/dcmitype/StillImage" />
        <dc:title></dc:title>
      </cc:Work>
    </rdf:RDF>
  </metadata>
  <defs
     id="defs3226" />
  <g
     transform="translate(0,31.26)"
     id="layer1">
    <g
       id="text4426"
       style="font-size:40px;font-style:normal;font-weight:normal;line-height:125%;letter-spacing:0px;word-spacing:0px;fill:#000000;fill-opacity:1;stroke:none;font-family:Sans">
      <path
         d="M 13.04,-6.76 11.2,-6.76 4.84,-20.88 4.52,-20.88 4.52,-1.64 7.48,-1.64 C 8.2266584,-1.6399984 8.5999914,-1.373332 8.6,-0.84 8.5999914,-0.27999972 8.2266584,0 7.48,0 L 1.52,0 C 0.7999992,0 0.43999956,-0.27999972 0.44,-0.84 0.43999956,-1.373332 0.7999992,-1.6399984 1.52,-1.64 L 2.88,-1.64 2.88,-20.88 1.88,-20.88 C 1.1599988,-20.879979 0.7999992,-21.159979 0.8,-21.72 0.7999992,-22.253311 1.1599988,-22.519977 1.88,-22.52 L 5.84,-22.52 12.12,-8.6 18.28,-22.52 22.28,-22.52 C 22.999977,-22.519977 23.359977,-22.253311 23.36,-21.72 23.359977,-21.159979 22.999977,-20.879979 22.28,-20.88 L 21.28,-20.88 21.28,-1.64 22.64,-1.64 C 23.359977,-1.6399984 23.719976,-1.373332 23.72,-0.84 23.719976,-0.27999972 23.359977,0 22.64,0 L 16.68,0 C 15.959984,0 15.599984,-0.27999972 15.6,-0.84 15.599984,-1.373332 15.959984,-1.6399984 16.68,-1.64 L 19.64,-1.64 19.64,-20.88 19.32,-20.88 13.04,-6.76"
         id="path3438"
         style="font-variant:normal;font-stretch:normal;font-family:FreeMono;-inkscape-font-specification:FreeMono" />
    </g>
  </g>
</svg>
