<?xml version="1.0" encoding="UTF-8" standalone="no"?>
<!-- Created with Inkscape (http://www.inkscape.org/) -->

<svg
   xmlns:dc="http://purl.org/dc/elements/1.1/"
   xmlns:cc="http://creativecommons.org/ns#"
   xmlns:rdf="http://www.w3.org/1999/02/22-rdf-syntax-ns#"
   xmlns:svg="http://www.w3.org/2000/svg"
   xmlns="http://www.w3.org/2000/svg"
   version="1.1"
   width="24"
   height="40"
   id="svg3224">
  <metadata
     id="metadata3167">
    <rdf:RDF>
      <cc:Work
         rdf:about="">
        <dc:format>image/svg+xml</dc:format>
        <dc:type
           rdf:resource="http://purl.org/dc/dcmitype/StillImage" />
        <dc:title></dc:title>
      </cc:Work>
    </rdf:RDF>
  </metadata>
  <defs
     id="defs3226" />
  <g
     transform="translate(0,31.26)"
     id="layer1">
    <g
       id="text4426"
       style="font-size:40px;font-style:normal;font-weight:normal;line-height:125%;letter-spacing:0px;word-spacing:0px;fill:#000000;fill-opacity:1;stroke:none;font-family:Sans">
      <path
         d="M 6.32,-1.6 C 6.3999936,-1.5999984 6.6533267,-1.5066652 7.08,-1.32 7.5333258,-1.1333322 8.1333252,-1.039999 8.88,-1.04 10.39999,-1.039999 11.893321,-1.4799985 13.36,-2.36 14.826652,-3.2399968 16.053317,-4.4266622 17.04,-5.92 18.239982,-7.8133255 18.839981,-10.07999 18.84,-12.72 18.839981,-12.85332 18.813315,-13.426653 18.76,-14.44 17.133316,-11.186655 14.919985,-9.5599904 12.12,-9.56 10.306656,-9.5599904 8.7333246,-10.293323 7.4,-11.76 6.0933272,-13.226653 5.4399946,-14.973318 5.44,-17 5.4399946,-19.159981 6.1066606,-20.986646 7.44,-22.48 8.7733246,-23.973309 10.413323,-24.719975 12.36,-24.72 14.733319,-24.719975 16.66665,-23.61331 18.16,-21.4 19.653314,-19.186647 20.39998,-16.333317 20.4,-12.84 20.39998,-8.8666578 19.266647,-5.626661 17,-3.12 14.759985,-0.63999936 11.999988,0.5999994 8.72,0.6 7.8666588,0.5999994 7.1199929,0.45333288 6.48,0.16 5.8666608,-0.10666656 5.5599944,-0.42666624 5.56,-0.8 5.5599944,-1.0133323 5.626661,-1.1999988 5.76,-1.36 5.9199941,-1.5199985 6.1066606,-1.5999984 6.32,-1.6 M 18.52,-16.6 C 17.959982,-18.759981 17.186649,-20.373313 16.2,-21.44 15.213318,-22.533311 13.919986,-23.079977 12.32,-23.08 10.826656,-23.079977 9.5733238,-22.493311 8.56,-21.32 7.5733258,-20.146647 7.0799929,-18.706648 7.08,-17 7.0799929,-15.426651 7.5733258,-14.066653 8.56,-12.92 9.5733238,-11.773322 10.773323,-11.199989 12.16,-11.2 12.826654,-11.199989 13.479987,-11.359989 14.12,-11.68 14.786652,-11.999988 15.319985,-12.319988 15.72,-12.64 16.119984,-12.986654 16.54665,-13.479987 17,-14.12 17.479983,-14.786652 17.773316,-15.226651 17.88,-15.44 18.013315,-15.653318 18.226648,-16.039984 18.52,-16.6"
         id="path4519"
         style="font-variant:normal;font-stretch:normal;font-family:FreeMono;-inkscape-font-specification:FreeMono" />
    </g>
  </g>
</svg>
