<?xml version="1.0" encoding="UTF-8" standalone="no"?>
<!-- Created with Inkscape (http://www.inkscape.org/) -->

<svg
   xmlns:dc="http://purl.org/dc/elements/1.1/"
   xmlns:cc="http://creativecommons.org/ns#"
   xmlns:rdf="http://www.w3.org/1999/02/22-rdf-syntax-ns#"
   xmlns:svg="http://www.w3.org/2000/svg"
   xmlns="http://www.w3.org/2000/svg"
   version="1.1"
   width="24"
   height="40"
   id="svg3224">
  <metadata
     id="metadata3167">
    <rdf:RDF>
      <cc:Work
         rdf:about="">
        <dc:format>image/svg+xml</dc:format>
        <dc:type
           rdf:resource="http://purl.org/dc/dcmitype/StillImage" />
        <dc:title></dc:title>
      </cc:Work>
    </rdf:RDF>
  </metadata>
  <defs
     id="defs3226" />
  <g
     transform="translate(0,31.26)"
     id="layer1">
    <g
       id="text4426"
       style="font-size:40px;font-style:normal;font-weight:normal;line-height:125%;letter-spacing:0px;word-spacing:0px;fill:#000000;fill-opacity:1;stroke:none;font-family:Sans">
      <path
         d="M 6.6,-10.04 6.6,-1.64 9.6,-1.64 C 10.31999,-1.6399984 10.679989,-1.373332 10.68,-0.84 10.679989,-0.27999972 10.31999,0 9.6,0 L 2.8,0 C 2.0799979,0 1.7199983,-0.27999972 1.72,-0.84 1.7199983,-1.373332 2.0799979,-1.6399984 2.8,-1.64 L 4.96,-1.64 4.96,-20.88 2.8,-20.88 C 2.0799979,-20.879979 1.7199983,-21.159979 1.72,-21.72 1.7199983,-22.253311 2.0799979,-22.519977 2.8,-22.52 L 12.72,-22.52 C 14.666652,-22.519977 16.34665,-21.893311 17.76,-20.64 19.199981,-19.413314 19.91998,-17.959982 19.92,-16.28 19.91998,-13.69332 18.066649,-11.759988 14.36,-10.48 15.613318,-9.626657 16.66665,-8.6533247 17.52,-7.56 18.373315,-6.4666602 19.613314,-4.4933288 21.24,-1.64 L 22.48,-1.64 C 23.199977,-1.6399984 23.559976,-1.373332 23.56,-0.84 23.559976,-0.27999972 23.199977,0 22.48,0 L 20.2,0 C 18.439982,-3.2533301 16.98665,-5.5599944 15.84,-6.92 14.719985,-8.3066584 13.399987,-9.3466573 11.88,-10.04 L 6.6,-10.04 M 6.6,-11.68 11.16,-11.68 C 13.13332,-11.679988 14.813319,-12.133321 16.2,-13.04 17.586649,-13.946653 18.279982,-15.039985 18.28,-16.32 18.279982,-17.519982 17.706649,-18.573315 16.56,-19.48 15.439985,-20.413313 14.159986,-20.879979 12.72,-20.88 L 6.6,-20.88 6.6,-11.68"
         id="path3548"
         style="font-variant:normal;font-stretch:normal;font-family:FreeMono;-inkscape-font-specification:FreeMono" />
    </g>
  </g>
</svg>
