<?xml version="1.0" encoding="UTF-8" standalone="no"?>
<!-- Created with Inkscape (http://www.inkscape.org/) -->

<svg
   xmlns:dc="http://purl.org/dc/elements/1.1/"
   xmlns:cc="http://creativecommons.org/ns#"
   xmlns:rdf="http://www.w3.org/1999/02/22-rdf-syntax-ns#"
   xmlns:svg="http://www.w3.org/2000/svg"
   xmlns="http://www.w3.org/2000/svg"
   version="1.1"
   width="24"
   height="40"
   id="svg3224">
  <metadata
     id="metadata3167">
    <rdf:RDF>
      <cc:Work
         rdf:about="">
        <dc:format>image/svg+xml</dc:format>
        <dc:type
           rdf:resource="http://purl.org/dc/dcmitype/StillImage" />
        <dc:title></dc:title>
      </cc:Work>
    </rdf:RDF>
  </metadata>
  <defs
     id="defs3226" />
  <g
     transform="translate(0,31.26)"
     id="layer1">
    <g
       id="text4426"
       style="font-size:40px;font-style:normal;font-weight:normal;line-height:125%;letter-spacing:0px;word-spacing:0px;fill:#000000;fill-opacity:1;stroke:none;font-family:Sans">
      <path
         d="M 5.76,-24.16 5.76,-13.12 C 7.706659,-15.866651 10.106657,-17.239983 12.96,-17.24 15.386651,-17.239983 17.439983,-16.38665 19.12,-14.68 20.799979,-12.97332 21.639978,-10.879989 21.64,-8.4 21.639978,-5.8933274 20.786646,-3.7599962 19.08,-2 17.399983,-0.23999976 15.359985,0.63999936 12.96,0.64 10.026657,0.63999936 7.626659,-0.74666592 5.76,-3.52 L 5.76,0 1.96,0 C 1.2399988,0 0.87999912,-0.27999972 0.88,-0.84 0.87999912,-1.373332 1.2399988,-1.6399984 1.96,-1.64 L 4.12,-1.64 4.12,-22.52 1.96,-22.52 C 1.2399988,-22.519977 0.87999912,-22.799977 0.88,-23.36 0.87999912,-23.893309 1.2399988,-24.159976 1.96,-24.16 L 5.76,-24.16 M 12.88,-15.6 C 10.906656,-15.599984 9.2266574,-14.893318 7.84,-13.48 6.4533269,-12.066655 5.7599942,-10.346656 5.76,-8.32 5.7599942,-6.293327 6.4533269,-4.5599954 7.84,-3.12 9.2266574,-1.706665 10.906656,-0.999999 12.88,-1 14.826652,-0.999999 16.493317,-1.706665 17.88,-3.12 19.293314,-4.5333288 19.99998,-6.2266604 20,-8.2 19.99998,-10.27999 19.306647,-12.026655 17.92,-13.44 16.559983,-14.879985 14.879985,-15.599984 12.88,-15.6"
         id="path3746"
         style="font-variant:normal;font-stretch:normal;font-family:FreeMono;-inkscape-font-specification:FreeMono" />
    </g>
  </g>
</svg>
