<?xml version="1.0" encoding="UTF-8" standalone="no"?>
<!-- Created with Inkscape (http://www.inkscape.org/) -->

<svg
   xmlns:dc="http://purl.org/dc/elements/1.1/"
   xmlns:cc="http://creativecommons.org/ns#"
   xmlns:rdf="http://www.w3.org/1999/02/22-rdf-syntax-ns#"
   xmlns:svg="http://www.w3.org/2000/svg"
   xmlns="http://www.w3.org/2000/svg"
   version="1.1"
   width="24"
   height="40"
   id="svg3224">
  <metadata
     id="metadata3167">
    <rdf:RDF>
      <cc:Work
         rdf:about="">
        <dc:format>image/svg+xml</dc:format>
        <dc:type
           rdf:resource="http://purl.org/dc/dcmitype/StillImage" />
        <dc:title></dc:title>
      </cc:Work>
    </rdf:RDF>
  </metadata>
  <defs
     id="defs3226" />
  <g
     transform="translate(0,31.26)"
     id="layer1">
    <g
       id="text4426"
       style="font-size:40px;font-style:normal;font-weight:normal;line-height:125%;letter-spacing:0px;word-spacing:0px;fill:#000000;fill-opacity:1;stroke:none;font-family:Sans">
      <path
         d="M 17.6,-13.36 17.6,-16.68 21.4,-16.68 C 22.119978,-16.679983 22.479978,-16.413317 22.48,-15.88 22.479978,-15.319985 22.119978,-15.039985 21.4,-15.04 L 19.24,-15.04 19.24,1.12 C 19.239981,2.666664 18.666648,4.0533293 17.52,5.28 16.159984,6.7199933 14.533319,7.4399926 12.64,7.44 L 8.08,7.44 C 7.3599926,7.4399926 6.999993,7.1599928 7,6.6 6.999993,6.0666606 7.3599926,5.7999942 8.08,5.8 L 12.72,5.8 C 14.079986,5.7999942 15.226651,5.3199947 16.16,4.36 17.119983,3.3999966 17.599982,2.2399978 17.6,0.88 L 17.6,-4.28 C 15.839984,-1.6933316 13.559986,-0.3999996 10.76,-0.4 8.4933248,-0.3999996 6.5466601,-1.2266654 4.92,-2.88 3.3199967,-4.5333288 2.5199975,-6.5199935 2.52,-8.84 2.5199975,-11.159989 3.3199967,-13.13332 4.92,-14.76 6.5466601,-16.413317 8.4933248,-17.239983 10.76,-17.24 13.586653,-17.239983 15.866651,-15.946651 17.6,-13.36 M 10.88,-15.6 C 9.0133243,-15.599984 7.4266592,-14.946652 6.12,-13.64 4.8133285,-12.333321 4.1599958,-10.733323 4.16,-8.84 4.1599958,-6.9466597 4.8133285,-5.333328 6.12,-4 7.4266592,-2.6933306 9.0133243,-2.039998 10.88,-2.04 12.746654,-2.039998 14.333319,-2.6933306 15.64,-4 16.94665,-5.3066614 17.599982,-6.8933264 17.6,-8.76 17.599982,-10.706656 16.94665,-12.333321 15.64,-13.64 14.359986,-14.946652 12.773321,-15.599984 10.88,-15.6"
         id="path4054"
         style="font-variant:normal;font-stretch:normal;font-family:FreeMono;-inkscape-font-specification:FreeMono" />
    </g>
  </g>
</svg>
