<?xml version="1.0" encoding="UTF-8" standalone="no"?>
<svg
   xmlns:dc="http://purl.org/dc/elements/1.1/"
   xmlns:cc="http://web.resource.org/cc/"
   xmlns:rdf="http://www.w3.org/1999/02/22-rdf-syntax-ns#"
   xmlns:svg="http://www.w3.org/2000/svg"
   xmlns="http://www.w3.org/2000/svg"
   xmlns:sodipodi="http://inkscape.sourceforge.net/DTD/sodipodi-0.dtd"
   xmlns:inkscape="http://www.inkscape.org/namespaces/inkscape"
   width="14.588707"
   height="17.977417"
   id="svg1403"
   sodipodi:version="0.32"
   inkscape:version="0.43"
   sodipodi:docname="US22A42B.svg"
   sodipodi:docbase="C:\Program Files\JSesh\fonts\envoi21_SR">
  <metadata
     id="metadata1410">
    <rdf:RDF>
      <cc:Work
         rdf:about="">
        <dc:format>image/svg+xml</dc:format>
        <dc:type
           rdf:resource="http://purl.org/dc/dcmitype/StillImage" />
        <dc:title>US22A42B</dc:title>
        <dc:date>5/02/2006</dc:date>
        <dc:creator>
          <cc:Agent>
            <dc:title>Serge Thomas</dc:title>
          </cc:Agent>
        </dc:creator>
        <dc:publisher>
          <cc:Agent>
            <dc:title>Serge Rosmorduc</dc:title>
          </cc:Agent>
        </dc:publisher>
        <dc:description>à partir du signe A42 variante graphique avec flagellum </dc:description>
        <cc:license
           rdf:resource="http://creativecommons.org/licenses/GPL/2.0/" />
      </cc:Work>
      <cc:License
         rdf:about="http://creativecommons.org/licenses/GPL/2.0/">
        <cc:permits
           rdf:resource="http://web.resource.org/cc/Reproduction" />
        <cc:permits
           rdf:resource="http://web.resource.org/cc/Distribution" />
        <cc:requires
           rdf:resource="http://web.resource.org/cc/Notice" />
        <cc:permits
           rdf:resource="http://web.resource.org/cc/DerivativeWorks" />
        <cc:requires
           rdf:resource="http://web.resource.org/cc/ShareAlike" />
        <cc:requires
           rdf:resource="http://web.resource.org/cc/SourceCode" />
      </cc:License>
    </rdf:RDF>
  </metadata>
  <defs
     id="defs1408" />
  <sodipodi:namedview
     inkscape:window-height="542"
     inkscape:window-width="811"
     inkscape:pageshadow="2"
     inkscape:pageopacity="0.0"
     borderopacity="1.0"
     bordercolor="#666666"
     pagecolor="#ffffff"
     id="base"
     inkscape:zoom="20.748253"
     inkscape:cx="7.2943535"
     inkscape:cy="8.9887085"
     inkscape:window-x="75"
     inkscape:window-y="59"
     inkscape:current-layer="svg1403" />
  <path
     style="fill:#000000; stroke:none"
     d=" M 13.214234 6.258224  Q 13.575937 7.656811 13.624165 9.055398  L 14.106436 8.958943  Q 13.913527 7.512129 13.214234 6.258224  Z  M 9.548972 1.869555  Q 10.537628 2.110691 11.140468 2.448281  Q 11.526284 2.158918 11.900044 2.219202  Q 12.273805 2.279485 12.406429 2.617075  Q 12.539054 2.954665 12.418487 3.364596  Q 12.297918 3.774527 11.815647 4.208571  Q 11.815647 4.763183 12.334089 5.149  Q 12.85253 5.534817 13.395086 4.485877  Q 13.937641 3.436937 13.515654 2.508564  Q 13.093666 1.580192 12.213521 1.266716  Q 11.333376 0.953239 10.537628 1.097921  Q 9.74188 1.242602 9.548972 1.869555  Z  M 11.188695 4.06389  Q 11.839761 3.533391 11.936215 3.219915  Q 12.032669 2.906438 11.839761 2.7497  Q 11.646852 2.592962 11.333376 2.882325  L 11.140468 2.930552  Q 10.151812 2.424167 9.211382 2.255372  Q 8.946133 2.954665 8.391521 3.846867  Q 8.873793 3.846867 8.777338 4.208571  Q 8.922019 4.088003 9.271667 4.353252  Q 9.621313 4.618502 8.801452 4.570274  Q 8.922019 4.714956 8.873793 4.931978  Q 8.825565 5.149 9.259609 5.076659  Q 9.645427 5.028432 10.260323 4.714956  Q 10.875218 4.401479 10.995786 3.38871  L 11.116354 3.38871  Q 11.044013 4.522047 10.224152 4.956091  Q 10.778764 5.462476 10.851105 6.354678  Q 11.960329 6.788723 12.394373 5.800066  Q 11.405717 5.341908 11.188695 4.06389  Z  M 10.75465 6.861063  Q 10.175925 9.007171 9.717767 14.55329  L 9.283723 14.55329  L 5.931937 10.068168  Q 5.425552 9.175965 4.955338 9.34476  Q 4.485123 9.513556 5.268814 11.346187  Q 6.052505 13.178818 6.944707 16.675285  L 4.653918 17.446918  L 4.653918 17.495146  L 13.11778 17.495146  L 12.514941 17.012875  Q 13.214234 14.625631 13.214234 11.03271  Q 13.214234 7.439789 12.683736 6.306451  Q 12.008555 7.367448 10.75465 6.861063  Z  M 8.873793 3.38871  L 8.873793 3.268142  L 9.090815 3.12346  Q 9.356064 2.641189 10.368834 3.147574  L 10.923446 3.171687  L 10.899332 3.364596  L 10.392947 3.292255  Q 9.500745 3.678072 9.066701 3.412823  L 8.873793 3.38871  Z  M 9.163155 3.268142  Q 9.283723 3.316369 9.452518 3.364596  Q 9.33195 3.219915 9.428404 3.05112  Q 9.211382 3.147574 9.163155 3.268142  Z  M 9.765994 3.340482  Q 9.983016 3.316369 10.200038 3.219915  L 9.790108 3.05112  Q 9.93479 3.219915 9.765994 3.340482  Z  M 9.042587 2.858211  Q 9.042587 2.737643 9.271667 2.605019  Q 9.500745 2.472394 9.862449 2.580905  Q 10.224152 2.689416 10.75465 2.882325  L 10.899332 3.002892  Q 10.320606 2.954665 9.97096 2.809984  Q 9.621313 2.665303 9.042587 2.858211  Z  M 4.943281 8.621353  Q 3.496467 8.886602 4.051079 9.103624  Q 4.485123 9.27242 4.943281 8.621353  Z  M 2.869514 4.305025  Q 0.626953 10.69512 0.602839 10.69512  L 1.519155 10.960369  L 2.869514 4.305025  Z  M 9.283723 13.757543  Q 9.66954 8.886602 10.392947 6.402905  Q 10.272379 5.583044 9.765994 5.197227  L 9.356064 5.317795  Q 8.487975 7.897946 7.764568 8.235537  Q 7.041161 8.573126 6.703571 8.392275  Q 6.365982 8.211423 6.450379 8.030571  Q 6.534776 7.849719 6.93265 7.994401  Q 7.330524 8.139082 7.812795 7.475959  Q 8.295067 6.812836 8.58443 5.100773  Q 8.632657 4.739069 8.487975 4.642615  Q 8.343294 4.546161 8.536202 4.425593  Q 8.31918 4.377366 8.487975 4.13623  Q 7.764568 4.160344 8.234783 3.485164  Q 8.704997 2.809984 8.897906 2.014236  Q 8.536202 1.845441 8.463861 1.266716  Q 8.391521 0.68799 8.644713 0.543309  Q 8.897906 0.398627 8.668827 0.422741  Q 8.439748 0.446855 8.391521 0.338343  Q 8.343294 0.229832 8.487975 0.145435  Q 8.632657 0.061037 8.813508 0.01281  Q 8.99436 -0.035417 9.151098 0.097208  Q 9.307837 0.229832 9.259609 0.422741  Q 9.428404 0.784444 9.151098 1.049694  Q 8.873793 1.314943 9.090815 1.652533  Q 9.645427 0.639763 10.646139 0.591536  Q 11.646852 0.543309 12.575225 0.892955  Q 13.503597 1.242602 14.009982 2.460337  Q 14.516367 3.678072 13.334802 5.510704  Q 14.588707 7.463902 14.588707 9.465328  L 13.720619 9.585896  Q 13.720619 14.770312 13.093666 16.795853  L 14.154663 17.977417  L 4.243988 17.977417  L 4.12342 17.109329  L 6.365982 16.337694  Q 5.666688 13.516407 4.822713 11.514981  Q 3.978738 9.513556 3.508524 9.260363  Q 3.038309 9.007171 3.424126 8.717808  Q 3.809943 8.428445 4.46101 8.211423  L 3.231218 4.956091  L 1.856745 11.611436  L 0 10.960369  L 2.700719 3.195801  Q 3.062423 2.809984 3.255332 3.268142  L 5.063849 8.139082  Q 5.618461 8.404331 5.811369 9.103624  L 9.283723 13.757543  Z "
     id="path1405" />
</svg>
