<?xml version="1.0" encoding="UTF-8" standalone="no"?>
<!-- Created with Inkscape (http://www.inkscape.org/) -->

<svg
   xmlns:dc="http://purl.org/dc/elements/1.1/"
   xmlns:cc="http://creativecommons.org/ns#"
   xmlns:rdf="http://www.w3.org/1999/02/22-rdf-syntax-ns#"
   xmlns:svg="http://www.w3.org/2000/svg"
   xmlns="http://www.w3.org/2000/svg"
   version="1.1"
   width="24"
   height="40"
   id="svg3224">
  <metadata
     id="metadata8">
    <rdf:RDF>
      <cc:Work
         rdf:about="">
        <dc:format>image/svg+xml</dc:format>
        <dc:type
           rdf:resource="http://purl.org/dc/dcmitype/StillImage" />
        <dc:title></dc:title>
      </cc:Work>
    </rdf:RDF>
  </metadata>
  <defs
     id="defs3226" />
  <g
     transform="translate(0,31.26)"
     id="layer1">
    <g
       id="text4426"
       style="font-size:40px;font-style:normal;font-weight:normal;line-height:125%;letter-spacing:0px;word-spacing:0px;fill:#000000;fill-opacity:1;stroke:none;font-family:Sans">
      <path
         d="M 7.12,0.96 C 7.5733258,0.95999904 7.8399922,1.2533321 7.92,1.84 7.9733254,2.6133307 8.3999916,3.2533301 9.2,3.76 9.99999,4.2666624 10.959989,4.5199955 12.08,4.52 13.199987,4.5199955 14.146653,4.2666624 14.92,3.76 15.719984,3.2533301 16.159984,2.6133307 16.24,1.84 16.319984,1.2533321 16.599983,0.95999904 17.08,0.96 17.293316,0.95999904 17.479983,1.039999 17.64,1.2 17.799982,1.3866653 17.879982,1.6133317 17.88,1.88 17.879982,3.0799969 17.319983,4.0933292 16.2,4.92 15.079985,5.7466609 13.706653,6.1599938 12.08,6.16 10.453323,6.1599938 9.0799909,5.7466609 7.96,4.92 6.8399932,4.0933292 6.2799937,3.0799969 6.28,1.88 6.2799937,1.2666654 6.5599934,0.95999904 7.12,0.96 M 17.48,-10.88 6.68,-10.88 6.68,-1.64 8.84,-1.64 C 9.5599904,-1.6399984 9.9199901,-1.373332 9.92,-0.84 9.9199901,-0.27999972 9.5599904,0 8.84,0 L 3.24,0 C 2.4933308,0 2.1199979,-0.27999972 2.12,-0.84 2.1199979,-1.373332 2.4933308,-1.6399984 3.24,-1.64 L 5.04,-1.64 5.04,-20.88 4.04,-20.88 C 3.3199967,-20.879979 2.959997,-21.159979 2.96,-21.72 2.959997,-22.253311 3.3199967,-22.519977 4.04,-22.52 L 8.84,-22.52 C 9.5599904,-22.519977 9.9199901,-22.253311 9.92,-21.72 9.9199901,-21.159979 9.5599904,-20.879979 8.84,-20.88 L 6.68,-20.88 6.68,-12.52 17.48,-12.52 17.48,-20.88 15.32,-20.88 C 14.599985,-20.879979 14.239986,-21.159979 14.24,-21.72 14.239986,-22.253311 14.599985,-22.519977 15.32,-22.52 L 20.12,-22.52 C 20.839979,-22.519977 21.199979,-22.253311 21.2,-21.72 21.199979,-21.159979 20.839979,-20.879979 20.12,-20.88 L 19.12,-20.88 19.12,-1.64 20.96,-1.64 C 21.679978,-1.6399984 22.039978,-1.373332 22.04,-0.84 22.039978,-0.27999972 21.679978,0 20.96,0 L 15.32,0 C 14.599985,0 14.239986,-0.27999972 14.24,-0.84 14.239986,-1.373332 14.599985,-1.6399984 15.32,-1.64 L 17.48,-1.64 17.48,-10.88"
         id="path3052"
         style="font-variant:normal;font-stretch:normal;font-family:FreeMono;-inkscape-font-specification:FreeMono" />
    </g>
  </g>
</svg>
