<?xml version="1.0" encoding="UTF-8" standalone="no"?>
<!-- Created with Inkscape (http://www.inkscape.org/) -->

<svg
   xmlns:dc="http://purl.org/dc/elements/1.1/"
   xmlns:cc="http://creativecommons.org/ns#"
   xmlns:rdf="http://www.w3.org/1999/02/22-rdf-syntax-ns#"
   xmlns:svg="http://www.w3.org/2000/svg"
   xmlns="http://www.w3.org/2000/svg"
   version="1.1"
   width="24"
   height="40"
   id="svg3224">
  <metadata
     id="metadata3167">
    <rdf:RDF>
      <cc:Work
         rdf:about="">
        <dc:format>image/svg+xml</dc:format>
        <dc:type
           rdf:resource="http://purl.org/dc/dcmitype/StillImage" />
        <dc:title></dc:title>
      </cc:Work>
    </rdf:RDF>
  </metadata>
  <defs
     id="defs3226" />
  <g
     transform="translate(0,31.26)"
     id="layer1">
    <g
       id="text4426"
       style="font-size:40px;font-style:normal;font-weight:normal;line-height:125%;letter-spacing:0px;word-spacing:0px;fill:#000000;fill-opacity:1;stroke:none;font-family:Sans">
      <path
         d="M 17.48,-21.8 17.48,-22.52 5.84,-22.52 5.84,-21.12 C 5.8399942,-20.373313 5.5733278,-19.99998 5.04,-20 4.4799955,-19.99998 4.1999958,-20.373313 4.2,-21.12 L 4.2,-24.16 19.12,-24.16 19.12,-21.56 12.6,-0.8 C 12.413321,-0.23999976 12.146655,0.03999996 11.8,0.04 11.586655,0.03999996 11.399989,-0.03999996 11.24,-0.2 11.079989,-0.35999964 10.999989,-0.54666612 11,-0.76 10.999989,-0.89333244 11.026656,-1.0666656 11.08,-1.28 L 17.48,-21.8"
         id="path4475"
         style="font-variant:normal;font-stretch:normal;font-family:FreeMono;-inkscape-font-specification:FreeMono" />
    </g>
  </g>
</svg>
