<?xml version="1.0" encoding="UTF-8" standalone="no"?>
<!-- Created with Inkscape (http://www.inkscape.org/) -->

<svg
   xmlns:dc="http://purl.org/dc/elements/1.1/"
   xmlns:cc="http://creativecommons.org/ns#"
   xmlns:rdf="http://www.w3.org/1999/02/22-rdf-syntax-ns#"
   xmlns:svg="http://www.w3.org/2000/svg"
   xmlns="http://www.w3.org/2000/svg"
   version="1.1"
   width="24"
   height="40"
   id="svg3224">
  <metadata
     id="metadata8">
    <rdf:RDF>
      <cc:Work
         rdf:about="">
        <dc:format>image/svg+xml</dc:format>
        <dc:type
           rdf:resource="http://purl.org/dc/dcmitype/StillImage" />
        <dc:title></dc:title>
      </cc:Work>
    </rdf:RDF>
  </metadata>
  <defs
     id="defs3226" />
  <g
     transform="translate(0,31.26)"
     id="layer1">
    <g
       id="text4426"
       style="font-size:40px;font-style:normal;font-weight:normal;line-height:125%;letter-spacing:0px;word-spacing:0px;fill:#000000;fill-opacity:1;stroke:none;font-family:Sans">
      <path
         d="M 12.96,-16.64 C 13.359987,-17.333316 13.666653,-17.773316 13.88,-17.96 14.093319,-18.173315 14.359986,-18.279982 14.68,-18.28 15.106652,-18.279982 15.426651,-18.173315 15.64,-17.96 15.853317,-17.746649 15.959984,-17.466649 15.96,-17.12 15.959984,-16.453317 15.786651,-15.986651 15.44,-15.72 15.093318,-15.479985 14.679985,-15.293318 14.2,-15.16 13.719986,-15.053318 13.399987,-14.853318 13.24,-14.56 L 10.76,-10.08 17.68,0 C 17.919982,0.34666632 18.226648,0.58666608 18.6,0.72 18.973314,0.87999912 19.253314,1.039999 19.44,1.2 19.653314,1.3599986 19.75998,1.6533317 19.76,2.08 19.75998,2.5066642 19.493314,2.7733306 18.96,2.88 18.426648,2.9866637 17.613316,3.039997 16.52,3.04 15.906651,3.039997 15.319985,2.6399974 14.76,1.84 L 8.44,-7.48 4.8,-1.32 C 4.3999956,-0.62666604 4.0933292,-0.18666648 3.88,0 3.666663,0.18666648 3.3999966,0.27999972 3.08,0.28 2.6799973,0.27999972 2.373331,0.17333316 2.16,-0.04 1.9466647,-0.25333308 1.8399982,-0.5333328 1.84,-0.88 1.8399982,-1.5199985 1.999998,-1.959998 2.32,-2.2 2.666664,-2.4666642 3.0799969,-2.6533307 3.56,-2.76 4.039996,-2.8933304 4.3599956,-3.1066636 4.52,-3.4 L 7.48,-8.6 3.68,-14.08 C 3.4399966,-14.426652 3.0666636,-14.706652 2.56,-14.92 2.0799979,-15.133318 1.6799983,-15.373318 1.36,-15.64 1.039999,-15.933317 0.87999912,-16.38665 0.88,-17 0.87999912,-17.906649 1.9466647,-18.359982 4.08,-18.36 4.5599954,-18.359982 5.0933282,-17.933315 5.68,-17.08 L 9.8,-11.16 12.96,-16.64"
         id="path3999"
         style="font-variant:normal;font-stretch:normal;font-family:FreeMono;-inkscape-font-specification:FreeMono" />
    </g>
  </g>
</svg>
