<?xml version="1.0" encoding="UTF-8" standalone="no"?>
<!-- Created with Inkscape (http://www.inkscape.org/) -->

<svg
   xmlns:dc="http://purl.org/dc/elements/1.1/"
   xmlns:cc="http://creativecommons.org/ns#"
   xmlns:rdf="http://www.w3.org/1999/02/22-rdf-syntax-ns#"
   xmlns:svg="http://www.w3.org/2000/svg"
   xmlns="http://www.w3.org/2000/svg"
   version="1.1"
   width="24"
   height="40"
   id="svg3224">
  <metadata
     id="metadata3167">
    <rdf:RDF>
      <cc:Work
         rdf:about="">
        <dc:format>image/svg+xml</dc:format>
        <dc:type
           rdf:resource="http://purl.org/dc/dcmitype/StillImage" />
        <dc:title></dc:title>
      </cc:Work>
    </rdf:RDF>
  </metadata>
  <defs
     id="defs3226" />
  <g
     transform="translate(0,31.26)"
     id="layer1">
    <g
       id="text4426"
       style="font-size:40px;font-style:normal;font-weight:normal;line-height:125%;letter-spacing:0px;word-spacing:0px;fill:#000000;fill-opacity:1;stroke:none;font-family:Sans">
      <path
         d="M 12,-17.24 C 14.559985,-17.239983 16.719983,-16.359984 18.48,-14.6 20.23998,-12.866654 21.119979,-10.733323 21.12,-8.2 21.119979,-5.7466609 20.226646,-3.6533297 18.44,-1.92 16.653317,-0.21333312 14.506652,0.63999936 12,0.64 9.4666572,0.63999936 7.3066594,-0.22666644 5.52,-1.96 3.7599962,-3.6933296 2.8799971,-5.8133275 2.88,-8.32 2.8799971,-10.773323 3.7599962,-12.866654 5.52,-14.6 7.3066594,-16.359984 9.4666572,-17.239983 12,-17.24 M 12,-15.6 C 9.9199901,-15.599984 8.1466585,-14.893318 6.68,-13.48 5.2399948,-12.066655 4.5199955,-10.346656 4.52,-8.32 4.5199955,-6.293327 5.2399948,-4.5599954 6.68,-3.12 8.1466585,-1.706665 9.9199901,-0.999999 12,-1 14.053319,-0.999999 15.813318,-1.706665 17.28,-3.12 18.746648,-4.5333288 19.479981,-6.2266604 19.48,-8.2 19.479981,-10.306656 18.759981,-12.066655 17.32,-13.48 15.879984,-14.893318 14.106653,-15.599984 12,-15.6"
         id="path3944"
         style="font-variant:normal;font-stretch:normal;font-family:FreeMono;-inkscape-font-specification:FreeMono" />
    </g>
  </g>
</svg>
