<?xml version="1.0" encoding="UTF-8" standalone="no"?>
<!-- Created with Inkscape (http://www.inkscape.org/) -->

<svg
   xmlns:dc="http://purl.org/dc/elements/1.1/"
   xmlns:cc="http://creativecommons.org/ns#"
   xmlns:rdf="http://www.w3.org/1999/02/22-rdf-syntax-ns#"
   xmlns:svg="http://www.w3.org/2000/svg"
   xmlns="http://www.w3.org/2000/svg"
   version="1.1"
   width="24"
   height="40"
   id="svg3224">
  <metadata
     id="metadata8">
    <rdf:RDF>
      <cc:Work
         rdf:about="">
        <dc:format>image/svg+xml</dc:format>
        <dc:type
           rdf:resource="http://purl.org/dc/dcmitype/StillImage" />
        <dc:title></dc:title>
      </cc:Work>
    </rdf:RDF>
  </metadata>
  <defs
     id="defs3226" />
  <g
     transform="translate(0,31.26)"
     id="layer1">
    <g
       id="text4426"
       style="font-size:40px;font-style:normal;font-weight:normal;line-height:125%;letter-spacing:0px;word-spacing:0px;fill:#000000;fill-opacity:1;stroke:none;font-family:Sans">
      <path
         d="M 9.36,-5.36 C 9.1466575,-5.2266614 8.9066578,-5.1599948 8.64,-5.16 8.373325,-5.1599948 8.1733252,-5.2533281 8.04,-5.44 7.9333254,-5.626661 7.8799921,-5.7999942 7.88,-5.96 7.8799921,-6.2799937 8.0533253,-6.5333268 8.4,-6.72 L 15.84,-10.8 C 16.693317,-11.279989 17.119983,-11.879988 17.12,-12.6 17.119983,-13.45332 16.62665,-14.159986 15.64,-14.72 14.653319,-15.306651 13.41332,-15.599984 11.92,-15.6 10.39999,-15.599984 9.1599908,-15.333318 8.2,-14.8 7.2399928,-14.266652 6.70666,-13.546653 6.6,-12.64 6.5199935,-12.026655 6.2399938,-11.719988 5.76,-11.72 5.2266614,-11.719988 4.959995,-12.079988 4.96,-12.8 L 4.96,-15.56 C 4.959995,-16.30665 5.2266614,-16.679983 5.76,-16.68 6.3199937,-16.679983 6.5999934,-16.30665 6.6,-15.56 L 6.6,-15.4 C 7.9866587,-16.62665 9.8133235,-17.239983 12.08,-17.24 14.053319,-17.239983 15.679984,-16.813317 16.96,-15.96 18.266648,-15.106652 18.919981,-14.026653 18.92,-12.72 18.919981,-12.106655 18.746648,-11.493322 18.4,-10.88 18.053315,-10.293323 17.613316,-9.8533235 17.08,-9.56 L 16.68,-9.32 C 18.733315,-8.4399916 19.75998,-7.0133263 19.76,-5.04 19.75998,-4.293329 19.63998,-3.626663 19.4,-3.04 19.186647,-2.4799975 18.813315,-1.9466647 18.28,-1.44 17.746649,-0.95999904 17.266649,-0.58666608 16.84,-0.32 16.439984,-0.05333328 15.813318,0.333333 14.96,0.84 14.746652,0.97333236 14.586652,1.0666656 14.48,1.12 L 8.56,4.56 C 8.4799915,4.6133287 8.3599916,4.6399954 8.2,4.64 7.6399924,4.6399954 7.3599926,4.3866623 7.36,3.88 7.3599926,3.5333298 7.4933258,3.2799967 7.76,3.12 L 13.68,-0.32 C 14.666652,-0.90666576 15.333318,-1.3066654 15.68,-1.52 16.026651,-1.7333316 16.453317,-2.039998 16.96,-2.44 17.466649,-2.8666638 17.786649,-3.2666634 17.92,-3.64 18.079982,-4.039996 18.159982,-4.5066622 18.16,-5.04 18.159982,-5.9733274 17.946649,-6.6133267 17.52,-6.96 17.093316,-7.333326 16.173317,-7.7733256 14.76,-8.28 L 9.36,-5.36"
         id="path3008"
         style="font-variant:normal;font-stretch:normal;font-family:FreeMono;-inkscape-font-specification:FreeMono" />
    </g>
  </g>
</svg>
