<?xml version='1.0' encoding ='UTF-8' standalone='yes'?>
<svg width='19.045385' height='8.222308' xmlns='http://www.w3.org/2000/svg' xmlns:xlink='http://www.w3.org/1999/xlink' xmlns:inkscape='http://www.inkscape.org/namespaces/inkscape'>
<path style='fill:#000000; stroke:none' d=' M 9.514615 8.222308  L 14.409231 8.222308  Q 16.961538 8.286923 18.027693 7.253077  Q 19.061539 6.251538 19.045385 4.103077  L 19.045385 4.119231  Q 19.061539 1.970769 18.011538 0.969231  Q 16.961538 -0.064615 14.409231 0  L 4.636154 0  Q 2.083846 -0.064615 1.017692 0.969231  Q -0.016154 1.970769 0 4.119231  L 0 4.103077  Q -0.016154 6.251538 1.017692 7.253077  Q 2.083846 8.286923 4.636154 8.222308  L 9.514615 8.222308  Z  M 14.651539 0.694615  Q 17.316923 0.726923 17.898462 2.019231  Q 18.334616 2.810769 18.334616 4.103077  L 18.334616 4.119231  Q 18.334616 5.411539 17.898462 6.203077  Q 17.316923 7.495385 14.651539 7.527692  L 4.393846 7.527692  Q 1.712308 7.495385 1.146923 6.203077  Q 0.694615 5.411539 0.694615 4.119231  L 0.694615 4.103077  Q 0.694615 2.810769 1.146923 2.019231  Q 1.712308 0.726923 4.393846 0.694615  L 14.651539 0.694615  Z  M 8.093077 7.220769  Q 10.193077 7.220769 13.827692 6.122308  Q 15.265385 5.815384 16.670769 5.815384  L 16.686924 4.781538  L 16.153847 4.781538  Q 14.974615 4.781538 13.44 4.426154  Q 10.823077 2.956154 8.093077 2.956154  Q 6.784616 2.956154 5.621539 3.214615  Q 4.458462 3.473077 2.374615 3.440769  Q 2.116154 3.440769 2.124231 4.127308  Q 2.132308 4.813846 2.423077 4.813846  Q 3.069231 4.910769 4.006154 5.661923  Q 4.943077 6.413077 5.637692 6.687692  Q 6.962308 7.220769 8.093077 7.220769  Z  M 6.51 4.959231  Q 6.51 3.731539 8.093077 3.715385  Q 9.627692 3.715385 9.66 4.959231  Q 9.66 5.847692 9.280385 6.162692  Q 8.900769 6.477692 8.093077 6.477692  Q 7.301538 6.477692 6.905769 6.162692  Q 6.51 5.847692 6.51 4.959231  Z  M 10.08 6.283846  Q 10.41923 5.621539 10.41923 4.991539  Q 10.41923 4.361538 9.966923 3.747692  Q 12.260769 4.313077 13.585384 5.266154  L 13.585384 5.282308  Q 12.244616 5.976923 10.08 6.283846  Z  M 3.392308 4.377692  L 3.392308 4.216154  L 6.283846 3.747692  Q 5.766923 4.280769 5.766923 4.959231  Q 5.766923 5.573077 6.09 6.122308  Q 5.379231 5.960769 3.392308 4.377692  Z  M 16.751539 2.778461  Q 14.102307 2.778461 12.906923 2.205  Q 11.711538 1.631539 10.217308 1.389231  Q 8.723077 1.146923 7.285385 1.211538  Q 5.847692 1.276154 5.104615 1.445769  Q 4.361538 1.615385 3.053077 1.631539  Q 2.180769 1.615385 2.196923 2.083846  Q 2.180769 2.616923 2.891538 2.616923  Q 4.361538 2.616923 5.274231 2.342308  Q 6.186923 2.067692 7.455 2.003077  Q 8.723077 1.938462 10.185 2.188846  Q 11.646923 2.439231 12.842308 3.045  Q 14.037692 3.650769 16.751539 3.634615  L 16.751539 2.778461  L 16.751539 2.778461  Z '/></svg>
