<?xml version="1.0" encoding="UTF-8" standalone="no"?>
<!-- Created with Inkscape (http://www.inkscape.org/) -->

<svg
   xmlns:dc="http://purl.org/dc/elements/1.1/"
   xmlns:cc="http://creativecommons.org/ns#"
   xmlns:rdf="http://www.w3.org/1999/02/22-rdf-syntax-ns#"
   xmlns:svg="http://www.w3.org/2000/svg"
   xmlns="http://www.w3.org/2000/svg"
   version="1.1"
   width="24"
   height="40"
   id="svg3224">
  <metadata
     id="metadata3167">
    <rdf:RDF>
      <cc:Work
         rdf:about="">
        <dc:format>image/svg+xml</dc:format>
        <dc:type
           rdf:resource="http://purl.org/dc/dcmitype/StillImage" />
        <dc:title></dc:title>
      </cc:Work>
    </rdf:RDF>
  </metadata>
  <defs
     id="defs3226" />
  <g
     transform="translate(0,31.26)"
     id="layer1">
    <g
       id="text4426"
       style="font-size:40px;font-style:normal;font-weight:normal;line-height:125%;letter-spacing:0px;word-spacing:0px;fill:#000000;fill-opacity:1;stroke:none;font-family:Sans">
      <path
         d="M 12.6,-21.4 C 10.946656,-21.399979 9.5199905,-21.039979 8.32,-20.32 7.1199929,-19.59998 6.2399938,-18.719981 5.68,-17.68 5.1466615,-16.639983 4.7599952,-15.693318 4.52,-14.84 4.2799957,-13.986653 4.1599958,-13.266653 4.16,-12.68 L 4.16,-9.76 C 4.1599958,-7.039993 4.9866617,-4.8933284 6.64,-3.32 8.293325,-1.7733316 10.559989,-0.999999 13.44,-1 15.306651,-0.999999 17.213316,-1.4533319 19.16,-2.36 L 19.16,-8.36 13.6,-8.36 C 12.879987,-8.3599916 12.519987,-8.6399914 12.52,-9.2 12.519987,-9.7333236 12.879987,-9.99999 13.6,-10 L 21.36,-10 C 22.106645,-9.99999 22.479978,-9.7333236 22.48,-9.2 22.479978,-8.6399914 22.106645,-8.3599916 21.36,-8.36 L 20.8,-8.36 20.8,-1.44 C 18.399982,-0.05333328 15.906651,0.63999936 13.32,0.64 10.03999,0.63999936 7.4133259,-0.30666636 5.44,-2.2 3.4933298,-4.0933292 2.5199975,-6.6133267 2.52,-9.76 L 2.52,-12.72 C 2.5199975,-15.519984 3.4533299,-17.933315 5.32,-19.96 7.2133261,-22.013311 9.6133237,-23.039977 12.52,-23.04 15.159985,-23.039977 17.373316,-22.319978 19.16,-20.88 L 19.16,-21.44 C 19.159981,-22.159978 19.439981,-22.519977 20,-22.52 20.533313,-22.519977 20.799979,-22.159978 20.8,-21.44 L 20.8,-17.8 C 20.799979,-17.079983 20.533313,-16.719983 20,-16.72 19.493314,-16.719983 19.226647,-17.053316 19.2,-17.72 19.119981,-18.733315 18.439982,-19.59998 17.16,-20.32 15.879984,-21.039979 14.359986,-21.399979 12.6,-21.4"
         id="path3306"
         style="font-variant:normal;font-stretch:normal;font-family:FreeMono;-inkscape-font-specification:FreeMono" />
    </g>
  </g>
</svg>
