<?xml version="1.0" encoding="UTF-8" standalone="no"?>
<!-- Created with Inkscape (http://www.inkscape.org/) -->

<svg
   xmlns:dc="http://purl.org/dc/elements/1.1/"
   xmlns:cc="http://creativecommons.org/ns#"
   xmlns:rdf="http://www.w3.org/1999/02/22-rdf-syntax-ns#"
   xmlns:svg="http://www.w3.org/2000/svg"
   xmlns="http://www.w3.org/2000/svg"
   version="1.1"
   width="24"
   height="40"
   id="svg3224">
  <metadata
     id="metadata8">
    <rdf:RDF>
      <cc:Work
         rdf:about="">
        <dc:format>image/svg+xml</dc:format>
        <dc:type
           rdf:resource="http://purl.org/dc/dcmitype/StillImage" />
        <dc:title></dc:title>
      </cc:Work>
    </rdf:RDF>
  </metadata>
  <defs
     id="defs3226" />
  <g
     transform="translate(0,31.26)"
     id="layer1">
    <g
       id="text4426"
       style="font-size:40px;font-style:normal;font-weight:normal;line-height:125%;letter-spacing:0px;word-spacing:0px;fill:#000000;fill-opacity:1;stroke:none;font-family:Sans">
      <path
         d="M 19.48,-21.16 19.48,-18.44 C 19.479981,-17.719982 19.199981,-17.359983 18.64,-17.36 18.106649,-17.359983 17.839982,-17.719982 17.84,-18.44 L 17.84,-20.08 C 16.026651,-20.986646 14.306652,-21.439979 12.68,-21.44 11.026656,-21.439979 9.666657,-21.013312 8.6,-20.16 7.5333258,-19.333314 6.999993,-18.253315 7,-16.92 6.999993,-15.773318 7.5066592,-14.733319 8.52,-13.8 9.5599904,-12.89332 11.253322,-11.946655 13.6,-10.96 L 13.6,-1.64 15.4,-1.64 C 16.119984,-1.6399984 16.479984,-1.373332 16.48,-0.84 16.479984,-0.27999972 16.119984,0 15.4,0 L 10.16,0 C 9.4133239,0 9.039991,-0.27999972 9.04,-0.84 9.039991,-1.373332 9.4133239,-1.6399984 10.16,-1.64 L 11.96,-1.64 11.96,-9.88 C 9.4533239,-11.053322 7.7199923,-12.146655 6.76,-13.16 5.8266608,-14.173319 5.3599946,-15.426651 5.36,-16.92 5.3599946,-18.759981 6.0133273,-20.23998 7.32,-21.36 8.626658,-22.506644 10.346656,-23.079977 12.48,-23.08 13.546653,-23.079977 14.493319,-22.97331 15.32,-22.76 16.173317,-22.546644 17.013316,-22.239978 17.84,-21.84 18.666648,-21.466645 19.213314,-21.239979 19.48,-21.16"
         id="path3030"
         style="font-variant:normal;font-stretch:normal;font-family:FreeMono;-inkscape-font-specification:FreeMono" />
    </g>
  </g>
</svg>
