<?xml version="1.0" encoding="UTF-8" standalone="no"?>
<!-- Created with Inkscape (http://www.inkscape.org/) -->

<svg
   xmlns:dc="http://purl.org/dc/elements/1.1/"
   xmlns:cc="http://creativecommons.org/ns#"
   xmlns:rdf="http://www.w3.org/1999/02/22-rdf-syntax-ns#"
   xmlns:svg="http://www.w3.org/2000/svg"
   xmlns="http://www.w3.org/2000/svg"
   version="1.1"
   width="24"
   height="40"
   id="svg3224">
  <metadata
     id="metadata3167">
    <rdf:RDF>
      <cc:Work
         rdf:about="">
        <dc:format>image/svg+xml</dc:format>
        <dc:type
           rdf:resource="http://purl.org/dc/dcmitype/StillImage" />
        <dc:title></dc:title>
      </cc:Work>
    </rdf:RDF>
  </metadata>
  <defs
     id="defs3226" />
  <g
     transform="translate(0,31.26)"
     id="layer1">
    <g
       id="text4426"
       style="font-size:40px;font-style:normal;font-weight:normal;line-height:125%;letter-spacing:0px;word-spacing:0px;fill:#000000;fill-opacity:1;stroke:none;font-family:Sans">
      <path
         d="M 12.8,-16.68 12.8,-1.64 19.2,-1.64 C 19.946647,-1.6399984 20.31998,-1.373332 20.32,-0.84 20.31998,-0.27999972 19.946647,0 19.2,0 L 4.76,0 C 4.039996,0 3.6799963,-0.27999972 3.68,-0.84 3.6799963,-1.373332 4.039996,-1.6399984 4.76,-1.64 L 11.16,-1.64 11.16,-15.04 6.44,-15.04 C 5.7199943,-15.039985 5.3599946,-15.319985 5.36,-15.88 5.3599946,-16.413317 5.7199943,-16.679983 6.44,-16.68 L 12.8,-16.68 M 12.72,-24.96 12.72,-20.8 10.36,-20.8 10.36,-24.96 12.72,-24.96"
         id="path3922"
         style="font-variant:normal;font-stretch:normal;font-family:FreeMono;-inkscape-font-specification:FreeMono" />
    </g>
  </g>
</svg>
