<?xml version="1.0" encoding="UTF-8" standalone="no"?>
<!-- Created with Inkscape (http://www.inkscape.org/) -->

<svg
   xmlns:dc="http://purl.org/dc/elements/1.1/"
   xmlns:cc="http://creativecommons.org/ns#"
   xmlns:rdf="http://www.w3.org/1999/02/22-rdf-syntax-ns#"
   xmlns:svg="http://www.w3.org/2000/svg"
   xmlns="http://www.w3.org/2000/svg"
   version="1.1"
   width="24"
   height="40"
   id="svg3224">
  <metadata
     id="metadata8">
    <rdf:RDF>
      <cc:Work
         rdf:about="">
        <dc:format>image/svg+xml</dc:format>
        <dc:type
           rdf:resource="http://purl.org/dc/dcmitype/StillImage" />
        <dc:title></dc:title>
      </cc:Work>
    </rdf:RDF>
  </metadata>
  <defs
     id="defs3226" />
  <g
     transform="translate(0,31.26)"
     id="layer1">
    <g
       id="text4426"
       style="font-size:40px;font-style:normal;font-weight:normal;line-height:125%;letter-spacing:0px;word-spacing:0px;fill:#000000;fill-opacity:1;stroke:none;font-family:Sans">
      <path
         d="M 2.24,-14.36 C 2.2399978,-14.759985 2.0133313,-15.159985 1.56,-15.56 1.1066656,-15.986651 0.87999912,-16.38665 0.88,-16.76 0.87999912,-17.346649 1.1199989,-17.759982 1.6,-18 2.0799979,-18.239982 2.8399972,-18.359982 3.88,-18.36 4.3866623,-18.359982 4.8133285,-18.173315 5.16,-17.8 5.5066612,-17.453316 5.6799943,-16.893316 5.68,-16.12 L 5.68,-10.88 12,-17.2 C 12.719987,-17.946649 13.359987,-18.319982 13.92,-18.32 14.399986,-18.319982 14.799985,-18.186648 15.12,-17.92 15.439985,-17.679982 15.599984,-17.346649 15.6,-16.92 15.599984,-16.493317 15.426651,-16.133317 15.08,-15.84 14.733319,-15.546651 14.359986,-15.399985 13.96,-15.4 13.639986,-15.399985 13.399987,-15.439985 13.24,-15.52 13.106654,-15.626651 12.946654,-15.813318 12.76,-16.08 L 7.52,-10.84 16.64,0 C 16.90665,0.29333304 17.279983,0.5333328 17.76,0.72 18.266648,0.9333324 18.679981,1.1466655 19,1.36 19.346647,1.5733318 19.51998,1.8933314 19.52,2.32 19.51998,3.0133303 18.813315,3.3599966 17.4,3.36 16.919983,3.3599966 16.333317,2.9466637 15.64,2.12 L 5.68,-9.52 5.68,-3.72 C 5.6799943,-3.3199967 5.9199941,-2.9066638 6.4,-2.48 6.8799931,-2.0799979 7.1199929,-1.6933316 7.12,-1.32 7.1199929,-0.7333326 6.8799931,-0.31999968 6.4,-0.08 5.9199941,0.15999984 5.1599948,0.27999972 4.12,0.28 3.5866631,0.27999972 3.1333302,0.10666656 2.76,-0.24 2.4133309,-0.61333272 2.2399978,-1.1866655 2.24,-1.96 L 2.24,-14.36"
         id="path3452"
         style="font-variant:normal;font-stretch:normal;font-family:FreeMono;-inkscape-font-specification:FreeMono" />
    </g>
  </g>
</svg>
