<?xml version="1.0" encoding="UTF-8" standalone="no"?>
<!-- Created with Inkscape (http://www.inkscape.org/) -->

<svg
   xmlns:dc="http://purl.org/dc/elements/1.1/"
   xmlns:cc="http://creativecommons.org/ns#"
   xmlns:rdf="http://www.w3.org/1999/02/22-rdf-syntax-ns#"
   xmlns:svg="http://www.w3.org/2000/svg"
   xmlns="http://www.w3.org/2000/svg"
   version="1.1"
   width="24"
   height="40"
   id="svg3224">
  <metadata
     id="metadata3167">
    <rdf:RDF>
      <cc:Work
         rdf:about="">
        <dc:format>image/svg+xml</dc:format>
        <dc:type
           rdf:resource="http://purl.org/dc/dcmitype/StillImage" />
        <dc:title></dc:title>
      </cc:Work>
    </rdf:RDF>
  </metadata>
  <defs
     id="defs3226" />
  <g
     transform="translate(0,31.26)"
     id="layer1">
    <g
       id="text4426"
       style="font-size:40px;font-style:normal;font-weight:normal;line-height:125%;letter-spacing:0px;word-spacing:0px;fill:#000000;fill-opacity:1;stroke:none;font-family:Sans">
      <path
         d="M 5.88,4.16 C 5.8799941,3.8666628 6.0933272,3.3199967 6.52,2.52 6.9466597,1.7466649 7.4133259,0.89333244 7.92,-0.04 8.4533249,-0.999999 8.9333244,-2.3466643 9.36,-4.08 9.7866569,-5.8133275 9.99999,-7.6533257 10,-9.6 9.99999,-13.706653 8.666658,-18.146649 6,-22.92 5.9199941,-23.106644 5.8799941,-23.25331 5.88,-23.36 5.8799941,-23.57331 5.959994,-23.759976 6.12,-23.92 6.3066604,-24.079976 6.5066602,-24.159976 6.72,-24.16 7.1466595,-24.159976 7.7999922,-23.426643 8.68,-21.96 9.5866571,-20.519979 10.43999,-18.599981 11.24,-16.2 12.039988,-13.799986 12.439988,-11.559988 12.44,-9.48 12.439988,-7.5066592 12.026655,-5.333328 11.2,-2.96 10.39999,-0.61333272 9.5466571,1.293332 8.64,2.76 7.7333256,4.2266624 7.0799929,4.959995 6.68,4.96 6.4666602,4.959995 6.2799937,4.8799951 6.12,4.72 5.959994,4.5599954 5.8799941,4.373329 5.88,4.16"
         id="path4739"
         style="font-variant:normal;font-stretch:normal;font-family:FreeMono;-inkscape-font-specification:FreeMono" />
    </g>
  </g>
</svg>
