<?xml version="1.0" encoding="UTF-8" standalone="no"?>
<!-- Created with Inkscape (http://www.inkscape.org/) -->

<svg
   xmlns:dc="http://purl.org/dc/elements/1.1/"
   xmlns:cc="http://creativecommons.org/ns#"
   xmlns:rdf="http://www.w3.org/1999/02/22-rdf-syntax-ns#"
   xmlns:svg="http://www.w3.org/2000/svg"
   xmlns="http://www.w3.org/2000/svg"
   version="1.1"
   width="24"
   height="40"
   id="svg3224">
  <metadata
     id="metadata3167">
    <rdf:RDF>
      <cc:Work
         rdf:about="">
        <dc:format>image/svg+xml</dc:format>
        <dc:type
           rdf:resource="http://purl.org/dc/dcmitype/StillImage" />
        <dc:title></dc:title>
      </cc:Work>
    </rdf:RDF>
  </metadata>
  <defs
     id="defs3226" />
  <g
     transform="translate(0,31.26)"
     id="layer1">
    <g
       id="text4426"
       style="font-size:40px;font-style:normal;font-weight:normal;line-height:125%;letter-spacing:0px;word-spacing:0px;fill:#000000;fill-opacity:1;stroke:none;font-family:Sans">
      <path
         d="M 20.8,-22.04 C 20.746646,-22.039978 20.413313,-22.079978 19.8,-22.16 19.186647,-22.239978 18.439982,-22.319978 17.56,-22.4 16.70665,-22.479978 15.946651,-22.519977 15.28,-22.52 13.973319,-22.519977 12.906654,-22.199978 12.08,-21.56 11.253322,-20.946646 10.839989,-20.133313 10.84,-19.12 L 10.84,-16.68 18.4,-16.68 C 19.119981,-16.679983 19.479981,-16.413317 19.48,-15.88 19.479981,-15.319985 19.119981,-15.039985 18.4,-15.04 L 10.84,-15.04 10.84,-1.64 17.96,-1.64 C 18.679981,-1.6399984 19.039981,-1.373332 19.04,-0.84 19.039981,-0.27999972 18.679981,0 17.96,0 L 5.28,0 C 4.5599954,0 4.1999958,-0.27999972 4.2,-0.84 4.1999958,-1.373332 4.5599954,-1.6399984 5.28,-1.64 L 9.2,-1.64 9.2,-15.04 5.68,-15.04 C 4.959995,-15.039985 4.5999954,-15.319985 4.6,-15.88 4.5999954,-16.413317 4.959995,-16.679983 5.68,-16.68 L 9.2,-16.68 9.2,-19.12 C 9.1999908,-20.586646 9.7733236,-21.786645 10.92,-22.72 12.093321,-23.679976 13.57332,-24.159976 15.36,-24.16 17.226649,-24.159976 19.079981,-23.986643 20.92,-23.64 21.399979,-23.506643 21.639978,-23.239977 21.64,-22.84 21.639978,-22.306644 21.359979,-22.039978 20.8,-22.04"
         id="path4032"
         style="font-variant:normal;font-stretch:normal;font-family:FreeMono;-inkscape-font-specification:FreeMono" />
    </g>
  </g>
</svg>
