<?xml version='1.0' encoding ='UTF-8' standalone='yes'?>
<svg width='15.903461' height='5.169231' xmlns='http://www.w3.org/2000/svg' xmlns:xlink='http://www.w3.org/1999/xlink' xmlns:inkscape='http://www.inkscape.org/namespaces/inkscape'>
<path style='fill:#000000; stroke:none' d=' M 6.518077 0  Q 8.828077 0 12.801923 1.340769  Q 14.368846 1.696154 15.903461 1.696154  L 15.903461 2.956154  Q 14.04577 2.956154 12.365769 3.392308  Q 9.506538 5.169231 6.518077 5.169231  Q 5.096539 5.169231 3.820385 4.854231  Q 2.544231 4.539231 0.266538 4.587692  Q -0.008077 4.587692 0 3.755769  Q 0.008077 2.923846 0.315 2.923846  Q 1.025769 2.810769 2.051538 1.89  Q 3.077308 0.969231 4.175769 0.484615  Q 5.274231 0 6.518077 0  Z  M 6.518077 0.904615  Q 5.645769 0.904615 4.603846 1.211538  Q 3.561923 1.518462 1.397308 3.440769  L 1.397308 3.650769  Q 5.161154 4.232308 6.518077 4.232308  Q 8.085 4.232308 9.377308 3.868846  Q 10.669616 3.505385 12.527308 2.374615  L 12.527308 2.342308  Q 11.057307 1.502308 9.231923 1.203462  Q 7.406538 0.904615 6.518077 0.904615  Z  M 3.836539 1.114615  Q 4.046538 1.502308 4.684616 1.946538  Q 5.322692 2.390769 6.518077 2.390769  Q 7.778077 2.390769 8.416154 1.857692  Q 9.054231 1.324615 9.248077 0.84  L 10.201154 1.017692  Q 9.958846 1.631539 9.126923 2.366539  Q 8.295 3.101538 6.518077 3.117692  Q 4.918846 3.117692 4.111154 2.568462  Q 3.303462 2.019231 3.028846 1.631539  L 3.836539 1.114615  Z '/></svg>
