<?xml version="1.0" encoding="UTF-8" standalone="no"?>
<!-- Created with Inkscape (http://www.inkscape.org/) -->

<svg
   xmlns:dc="http://purl.org/dc/elements/1.1/"
   xmlns:cc="http://creativecommons.org/ns#"
   xmlns:rdf="http://www.w3.org/1999/02/22-rdf-syntax-ns#"
   xmlns:svg="http://www.w3.org/2000/svg"
   xmlns="http://www.w3.org/2000/svg"
   version="1.1"
   width="24"
   height="40"
   id="svg3224">
  <metadata
     id="metadata3167">
    <rdf:RDF>
      <cc:Work
         rdf:about="">
        <dc:format>image/svg+xml</dc:format>
        <dc:type
           rdf:resource="http://purl.org/dc/dcmitype/StillImage" />
        <dc:title></dc:title>
      </cc:Work>
    </rdf:RDF>
  </metadata>
  <defs
     id="defs3226" />
  <g
     transform="translate(0,31.26)"
     id="layer1">
    <g
       id="text4426"
       style="font-size:40px;font-style:normal;font-weight:normal;line-height:125%;letter-spacing:0px;word-spacing:0px;fill:#000000;fill-opacity:1;stroke:none;font-family:Sans">
      <path
         d="M 8.44,-5.8 13.76,-5.8 7.96,4.8 C 7.6133257,5.4666612 7.1999928,5.7999942 6.72,5.8 6.3999936,5.7999942 6.1199939,5.6799943 5.88,5.44 5.666661,5.2266614 5.5599944,4.959995 5.56,4.64 5.5599944,4.5599954 5.5866611,4.4133289 5.64,4.2 L 8.44,-5.8 M 10.84,-16.68 11.24,-16.68 C 12.013321,-16.679983 12.666654,-16.42665 13.2,-15.92 13.73332,-15.413318 13.999986,-14.786652 14,-14.04 13.999986,-13.29332 13.73332,-12.666654 13.2,-12.16 12.666654,-11.653322 12.013321,-11.399989 11.24,-11.4 L 10.84,-11.4 C 10.066657,-11.399989 9.4133239,-11.653322 8.88,-12.16 8.3466583,-12.666654 8.0799919,-13.29332 8.08,-14.04 8.0799919,-14.786652 8.3466583,-15.413318 8.88,-15.92 9.4133239,-16.42665 10.066657,-16.679983 10.84,-16.68"
         id="path5025"
         style="font-variant:normal;font-stretch:normal;font-family:FreeMono;-inkscape-font-specification:FreeMono" />
    </g>
  </g>
</svg>
