<?xml version="1.0" encoding="UTF-8" standalone="no"?>
<!-- Created with Inkscape (http://www.inkscape.org/) -->

<svg
   xmlns:dc="http://purl.org/dc/elements/1.1/"
   xmlns:cc="http://creativecommons.org/ns#"
   xmlns:rdf="http://www.w3.org/1999/02/22-rdf-syntax-ns#"
   xmlns:svg="http://www.w3.org/2000/svg"
   xmlns="http://www.w3.org/2000/svg"
   version="1.1"
   width="24"
   height="40"
   id="svg3224">
  <metadata
     id="metadata3167">
    <rdf:RDF>
      <cc:Work
         rdf:about="">
        <dc:format>image/svg+xml</dc:format>
        <dc:type
           rdf:resource="http://purl.org/dc/dcmitype/StillImage" />
        <dc:title></dc:title>
      </cc:Work>
    </rdf:RDF>
  </metadata>
  <defs
     id="defs3226" />
  <g
     transform="translate(0,31.26)"
     id="layer1">
    <g
       id="text4426"
       style="font-size:40px;font-style:normal;font-weight:normal;line-height:125%;letter-spacing:0px;word-spacing:0px;fill:#000000;fill-opacity:1;stroke:none;font-family:Sans">
      <path
         d="M 7.76,-25.2 12.32,-21.2 12.6,-20.88 C 12.733321,-20.746646 12.799987,-20.599979 12.8,-20.44 12.799987,-20.19998 12.719987,-19.99998 12.56,-19.84 12.399988,-19.67998 12.199988,-19.59998 11.96,-19.6 11.773322,-19.59998 11.533322,-19.71998 11.24,-19.96 L 6.68,-23.96 C 6.3599936,-24.253309 6.1999938,-24.519975 6.2,-24.76 6.1999938,-24.973308 6.2799937,-25.159975 6.44,-25.32 6.5999934,-25.479975 6.7866599,-25.559974 7,-25.56 7.1866595,-25.559974 7.4399926,-25.439975 7.76,-25.2"
         id="path4827"
         style="font-variant:normal;font-stretch:normal;font-family:FreeMono;-inkscape-font-specification:FreeMono" />
    </g>
  </g>
</svg>
