<?xml version="1.0" encoding="UTF-8" standalone="no"?>
<!-- Created with Inkscape (http://www.inkscape.org/) -->

<svg
   xmlns:dc="http://purl.org/dc/elements/1.1/"
   xmlns:cc="http://creativecommons.org/ns#"
   xmlns:rdf="http://www.w3.org/1999/02/22-rdf-syntax-ns#"
   xmlns:svg="http://www.w3.org/2000/svg"
   xmlns="http://www.w3.org/2000/svg"
   version="1.1"
   width="24"
   height="40"
   id="svg3224">
  <metadata
     id="metadata3167">
    <rdf:RDF>
      <cc:Work
         rdf:about="">
        <dc:format>image/svg+xml</dc:format>
        <dc:type
           rdf:resource="http://purl.org/dc/dcmitype/StillImage" />
        <dc:title></dc:title>
      </cc:Work>
    </rdf:RDF>
  </metadata>
  <defs
     id="defs3226" />
  <g
     transform="translate(0,31.26)"
     id="layer1">
    <g
       id="text4426"
       style="font-size:40px;font-style:normal;font-weight:normal;line-height:125%;letter-spacing:0px;word-spacing:0px;fill:#000000;fill-opacity:1;stroke:none;font-family:Sans">
      <path
         d="M 5.36,-21.16 C 5.626661,-21.239979 6.1733272,-21.466645 7,-21.84 7.8266588,-22.239978 8.6533247,-22.546644 9.48,-22.76 10.333323,-22.97331 11.293322,-23.079977 12.36,-23.08 14.493319,-23.079977 16.213317,-22.506644 17.52,-21.36 18.826648,-20.23998 19.479981,-18.759981 19.48,-16.92 19.479981,-15.426651 18.999981,-14.173319 18.04,-13.16 17.10665,-12.146655 15.386651,-11.053322 12.88,-9.88 L 12.88,-8.24 C 12.879987,-7.5199925 12.613321,-7.1599928 12.08,-7.16 11.519988,-7.1599928 11.239989,-7.5199925 11.24,-8.24 L 11.24,-10.96 C 13.586653,-11.946655 15.266651,-12.89332 16.28,-13.8 17.319983,-14.733319 17.839982,-15.773318 17.84,-16.92 17.839982,-18.253315 17.306649,-19.333314 16.24,-20.16 15.173318,-21.013312 13.81332,-21.439979 12.16,-21.44 10.533323,-21.439979 8.8133245,-20.986646 7,-20.08 L 7,-18.44 C 6.999993,-17.719982 6.7333266,-17.359983 6.2,-17.36 5.6399944,-17.359983 5.3599946,-17.719982 5.36,-18.44 L 5.36,-21.16 M 11.48,-3.4 12.56,-3.4 C 13.25332,-3.3999966 13.799986,-3.2133301 14.2,-2.84 14.626652,-2.4666642 14.839985,-1.9866647 14.84,-1.4 14.839985,-0.81333252 14.626652,-0.333333 14.2,0.04 13.77332,0.41333292 13.226653,0.5999994 12.56,0.6 L 11.48,0.6 C 10.786656,0.5999994 10.226656,0.41333292 9.8,0.04 9.3999906,-0.333333 9.1999908,-0.81333252 9.2,-1.4 9.1999908,-1.9866647 9.3999906,-2.4666642 9.8,-2.84 10.226656,-3.2133301 10.786656,-3.3999966 11.48,-3.4"
         id="path4783"
         style="font-variant:normal;font-stretch:normal;font-family:FreeMono;-inkscape-font-specification:FreeMono" />
    </g>
  </g>
</svg>
