<?xml version="1.0" encoding="UTF-8" standalone="no"?>
<!-- Created with Inkscape (http://www.inkscape.org/) -->

<svg
   xmlns:dc="http://purl.org/dc/elements/1.1/"
   xmlns:cc="http://creativecommons.org/ns#"
   xmlns:rdf="http://www.w3.org/1999/02/22-rdf-syntax-ns#"
   xmlns:svg="http://www.w3.org/2000/svg"
   xmlns="http://www.w3.org/2000/svg"
   version="1.1"
   width="24"
   height="40"
   id="svg3224">
  <metadata
     id="metadata3167">
    <rdf:RDF>
      <cc:Work
         rdf:about="">
        <dc:format>image/svg+xml</dc:format>
        <dc:type
           rdf:resource="http://purl.org/dc/dcmitype/StillImage" />
        <dc:title></dc:title>
      </cc:Work>
    </rdf:RDF>
  </metadata>
  <defs
     id="defs3226" />
  <g
     transform="translate(0,31.26)"
     id="layer1">
    <g
       id="text4426"
       style="font-size:40px;font-style:normal;font-weight:normal;line-height:125%;letter-spacing:0px;word-spacing:0px;fill:#000000;fill-opacity:1;stroke:none;font-family:Sans">
      <path
         d="M 17.84,-8.04 C 17.839982,-8.999991 17.533316,-9.7733236 16.92,-10.36 16.30665,-10.946656 15.533318,-11.333322 14.6,-11.52 13.69332,-11.733322 12.706654,-11.959988 11.64,-12.2 10.573323,-12.466654 9.5733238,-12.733321 8.64,-13 7.7333256,-13.29332 6.9733264,-13.799986 6.36,-14.52 5.7466609,-15.266651 5.4399946,-16.22665 5.44,-17.4 5.4399946,-18.839981 5.9733274,-20.093313 7.04,-21.16 8.1333252,-22.226644 9.5199905,-22.85331 11.2,-23.04 L 11.2,-25.12 C 11.199989,-25.839974 11.479989,-26.199974 12.04,-26.2 12.573321,-26.199974 12.839987,-25.839974 12.84,-25.12 L 12.84,-23.04 C 13.719986,-22.959977 14.453319,-22.799977 15.04,-22.56 15.626651,-22.319978 16.279984,-21.919978 17,-21.36 17.053316,-22.133311 17.333316,-22.519977 17.84,-22.52 18.373315,-22.519977 18.639981,-22.159978 18.64,-21.44 L 18.64,-19.04 C 18.639981,-18.319982 18.373315,-17.959982 17.84,-17.96 17.359983,-17.959982 17.079983,-18.253315 17,-18.84 16.893316,-19.55998 16.34665,-20.186646 15.36,-20.72 14.399986,-21.253312 13.306653,-21.519978 12.08,-21.52 10.693323,-21.519978 9.5066572,-21.106646 8.52,-20.28 7.5599924,-19.479981 7.0799929,-18.506648 7.08,-17.36 7.0799929,-16.479984 7.3866593,-15.759984 8,-15.2 8.6133247,-14.666652 9.373324,-14.306652 10.28,-14.12 11.213322,-13.959986 12.213321,-13.746653 13.28,-13.48 14.346652,-13.239987 15.333318,-12.97332 16.24,-12.68 17.173316,-12.413321 17.946649,-11.879988 18.56,-11.08 19.173314,-10.27999 19.479981,-9.2666574 19.48,-8.04 19.479981,-6.4666602 18.879981,-5.1466615 17.68,-4.08 16.479984,-3.0133303 14.866652,-2.373331 12.84,-2.16 L 12.84,2.6 C 12.839987,3.3199967 12.573321,3.6799963 12.04,3.68 11.479989,3.6799963 11.199989,3.3199967 11.2,2.6 L 11.2,-2.16 C 10.266656,-2.2133311 9.3199907,-2.4399976 8.36,-2.84 7.3999926,-3.2399968 6.66666,-3.7333296 6.16,-4.32 L 6.16,-3.68 C 6.1599938,-2.959997 5.8933274,-2.5999974 5.36,-2.6 4.7999952,-2.5999974 4.5199955,-2.959997 4.52,-3.68 L 4.52,-6.84 C 4.5199955,-7.5599924 4.7999952,-7.9199921 5.36,-7.92 5.8133275,-7.9199921 6.0799939,-7.5866591 6.16,-6.92 6.2399938,-6.0666606 6.8533265,-5.3199947 8,-4.68 9.1733242,-4.039996 10.493323,-3.7199963 11.96,-3.72 13.666653,-3.7199963 15.066652,-4.1199959 16.16,-4.92 17.279983,-5.7466609 17.839982,-6.7866599 17.84,-8.04"
         id="path4629"
         style="font-variant:normal;font-stretch:normal;font-family:FreeMono;-inkscape-font-specification:FreeMono" />
    </g>
  </g>
</svg>
