<?xml version="1.0" encoding="UTF-8" standalone="no"?>
<!-- Created with Inkscape (http://www.inkscape.org/) -->

<svg
   xmlns:dc="http://purl.org/dc/elements/1.1/"
   xmlns:cc="http://creativecommons.org/ns#"
   xmlns:rdf="http://www.w3.org/1999/02/22-rdf-syntax-ns#"
   xmlns:svg="http://www.w3.org/2000/svg"
   xmlns="http://www.w3.org/2000/svg"
   version="1.1"
   width="24"
   height="40"
   id="svg3224">
  <metadata
     id="metadata3167">
    <rdf:RDF>
      <cc:Work
         rdf:about="">
        <dc:format>image/svg+xml</dc:format>
        <dc:type
           rdf:resource="http://purl.org/dc/dcmitype/StillImage" />
        <dc:title></dc:title>
      </cc:Work>
    </rdf:RDF>
  </metadata>
  <defs
     id="defs3226" />
  <g
     transform="translate(0,31.26)"
     id="layer1">
    <g
       id="text4426"
       style="font-size:40px;font-style:normal;font-weight:normal;line-height:125%;letter-spacing:0px;word-spacing:0px;fill:#000000;fill-opacity:1;stroke:none;font-family:Sans">
      <path
         d="M 19.28,-25.32 6.2,2.52 C 5.959994,2.999997 5.666661,3.2399968 5.32,3.24 5.1066616,3.2399968 4.9199951,3.1599968 4.76,3 4.5999954,2.8399972 4.5199955,2.666664 4.52,2.48 4.5199955,2.373331 4.5866621,2.1599978 4.72,1.84 L 17.8,-26 C 18.039982,-26.479974 18.333315,-26.719973 18.68,-26.72 18.893314,-26.719973 19.079981,-26.639973 19.24,-26.48 19.399981,-26.319974 19.479981,-26.146641 19.48,-25.96 19.479981,-25.799974 19.413314,-25.586641 19.28,-25.32"
         id="path4695"
         style="font-variant:normal;font-stretch:normal;font-family:FreeMono;-inkscape-font-specification:FreeMono" />
    </g>
  </g>
</svg>
