<?xml version="1.0" encoding="UTF-8" standalone="no"?>
<!-- Created with Inkscape (http://www.inkscape.org/) -->

<svg
   xmlns:dc="http://purl.org/dc/elements/1.1/"
   xmlns:cc="http://creativecommons.org/ns#"
   xmlns:rdf="http://www.w3.org/1999/02/22-rdf-syntax-ns#"
   xmlns:svg="http://www.w3.org/2000/svg"
   xmlns="http://www.w3.org/2000/svg"
   version="1.1"
   width="24"
   height="40"
   id="svg3224">
  <metadata
     id="metadata3167">
    <rdf:RDF>
      <cc:Work
         rdf:about="">
        <dc:format>image/svg+xml</dc:format>
        <dc:type
           rdf:resource="http://purl.org/dc/dcmitype/StillImage" />
        <dc:title></dc:title>
      </cc:Work>
    </rdf:RDF>
  </metadata>
  <defs
     id="defs3226" />
  <g
     transform="translate(0,31.26)"
     id="layer1">
    <g
       id="text4426"
       style="font-size:40px;font-style:normal;font-weight:normal;line-height:125%;letter-spacing:0px;word-spacing:0px;fill:#000000;fill-opacity:1;stroke:none;font-family:Sans">
      <path
         d="M 5,-21.12 C 4.999995,-21.413312 5.2533281,-21.826645 5.76,-22.36 6.293327,-22.89331 7.1333262,-23.41331 8.28,-23.92 9.4266572,-24.453309 10.679989,-24.719975 12.04,-24.72 14.039986,-24.719975 15.706651,-24.119976 17.04,-22.92 18.399982,-21.746645 19.079981,-20.293313 19.08,-18.56 19.079981,-17.413316 18.719981,-16.359984 18,-15.4 17.306649,-14.439986 16.359984,-13.706653 15.16,-13.2 15.133318,-13.199987 15.066652,-13.17332 14.96,-13.12 16.533317,-12.479988 17.759982,-11.586655 18.64,-10.44 19.51998,-9.3199907 19.95998,-8.0799919 19.96,-6.72 19.95998,-4.6933286 19.133314,-2.959997 17.48,-1.52 15.853317,-0.10666656 13.893319,0.5999994 11.6,0.6 10.026657,0.5999994 8.333325,0.21333312 6.52,-0.56 4.7333286,-1.3599986 3.8399962,-2.0933312 3.84,-2.76 3.8399962,-2.9466637 3.9199961,-3.1199969 4.08,-3.28 4.2399958,-3.4399966 4.4133289,-3.5199965 4.6,-3.52 4.7866619,-3.5199965 5.1599948,-3.3066634 5.72,-2.88 6.2799937,-2.4799975 7.0799929,-2.0666646 8.12,-1.64 9.1599908,-1.2399988 10.333323,-1.039999 11.64,-1.04 13.45332,-1.039999 15.013318,-1.5999984 16.32,-2.72 17.653316,-3.8399962 18.319982,-5.1733282 18.32,-6.72 18.319982,-8.293325 17.613316,-9.6399904 16.2,-10.76 14.786652,-11.906655 13.106654,-12.479988 11.16,-12.48 10.43999,-12.479988 10.07999,-12.759987 10.08,-13.32 10.07999,-13.853319 10.43999,-14.119986 11.16,-14.12 12.866654,-14.119986 14.026653,-14.266652 14.64,-14.56 15.493318,-14.933318 16.173317,-15.479985 16.68,-16.2 17.186649,-16.919983 17.439983,-17.693316 17.44,-18.52 17.439983,-19.826647 16.919983,-20.906646 15.88,-21.76 14.839985,-22.639977 13.546653,-23.079977 12,-23.08 10.879989,-23.079977 9.9199901,-22.93331 9.12,-22.64 8.3466583,-22.373311 7.7999922,-22.066645 7.48,-21.72 7.1866595,-21.373312 6.8933264,-21.053312 6.6,-20.76 6.3066604,-20.493313 6.039994,-20.35998 5.8,-20.36 5.5866611,-20.35998 5.3999946,-20.426646 5.24,-20.56 5.0799949,-20.719979 4.999995,-20.906646 5,-21.12"
         id="path4387"
         style="font-variant:normal;font-stretch:normal;font-family:FreeMono;-inkscape-font-specification:FreeMono" />
    </g>
  </g>
</svg>
