<?xml version="1.0" encoding="UTF-8" standalone="no"?>
<!-- Created with Inkscape (http://www.inkscape.org/) -->

<svg
   xmlns:dc="http://purl.org/dc/elements/1.1/"
   xmlns:cc="http://creativecommons.org/ns#"
   xmlns:rdf="http://www.w3.org/1999/02/22-rdf-syntax-ns#"
   xmlns:svg="http://www.w3.org/2000/svg"
   xmlns="http://www.w3.org/2000/svg"
   version="1.1"
   width="24"
   height="40"
   id="svg3224">
  <metadata
     id="metadata8">
    <rdf:RDF>
      <cc:Work
         rdf:about="">
        <dc:format>image/svg+xml</dc:format>
        <dc:type
           rdf:resource="http://purl.org/dc/dcmitype/StillImage" />
        <dc:title></dc:title>
      </cc:Work>
    </rdf:RDF>
  </metadata>
  <defs
     id="defs3226" />
  <g
     transform="translate(0,31.26)"
     id="layer1">
    <g
       id="text4426"
       style="font-size:40px;font-style:normal;font-weight:normal;line-height:125%;letter-spacing:0px;word-spacing:0px;fill:#000000;fill-opacity:1;stroke:none;font-family:Sans">
      <path
         d="M 9,-17.76 C 8.999991,-18.159982 8.7599912,-18.559981 8.28,-18.96 7.8266588,-19.386647 7.5999924,-19.786647 7.6,-20.16 7.5999924,-20.746646 7.8399922,-21.159979 8.32,-21.4 8.7999912,-21.639978 9.5599904,-21.759978 10.6,-21.76 11.133322,-21.759978 11.573322,-21.573312 11.92,-21.2 12.266654,-20.853312 12.439988,-20.293313 12.44,-19.52 L 12.44,-15.24 C 15.053318,-15.239985 17.06665,-14.679985 18.48,-13.56 19.91998,-12.466654 20.639979,-11.093322 20.64,-9.44 20.639979,-7.3599926 19.853313,-5.7733276 18.28,-4.68 16.70665,-3.5866631 14.973318,-3.039997 13.08,-3.04 12.919987,-3.039997 12.706654,-3.0666636 12.44,-3.12 L 12.44,-0.64 C 12.439988,-0.23999976 12.666654,0.15999984 13.12,0.56 13.599986,0.98666568 13.839986,1.3866653 13.84,1.76 13.839986,2.3466643 13.599986,2.7599972 13.12,3 12.639987,3.2399968 11.879988,3.3599966 10.84,3.36 10.333323,3.3599966 9.8933234,3.1733302 9.52,2.8 9.1733242,2.4533309 8.999991,1.8933314 9,1.12 L 9,-3.12 C 8.8666578,-3.0933302 8.7466579,-3.0799969 8.64,-3.08 6.5599934,-3.0799969 4.7599952,-3.626663 3.24,-4.72 1.7199983,-5.8133275 0.95999904,-7.333326 0.96,-9.28 0.95999904,-10.933322 1.6533317,-12.333321 3.04,-13.48 4.4533289,-14.653319 6.4399936,-15.239985 9,-15.24 L 9,-17.76 M 9,-14.4 C 5.9333274,-14.399986 4.3999956,-12.759987 4.4,-9.48 4.3999956,-7.6399924 4.7333286,-6.2399938 5.4,-5.28 6.0933272,-4.3466623 7.293326,-3.8799961 9,-3.88 L 9,-14.4 M 12.44,-3.88 C 15.586651,-3.8799961 17.159983,-5.7199943 17.16,-9.4 17.159983,-10.973322 16.74665,-12.199988 15.92,-13.08 15.119985,-13.959986 13.959986,-14.399986 12.44,-14.4 L 12.44,-3.88"
         id="path3955"
         style="font-variant:normal;font-stretch:normal;font-family:FreeMono;-inkscape-font-specification:FreeMono" />
    </g>
  </g>
</svg>
