<?xml version="1.0" encoding="UTF-8" standalone="no"?>
<!-- Created with Inkscape (http://www.inkscape.org/) -->

<svg
   xmlns:dc="http://purl.org/dc/elements/1.1/"
   xmlns:cc="http://creativecommons.org/ns#"
   xmlns:rdf="http://www.w3.org/1999/02/22-rdf-syntax-ns#"
   xmlns:svg="http://www.w3.org/2000/svg"
   xmlns="http://www.w3.org/2000/svg"
   version="1.1"
   width="24"
   height="40"
   id="svg3224">
  <metadata
     id="metadata3167">
    <rdf:RDF>
      <cc:Work
         rdf:about="">
        <dc:format>image/svg+xml</dc:format>
        <dc:type
           rdf:resource="http://purl.org/dc/dcmitype/StillImage" />
        <dc:title></dc:title>
      </cc:Work>
    </rdf:RDF>
  </metadata>
  <defs
     id="defs3226" />
  <g
     transform="translate(0,31.26)"
     id="layer1">
    <g
       id="text4426"
       style="font-size:40px;font-style:normal;font-weight:normal;line-height:125%;letter-spacing:0px;word-spacing:0px;fill:#000000;fill-opacity:1;stroke:none;font-family:Sans">
      <path
         d="M 13.52,-22.52 12.8,-9.48 C 12.773321,-8.7333246 12.493321,-8.3599916 11.96,-8.36 11.453322,-8.3599916 11.186655,-8.7333246 11.16,-9.48 L 10.44,-22.52 C 10.413323,-22.706644 10.39999,-22.919977 10.4,-23.16 10.39999,-23.61331 10.546656,-23.986643 10.84,-24.28 11.159989,-24.573309 11.546655,-24.719975 12,-24.72 12.426654,-24.719975 12.786654,-24.573309 13.08,-24.28 13.399987,-23.986643 13.559986,-23.61331 13.56,-23.16 L 13.52,-22.96 C 13.519986,-22.799977 13.519986,-22.653311 13.52,-22.52 M 11.72,-3.4 12.24,-3.4 C 12.85332,-3.3999966 13.359987,-3.1999968 13.76,-2.8 14.186652,-2.4266642 14.399986,-1.959998 14.4,-1.4 14.399986,-0.83999916 14.186652,-0.37333296 13.76,0 13.359987,0.3999996 12.85332,0.5999994 12.24,0.6 L 11.72,0.6 C 11.133322,0.5999994 10.626656,0.3999996 10.2,0 9.7999902,-0.37333296 9.5999904,-0.83999916 9.6,-1.4 9.5999904,-1.959998 9.7999902,-2.4266642 10.2,-2.8 10.626656,-3.1999968 11.133322,-3.3999966 11.72,-3.4"
         id="path4585"
         style="font-variant:normal;font-stretch:normal;font-family:FreeMono;-inkscape-font-specification:FreeMono" />
    </g>
  </g>
</svg>
