<?xml version="1.0" encoding="UTF-8" standalone="no"?>
<!-- Created with Inkscape (http://www.inkscape.org/) -->

<svg
   xmlns:dc="http://purl.org/dc/elements/1.1/"
   xmlns:cc="http://creativecommons.org/ns#"
   xmlns:rdf="http://www.w3.org/1999/02/22-rdf-syntax-ns#"
   xmlns:svg="http://www.w3.org/2000/svg"
   xmlns="http://www.w3.org/2000/svg"
   version="1.1"
   width="24"
   height="40"
   id="svg3224">
  <metadata
     id="metadata3167">
    <rdf:RDF>
      <cc:Work
         rdf:about="">
        <dc:format>image/svg+xml</dc:format>
        <dc:type
           rdf:resource="http://purl.org/dc/dcmitype/StillImage" />
        <dc:title></dc:title>
      </cc:Work>
    </rdf:RDF>
  </metadata>
  <defs
     id="defs3226" />
  <g
     transform="translate(0,31.26)"
     id="layer1">
    <g
       id="text4426"
       style="font-size:40px;font-style:normal;font-weight:normal;line-height:125%;letter-spacing:0px;word-spacing:0px;fill:#000000;fill-opacity:1;stroke:none;font-family:Sans">
      <path
         d="M 13,-11.52 20.64,-1.64 21.32,-1.64 C 22.039978,-1.6399984 22.399978,-1.373332 22.4,-0.84 22.399978,-0.27999972 22.039978,0 21.32,0 L 16.04,0 C 15.319985,0 14.959985,-0.27999972 14.96,-0.84 14.959985,-1.373332 15.319985,-1.6399984 16.04,-1.64 L 18.52,-1.64 11.92,-10.2 5.36,-1.64 7.92,-1.64 C 8.6399914,-1.6399984 8.999991,-1.373332 9,-0.84 8.999991,-0.27999972 8.6399914,0 7.92,0 L 2.68,0 C 1.959998,0 1.5999984,-0.27999972 1.6,-0.84 1.5999984,-1.373332 1.959998,-1.6399984 2.68,-1.64 L 3.36,-1.64 10.88,-11.52 3.72,-20.88 3.12,-20.88 C 2.3999976,-20.879979 2.039998,-21.159979 2.04,-21.72 2.039998,-22.253311 2.3999976,-22.519977 3.12,-22.52 L 7.52,-22.52 C 8.2399918,-22.519977 8.5999914,-22.253311 8.6,-21.72 8.5999914,-21.159979 8.2399918,-20.879979 7.52,-20.88 L 5.8,-20.88 12,-12.84 18.12,-20.88 16.32,-20.88 C 15.599984,-20.879979 15.239985,-21.159979 15.24,-21.72 15.239985,-22.253311 15.599984,-22.519977 16.32,-22.52 L 20.76,-22.52 C 21.479979,-22.519977 21.839978,-22.253311 21.84,-21.72 21.839978,-21.159979 21.479979,-20.879979 20.76,-20.88 L 20.16,-20.88 13,-11.52"
         id="path3680"
         style="font-variant:normal;font-stretch:normal;font-family:FreeMono;-inkscape-font-specification:FreeMono" />
    </g>
  </g>
</svg>
