<?xml version="1.0" encoding="UTF-8" standalone="no"?>
<!-- Created with Inkscape (http://www.inkscape.org/) -->

<svg
   xmlns:dc="http://purl.org/dc/elements/1.1/"
   xmlns:cc="http://creativecommons.org/ns#"
   xmlns:rdf="http://www.w3.org/1999/02/22-rdf-syntax-ns#"
   xmlns:svg="http://www.w3.org/2000/svg"
   xmlns="http://www.w3.org/2000/svg"
   version="1.1"
   width="24"
   height="40"
   id="svg3224">
  <metadata
     id="metadata3167">
    <rdf:RDF>
      <cc:Work
         rdf:about="">
        <dc:format>image/svg+xml</dc:format>
        <dc:type
           rdf:resource="http://purl.org/dc/dcmitype/StillImage" />
        <dc:title></dc:title>
      </cc:Work>
    </rdf:RDF>
  </metadata>
  <defs
     id="defs3226" />
  <g
     transform="translate(0,31.26)"
     id="layer1">
    <g
       id="text4426"
       style="font-size:40px;font-style:normal;font-weight:normal;line-height:125%;letter-spacing:0px;word-spacing:0px;fill:#000000;fill-opacity:1;stroke:none;font-family:Sans">
      <path
         d="M 13.44,0 10.64,0 3.92,-15.04 2.28,-15.04 C 1.5599984,-15.039985 1.1999988,-15.319985 1.2,-15.88 1.1999988,-16.413317 1.5599984,-16.679983 2.28,-16.68 L 8.32,-16.68 C 9.0666576,-16.679983 9.4399906,-16.413317 9.44,-15.88 9.4399906,-15.319985 9.0666576,-15.039985 8.32,-15.04 L 5.72,-15.04 11.72,-1.64 12.48,-1.64 18.36,-15.04 15.64,-15.04 C 14.919985,-15.039985 14.559985,-15.319985 14.56,-15.88 14.559985,-16.413317 14.919985,-16.679983 15.64,-16.68 L 21.72,-16.68 C 22.439978,-16.679983 22.799977,-16.413317 22.8,-15.88 22.799977,-15.319985 22.439978,-15.039985 21.72,-15.04 L 20.08,-15.04 13.44,0"
         id="path4233"
         style="font-variant:normal;font-stretch:normal;font-family:FreeMono;-inkscape-font-specification:FreeMono" />
    </g>
  </g>
</svg>
