<?xml version="1.0" encoding="UTF-8" standalone="no"?>
<!-- Created with Inkscape (http://www.inkscape.org/) -->

<svg
   xmlns:dc="http://purl.org/dc/elements/1.1/"
   xmlns:cc="http://creativecommons.org/ns#"
   xmlns:rdf="http://www.w3.org/1999/02/22-rdf-syntax-ns#"
   xmlns:svg="http://www.w3.org/2000/svg"
   xmlns="http://www.w3.org/2000/svg"
   version="1.1"
   width="24"
   height="40"
   id="svg3224">
  <metadata
     id="metadata8">
    <rdf:RDF>
      <cc:Work
         rdf:about="">
        <dc:format>image/svg+xml</dc:format>
        <dc:type
           rdf:resource="http://purl.org/dc/dcmitype/StillImage" />
        <dc:title></dc:title>
      </cc:Work>
    </rdf:RDF>
  </metadata>
  <defs
     id="defs3226" />
  <g
     transform="translate(0,31.26)"
     id="layer1">
    <path
       d="M 16.8,3.48 7.3600002,3.48 C 6.6399942,3.4799965 6.2799942,3.2133301 6.2800002,2.68 6.2799942,2.1466645 6.6399942,1.8799981 7.3600002,1.88 L 16.8,1.88 C 17.519983,1.8799981 17.879982,2.1466645 17.88,2.68 17.879982,3.2133301 17.519983,3.4799965 16.8,3.48 M 17.48,-10.88 6.68,-10.88 6.68,-1.64 8.84,-1.64 C 9.5599904,-1.6399984 9.9199901,-1.373332 9.92,-0.84 9.9199901,-0.27999972 9.5599904,0 8.84,0 L 3.24,0 C 2.4933308,0 2.1199979,-0.27999972 2.12,-0.84 2.1199979,-1.373332 2.4933308,-1.6399984 3.24,-1.64 L 5.04,-1.64 5.04,-20.88 4.04,-20.88 C 3.3199967,-20.879979 2.959997,-21.159979 2.96,-21.72 2.959997,-22.253311 3.3199967,-22.519977 4.04,-22.52 L 8.84,-22.52 C 9.5599904,-22.519977 9.9199901,-22.253311 9.92,-21.72 9.9199901,-21.159979 9.5599904,-20.879979 8.84,-20.88 L 6.68,-20.88 6.68,-12.52 17.48,-12.52 17.48,-20.88 15.32,-20.88 C 14.599985,-20.879979 14.239986,-21.159979 14.24,-21.72 14.239986,-22.253311 14.599985,-22.519977 15.32,-22.52 L 20.12,-22.52 C 20.839979,-22.519977 21.199979,-22.253311 21.2,-21.72 21.199979,-21.159979 20.839979,-20.879979 20.12,-20.88 L 19.12,-20.88 19.12,-1.64 20.96,-1.64 C 21.679978,-1.6399984 22.039978,-1.373332 22.04,-0.84 22.039978,-0.27999972 21.679978,0 20.96,0 L 15.32,0 C 14.599985,0 14.239986,-0.27999972 14.24,-0.84 14.239986,-1.373332 14.599985,-1.6399984 15.32,-1.64 L 17.48,-1.64 17.48,-10.88"
       id="path3076"
       style="font-size:40px;font-style:normal;font-variant:normal;font-weight:normal;font-stretch:normal;line-height:125%;letter-spacing:0px;word-spacing:0px;fill:#000000;fill-opacity:1;stroke:none;font-family:FreeMono;-inkscape-font-specification:FreeMono" />
  </g>
</svg>
