<?xml version="1.0" encoding="UTF-8" standalone="no"?>
<!-- Created with Inkscape (http://www.inkscape.org/) -->

<svg
   xmlns:dc="http://purl.org/dc/elements/1.1/"
   xmlns:cc="http://creativecommons.org/ns#"
   xmlns:rdf="http://www.w3.org/1999/02/22-rdf-syntax-ns#"
   xmlns:svg="http://www.w3.org/2000/svg"
   xmlns="http://www.w3.org/2000/svg"
   version="1.1"
   width="24"
   height="40"
   id="svg3224">
  <metadata
     id="metadata3167">
    <rdf:RDF>
      <cc:Work
         rdf:about="">
        <dc:format>image/svg+xml</dc:format>
        <dc:type
           rdf:resource="http://purl.org/dc/dcmitype/StillImage" />
        <dc:title></dc:title>
      </cc:Work>
    </rdf:RDF>
  </metadata>
  <defs
     id="defs3226" />
  <g
     transform="translate(0,31.26)"
     id="layer1">
    <g
       id="text4426"
       style="font-size:40px;font-style:normal;font-weight:normal;line-height:125%;letter-spacing:0px;word-spacing:0px;fill:#000000;fill-opacity:1;stroke:none;font-family:Sans">
      <path
         d="M 11.96,2.48 C 9.6399904,2.4799975 7.7599922,1.4933318 6.32,-0.48 4.9066618,-2.4799975 4.1999958,-4.959995 4.2,-7.92 L 4.2,-14.44 C 4.1999958,-17.479983 4.9333284,-19.986647 6.4,-21.96 7.8666588,-23.959976 9.7333236,-24.959975 12,-24.96 13.81332,-24.959975 15.319985,-24.346642 16.52,-23.12 17.746649,-21.893311 18.359982,-20.35998 18.36,-18.52 L 18.36,-7.44 C 18.866648,-7.3599926 19.119981,-7.0933262 19.12,-6.64 19.119981,-6.0799939 18.759981,-5.7999942 18.04,-5.8 L 16.72,-5.8 16.72,-6 C 15.919984,-5.9199941 15.386651,-5.8799941 15.12,-5.88 13.57332,-5.8799941 12.279988,-6.3599936 11.24,-7.32 10.19999,-8.2799917 9.6799903,-9.4666572 9.68,-10.88 9.6799903,-12.533321 10.333323,-13.906653 11.64,-15 12.946654,-16.093317 14.613319,-16.639983 16.64,-16.64 L 16.72,-16.64 16.72,-18.52 C 16.719983,-19.906647 16.279984,-21.053312 15.4,-21.96 14.519985,-22.866644 13.399987,-23.319977 12.04,-23.32 10.226656,-23.319977 8.7333246,-22.479978 7.56,-20.8 6.4133269,-19.119981 5.8399942,-16.959983 5.84,-14.32 L 5.84,-7.92 C 5.8399942,-5.4399946 6.4133269,-3.3599966 7.56,-1.68 8.706658,0 10.253323,0.83999916 12.2,0.84 13.319987,0.83999916 14.226652,0.69333264 14.92,0.4 15.639984,0.1333332 16.146651,-0.1333332 16.44,-0.4 16.759983,-0.666666 16.999983,-0.7999992 17.16,-0.8 17.373316,-0.7999992 17.559982,-0.71999928 17.72,-0.56 17.879982,-0.42666624 17.959982,-0.25333308 17.96,-0.04 17.959982,0.57333276 17.319983,1.1466655 16.04,1.68 14.786652,2.2133311 13.426653,2.4799975 11.96,2.48 M 16.72,-7.68 16.72,-15.04 C 15.146652,-15.039985 13.853319,-14.653319 12.84,-13.88 11.826655,-13.106654 11.319989,-12.119988 11.32,-10.92 11.319989,-9.9066568 11.679988,-9.0799909 12.4,-8.44 13.146654,-7.8266588 14.093319,-7.5199925 15.24,-7.52 15.799984,-7.5199925 16.293317,-7.5733258 16.72,-7.68"
         id="path4959"
         style="font-variant:normal;font-stretch:normal;font-family:FreeMono;-inkscape-font-specification:FreeMono" />
    </g>
  </g>
</svg>
