<?xml version="1.0" encoding="UTF-8" standalone="no"?>
<!-- Created with Inkscape (http://www.inkscape.org/) -->

<svg
   xmlns:dc="http://purl.org/dc/elements/1.1/"
   xmlns:cc="http://creativecommons.org/ns#"
   xmlns:rdf="http://www.w3.org/1999/02/22-rdf-syntax-ns#"
   xmlns:svg="http://www.w3.org/2000/svg"
   xmlns="http://www.w3.org/2000/svg"
   version="1.1"
   width="24"
   height="40"
   id="svg3224">
  <metadata
     id="metadata3167">
    <rdf:RDF>
      <cc:Work
         rdf:about="">
        <dc:format>image/svg+xml</dc:format>
        <dc:type
           rdf:resource="http://purl.org/dc/dcmitype/StillImage" />
        <dc:title></dc:title>
      </cc:Work>
    </rdf:RDF>
  </metadata>
  <defs
     id="defs3226" />
  <g
     transform="translate(0,31.26)"
     id="layer1">
    <g
       id="text4426"
       style="font-size:40px;font-style:normal;font-weight:normal;line-height:125%;letter-spacing:0px;word-spacing:0px;fill:#000000;fill-opacity:1;stroke:none;font-family:Sans">
      <path
         d="M 20.8,-7.96 4.16,-7.96 C 4.4533289,-5.8533275 5.333328,-4.1599958 6.8,-2.88 8.2666584,-1.626665 10.07999,-0.999999 12.24,-1 13.49332,-0.999999 14.773319,-1.1999988 16.08,-1.6 17.386649,-1.999998 18.439982,-2.5199975 19.24,-3.16 19.506647,-3.3466633 19.71998,-3.4399966 19.88,-3.44 20.093313,-3.4399966 20.266646,-3.3599966 20.4,-3.2 20.559979,-3.039997 20.639979,-2.8533305 20.64,-2.64 20.639979,-1.9466647 19.67998,-1.2266654 17.76,-0.48 15.866651,0.2666664 14.013319,0.63999936 12.2,0.64 9.5066572,0.63999936 7.2133261,-0.2666664 5.32,-2.08 3.4533299,-3.8933294 2.5199975,-6.0933272 2.52,-8.68 2.5199975,-11.106656 3.3999966,-13.13332 5.16,-14.76 6.9199931,-16.413317 9.0799909,-17.239983 11.64,-17.24 14.333319,-17.239983 16.533317,-16.38665 18.24,-14.68 19.946647,-12.999987 20.799979,-10.759989 20.8,-7.96 M 4.16,-9.6 19.12,-9.6 C 18.799981,-11.413322 17.959982,-12.866654 16.6,-13.96 15.239985,-15.053318 13.586653,-15.599984 11.64,-15.6 9.6933236,-15.599984 8.0533253,-15.053318 6.72,-13.96 5.3866613,-12.89332 4.5333288,-11.439989 4.16,-9.6"
         id="path3812"
         style="font-variant:normal;font-stretch:normal;font-family:FreeMono;-inkscape-font-specification:FreeMono" />
    </g>
  </g>
</svg>
