<?xml version="1.0" encoding="UTF-8" standalone="no"?>
<!-- Created with Inkscape (http://www.inkscape.org/) -->

<svg
   xmlns:dc="http://purl.org/dc/elements/1.1/"
   xmlns:cc="http://creativecommons.org/ns#"
   xmlns:rdf="http://www.w3.org/1999/02/22-rdf-syntax-ns#"
   xmlns:svg="http://www.w3.org/2000/svg"
   xmlns="http://www.w3.org/2000/svg"
   version="1.1"
   width="24"
   height="40"
   id="svg3224">
  <metadata
     id="metadata3167">
    <rdf:RDF>
      <cc:Work
         rdf:about="">
        <dc:format>image/svg+xml</dc:format>
        <dc:type
           rdf:resource="http://purl.org/dc/dcmitype/StillImage" />
        <dc:title></dc:title>
      </cc:Work>
    </rdf:RDF>
  </metadata>
  <defs
     id="defs3226" />
  <g
     transform="translate(0,31.26)"
     id="layer1">
    <g
       id="text4426"
       style="font-size:40px;font-style:normal;font-weight:normal;line-height:125%;letter-spacing:0px;word-spacing:0px;fill:#000000;fill-opacity:1;stroke:none;font-family:Sans">
      <path
         d="M 17.12,-7.52 6.48,-7.52 4.32,-1.64 7.48,-1.64 C 8.1999918,-1.6399984 8.5599914,-1.373332 8.56,-0.84 8.5599914,-0.27999972 8.1999918,0 7.48,0 L 1.44,0 C 0.71999928,0 0.35999964,-0.27999972 0.36,-0.84 0.35999964,-1.373332 0.71999928,-1.6399984 1.44,-1.64 L 2.68,-1.64 9.84,-20.88 5.04,-20.88 C 4.3199957,-20.879979 3.959996,-21.159979 3.96,-21.72 3.959996,-22.253311 4.3199957,-22.519977 5.04,-22.52 L 13.2,-22.52 21.08,-1.64 22.56,-1.64 C 23.279977,-1.6399984 23.639976,-1.373332 23.64,-0.84 23.639976,-0.27999972 23.279977,0 22.56,0 L 16.32,0 C 15.599984,0 15.239985,-0.27999972 15.24,-0.84 15.239985,-1.373332 15.599984,-1.6399984 16.32,-1.64 L 19.36,-1.64 17.12,-7.52 M 16.52,-9.16 12.04,-20.88 11.44,-20.88 7.12,-9.16 16.52,-9.16"
         id="path3192"
         style="font-variant:normal;font-stretch:normal;font-family:FreeMono;-inkscape-font-specification:FreeMono" />
    </g>
  </g>
</svg>
