<?xml version="1.0" encoding="UTF-8" standalone="no"?>
<!-- Created with Inkscape (http://www.inkscape.org/) -->

<svg
   xmlns:dc="http://purl.org/dc/elements/1.1/"
   xmlns:cc="http://creativecommons.org/ns#"
   xmlns:rdf="http://www.w3.org/1999/02/22-rdf-syntax-ns#"
   xmlns:svg="http://www.w3.org/2000/svg"
   xmlns="http://www.w3.org/2000/svg"
   version="1.1"
   width="24"
   height="40"
   id="svg3224">
  <metadata
     id="metadata3167">
    <rdf:RDF>
      <cc:Work
         rdf:about="">
        <dc:format>image/svg+xml</dc:format>
        <dc:type
           rdf:resource="http://purl.org/dc/dcmitype/StillImage" />
        <dc:title></dc:title>
      </cc:Work>
    </rdf:RDF>
  </metadata>
  <defs
     id="defs3226" />
  <g
     transform="translate(0,31.26)"
     id="layer1">
    <g
       id="text4426"
       style="font-size:40px;font-style:normal;font-weight:normal;line-height:125%;letter-spacing:0px;word-spacing:0px;fill:#000000;fill-opacity:1;stroke:none;font-family:Sans">
      <path
         d="M 6.6,-10.88 6.6,-1.64 12.12,-1.64 C 12.866654,-1.6399984 13.239987,-1.373332 13.24,-0.84 13.239987,-0.27999972 12.866654,0 12.12,0 L 2.8,0 C 2.0799979,0 1.7199983,-0.27999972 1.72,-0.84 1.7199983,-1.373332 2.0799979,-1.6399984 2.8,-1.64 L 4.96,-1.64 4.96,-20.88 2.8,-20.88 C 2.0799979,-20.879979 1.7199983,-21.159979 1.72,-21.72 1.7199983,-22.253311 2.0799979,-22.519977 2.8,-22.52 L 20.8,-22.52 20.8,-16.96 C 20.799979,-16.239984 20.519979,-15.879984 19.96,-15.88 19.426647,-15.879984 19.159981,-16.239984 19.16,-16.96 L 19.16,-20.88 6.6,-20.88 6.6,-12.52 12.4,-12.52 12.4,-14.32 C 12.399988,-15.039985 12.666654,-15.399985 13.2,-15.4 13.759986,-15.399985 14.039986,-15.039985 14.04,-14.32 L 14.04,-9.08 C 14.039986,-8.3599916 13.759986,-7.999992 13.2,-8 12.666654,-7.999992 12.399988,-8.3599916 12.4,-9.08 L 12.4,-10.88 6.6,-10.88"
         id="path3284"
         style="font-variant:normal;font-stretch:normal;font-family:FreeMono;-inkscape-font-specification:FreeMono" />
    </g>
  </g>
</svg>
