<?xml version="1.0" encoding="UTF-8" standalone="no"?>
<!-- Created with Inkscape (http://www.inkscape.org/) -->

<svg
   xmlns:dc="http://purl.org/dc/elements/1.1/"
   xmlns:cc="http://creativecommons.org/ns#"
   xmlns:rdf="http://www.w3.org/1999/02/22-rdf-syntax-ns#"
   xmlns:svg="http://www.w3.org/2000/svg"
   xmlns="http://www.w3.org/2000/svg"
   version="1.1"
   width="24"
   height="40"
   id="svg3224">
  <metadata
     id="metadata3167">
    <rdf:RDF>
      <cc:Work
         rdf:about="">
        <dc:format>image/svg+xml</dc:format>
        <dc:type
           rdf:resource="http://purl.org/dc/dcmitype/StillImage" />
        <dc:title></dc:title>
      </cc:Work>
    </rdf:RDF>
  </metadata>
  <defs
     id="defs3226" />
  <g
     transform="translate(0,31.26)"
     id="layer1">
    <g
       id="text4426"
       style="font-size:40px;font-style:normal;font-weight:normal;line-height:125%;letter-spacing:0px;word-spacing:0px;fill:#000000;fill-opacity:1;stroke:none;font-family:Sans">
      <path
         d="M 16.12,-23.36 C 16.119984,-23.01331 15.839984,-22.773311 15.28,-22.64 14.746652,-22.506644 14.213319,-22.253311 13.68,-21.88 13.146654,-21.533312 12.879987,-20.893312 12.88,-19.96 L 12.88,-13.04 C 12.879987,-12.213321 12.746654,-11.546655 12.48,-11.04 12.239988,-10.559989 11.786655,-10.07999 11.12,-9.6 11.786655,-9.1199909 12.239988,-8.626658 12.48,-8.12 12.746654,-7.6399924 12.879987,-6.9866597 12.88,-6.16 L 12.88,0.76 C 12.879987,1.4799985 13.039987,2.039998 13.36,2.44 13.706653,2.8399972 14.079986,3.0799969 14.48,3.16 14.906652,3.2399968 15.279985,3.3466633 15.6,3.48 15.946651,3.6399964 16.119984,3.8666628 16.12,4.16 16.119984,4.6933286 15.799984,4.959995 15.16,4.96 14.066653,4.959995 13.13332,4.5466621 12.36,3.72 11.613322,2.9199971 11.239989,1.9333314 11.24,0.76 L 11.24,-6.16 C 11.239989,-6.9066598 11.066656,-7.4799925 10.72,-7.88 10.373323,-8.2799917 9.9866567,-8.5066582 9.56,-8.56 9.1333242,-8.6399914 8.7466579,-8.7466579 8.4,-8.88 8.0533253,-9.039991 7.8799921,-9.2799907 7.88,-9.6 7.8799921,-9.8933234 8.0533253,-10.11999 8.4,-10.28 8.7466579,-10.43999 9.1333242,-10.546656 9.56,-10.6 9.9866567,-10.679989 10.373323,-10.919989 10.72,-11.32 11.066656,-11.746655 11.239989,-12.319988 11.24,-13.04 L 11.24,-19.96 C 11.239989,-21.133312 11.613322,-22.119978 12.36,-22.92 13.13332,-23.746643 14.066653,-24.159976 15.16,-24.16 15.799984,-24.159976 16.119984,-23.893309 16.12,-23.36"
         id="path4915"
         style="font-variant:normal;font-stretch:normal;font-family:FreeMono;-inkscape-font-specification:FreeMono" />
    </g>
  </g>
</svg>
