<?xml version="1.0" encoding="UTF-8" standalone="no"?>
<!-- Created with Inkscape (http://www.inkscape.org/) -->

<svg
   xmlns:dc="http://purl.org/dc/elements/1.1/"
   xmlns:cc="http://creativecommons.org/ns#"
   xmlns:rdf="http://www.w3.org/1999/02/22-rdf-syntax-ns#"
   xmlns:svg="http://www.w3.org/2000/svg"
   xmlns="http://www.w3.org/2000/svg"
   version="1.1"
   width="24"
   height="40"
   id="svg3224">
  <metadata
     id="metadata3167">
    <rdf:RDF>
      <cc:Work
         rdf:about="">
        <dc:format>image/svg+xml</dc:format>
        <dc:type
           rdf:resource="http://purl.org/dc/dcmitype/StillImage" />
        <dc:title></dc:title>
      </cc:Work>
    </rdf:RDF>
  </metadata>
  <defs
     id="defs3226" />
  <g
     transform="translate(0,31.26)"
     id="layer1">
    <g
       id="text4426"
       style="font-size:40px;font-style:normal;font-weight:normal;line-height:125%;letter-spacing:0px;word-spacing:0px;fill:#000000;fill-opacity:1;stroke:none;font-family:Sans">
      <path
         d="M 15.72,0 14.48,-1.92 C 13.279987,-0.21333312 11.786655,0.63999936 10,0.64 8.4266582,0.63999936 7.0666596,0.01333332 5.92,-1.24 4.7733286,-2.4933308 4.1999958,-3.9733294 4.2,-5.68 4.1999958,-7.0666596 4.5866621,-8.2666584 5.36,-9.28 6.1599938,-10.31999 7.2533261,-11.053322 8.64,-11.48 7.7333256,-12.946654 7.1733262,-13.919986 6.96,-14.4 6.7466599,-14.879985 6.6399934,-15.413318 6.64,-16 6.6399934,-17.306649 7.1199929,-18.426648 8.08,-19.36 9.0666576,-20.293313 10.226656,-20.759979 11.56,-20.76 12.439988,-20.759979 13.319987,-20.493313 14.2,-19.96 14.706652,-20.253313 15.053318,-20.39998 15.24,-20.4 15.426651,-20.39998 15.599984,-20.306646 15.76,-20.12 15.919984,-19.95998 15.999984,-19.773314 16,-19.56 15.999984,-19.239981 15.786651,-18.959981 15.36,-18.72 L 14.08,-18.08 C 13.279987,-18.773315 12.439988,-19.119981 11.56,-19.12 10.706656,-19.119981 9.9466567,-18.786648 9.28,-18.12 8.6133247,-17.479983 8.2799917,-16.74665 8.28,-15.92 8.2799917,-15.093318 8.8666578,-13.759986 10.04,-11.92 L 14.48,-4.84 C 15.306651,-6.3866603 15.919984,-8.0933252 16.32,-9.96 L 18.04,-9.96 C 18.759981,-9.95999 19.119981,-9.6933236 19.12,-9.16 19.119981,-8.5999914 18.759981,-8.3199917 18.04,-8.32 L 17.56,-8.32 C 16.973316,-6.1066606 16.26665,-4.4266622 15.44,-3.28 L 16.52,-1.64 18.04,-1.64 C 18.759981,-1.6399984 19.119981,-1.373332 19.12,-0.84 19.119981,-0.27999972 18.759981,0 18.04,0 L 15.72,0 M 13.52,-3.44 9.32,-10.04 C 8.2533251,-9.7999902 7.3999926,-9.2799907 6.76,-8.48 6.1466605,-7.706659 5.8399942,-6.7733266 5.84,-5.68 5.8399942,-4.4266622 6.2533271,-3.33333 7.08,-2.4 7.9066588,-1.4666652 8.8666578,-0.999999 9.96,-1 11.426655,-0.999999 12.613321,-1.8133315 13.52,-3.44"
         id="path4673"
         style="font-variant:normal;font-stretch:normal;font-family:FreeMono;-inkscape-font-specification:FreeMono" />
    </g>
  </g>
</svg>
