<?xml version="1.0" encoding="UTF-8" standalone="no"?>
<!-- Created with Inkscape (http://www.inkscape.org/) -->

<svg
   xmlns:dc="http://purl.org/dc/elements/1.1/"
   xmlns:cc="http://creativecommons.org/ns#"
   xmlns:rdf="http://www.w3.org/1999/02/22-rdf-syntax-ns#"
   xmlns:svg="http://www.w3.org/2000/svg"
   xmlns="http://www.w3.org/2000/svg"
   version="1.1"
   width="24"
   height="40"
   id="svg3224">
  <metadata
     id="metadata3167">
    <rdf:RDF>
      <cc:Work
         rdf:about="">
        <dc:format>image/svg+xml</dc:format>
        <dc:type
           rdf:resource="http://purl.org/dc/dcmitype/StillImage" />
        <dc:title></dc:title>
      </cc:Work>
    </rdf:RDF>
  </metadata>
  <defs
     id="defs3226" />
  <g
     transform="translate(0,31.26)"
     id="layer1">
    <g
       id="text4426"
       style="font-size:40px;font-style:normal;font-weight:normal;line-height:125%;letter-spacing:0px;word-spacing:0px;fill:#000000;fill-opacity:1;stroke:none;font-family:Sans">
      <path
         d="M 18.56,-6.12 C 18.559981,-7.2399928 18.213315,-8.1466585 17.52,-8.84 16.82665,-9.5333238 15.959984,-9.9866567 14.92,-10.2 13.906653,-10.43999 12.786654,-10.693323 11.56,-10.96 10.35999,-11.253322 9.2399908,-11.546655 8.2,-11.84 7.1866595,-12.159988 6.333327,-12.733321 5.64,-13.56 4.9466617,-14.413319 4.5999954,-15.506651 4.6,-16.84 4.5999954,-18.599981 5.293328,-20.066647 6.68,-21.24 8.0933252,-22.439978 9.8533235,-23.039977 11.96,-23.04 14.253319,-23.039977 16.199984,-22.253311 17.8,-20.68 L 17.8,-21.44 C 17.799982,-22.159978 18.079982,-22.519977 18.64,-22.52 19.173314,-22.519977 19.439981,-22.159978 19.44,-21.44 L 19.44,-17.32 C 19.439981,-16.599983 19.173314,-16.239984 18.64,-16.24 18.106649,-16.239984 17.826649,-16.559983 17.8,-17.2 17.719982,-18.399982 17.133316,-19.399981 16.04,-20.2 14.946652,-20.999979 13.626653,-21.399979 12.08,-21.4 10.426656,-21.399979 9.0533243,-20.959979 7.96,-20.08 6.8933264,-19.199981 6.3599936,-18.106649 6.36,-16.8 6.3599936,-15.759984 6.70666,-14.919985 7.4,-14.28 8.0933252,-13.639986 8.9466577,-13.199987 9.96,-12.96 10.999989,-12.746654 12.119988,-12.479988 13.32,-12.16 14.546652,-11.866655 15.666651,-11.559988 16.68,-11.24 17.719982,-10.919989 18.586648,-10.306656 19.28,-9.4 19.973313,-8.5199915 20.31998,-7.3999926 20.32,-6.04 20.31998,-4.0933292 19.546647,-2.4933308 18,-1.24 16.453317,0.01333332 14.479986,0.63999936 12.08,0.64 9.2533241,0.63999936 6.999993,-0.31999968 5.32,-2.24 L 5.32,-1.08 C 5.3199947,-0.35999964 5.039995,0 4.48,0 3.9466627,0 3.6799963,-0.35999964 3.68,-1.08 L 3.68,-5.56 C 3.6799963,-6.2799937 3.959996,-6.6399934 4.52,-6.64 5.0266616,-6.6399934 5.293328,-6.3199937 5.32,-5.68 5.373328,-4.373329 6.0533273,-3.2666634 7.36,-2.36 8.666658,-1.4533319 10.226656,-0.999999 12.04,-1 13.906653,-0.999999 15.453318,-1.4799985 16.68,-2.44 17.933315,-3.4266632 18.559981,-4.6533287 18.56,-6.12"
         id="path3570"
         style="font-variant:normal;font-stretch:normal;font-family:FreeMono;-inkscape-font-specification:FreeMono" />
    </g>
  </g>
</svg>
