<?xml version="1.0" encoding="UTF-8" standalone="no"?>
<!-- Created with Inkscape (http://www.inkscape.org/) -->

<svg
   xmlns:dc="http://purl.org/dc/elements/1.1/"
   xmlns:cc="http://creativecommons.org/ns#"
   xmlns:rdf="http://www.w3.org/1999/02/22-rdf-syntax-ns#"
   xmlns:svg="http://www.w3.org/2000/svg"
   xmlns="http://www.w3.org/2000/svg"
   version="1.1"
   width="24"
   height="40"
   id="svg3224">
  <metadata
     id="metadata3167">
    <rdf:RDF>
      <cc:Work
         rdf:about="">
        <dc:format>image/svg+xml</dc:format>
        <dc:type
           rdf:resource="http://purl.org/dc/dcmitype/StillImage" />
        <dc:title></dc:title>
      </cc:Work>
    </rdf:RDF>
  </metadata>
  <defs
     id="defs3226" />
  <g
     transform="translate(0,31.26)"
     id="layer1">
    <g
       id="text4426"
       style="font-size:40px;font-style:normal;font-weight:normal;line-height:125%;letter-spacing:0px;word-spacing:0px;fill:#000000;fill-opacity:1;stroke:none;font-family:Sans">
      <path
         d="M 18.96,-16.68 18.96,-15.24 6.84,-1.64 17.92,-1.64 17.92,-3.88 C 17.919982,-4.5999954 18.199982,-4.959995 18.76,-4.96 19.293314,-4.959995 19.55998,-4.5999954 19.56,-3.88 L 19.56,0 4.6,0 4.6,-1.44 16.64,-15.04 6.6,-15.04 6.6,-12.84 C 6.5999934,-12.119988 6.333327,-11.759988 5.8,-11.76 5.2399948,-11.759988 4.959995,-12.119988 4.96,-12.84 L 4.96,-16.68 18.96,-16.68"
         id="path4170"
         style="font-variant:normal;font-stretch:normal;font-family:FreeMono;-inkscape-font-specification:FreeMono" />
    </g>
  </g>
</svg>
