<?xml version="1.0" encoding="UTF-8" standalone="no"?>
<!-- Created with Inkscape (http://www.inkscape.org/) -->

<svg
   xmlns:dc="http://purl.org/dc/elements/1.1/"
   xmlns:cc="http://creativecommons.org/ns#"
   xmlns:rdf="http://www.w3.org/1999/02/22-rdf-syntax-ns#"
   xmlns:svg="http://www.w3.org/2000/svg"
   xmlns="http://www.w3.org/2000/svg"
   version="1.1"
   width="24"
   height="40"
   id="svg3224">
  <metadata
     id="metadata8">
    <rdf:RDF>
      <cc:Work
         rdf:about="">
        <dc:format>image/svg+xml</dc:format>
        <dc:type
           rdf:resource="http://purl.org/dc/dcmitype/StillImage" />
        <dc:title></dc:title>
      </cc:Work>
    </rdf:RDF>
  </metadata>
  <defs
     id="defs3226" />
  <g
     transform="translate(0,31.26)"
     id="layer1">
    <g
       id="text4426"
       style="font-size:40px;font-style:normal;font-weight:normal;line-height:125%;letter-spacing:0px;word-spacing:0px;fill:#000000;fill-opacity:1;stroke:none;font-family:Sans">
      <path
         d="M 15.56,-28.24 C 15.559984,-28.239972 15.559984,-28.186638 15.56,-28.08 15.559984,-27.546639 15.413318,-27.10664 15.12,-26.76 14.826652,-26.413307 14.493319,-26.173307 14.12,-26.04 13.746653,-25.933307 13.41332,-25.759974 13.12,-25.52 12.826654,-25.306641 12.679987,-25.026642 12.68,-24.68 L 12.68,-24.28 C 12.679987,-24.066643 12.599987,-23.866643 12.44,-23.68 12.279988,-23.519976 12.093321,-23.439977 11.88,-23.44 11.666655,-23.439977 11.479989,-23.519976 11.32,-23.68 11.159989,-23.866643 11.079989,-24.066643 11.08,-24.28 L 11.08,-24.68 C 11.079989,-25.266641 11.226655,-25.746641 11.52,-26.12 11.813322,-26.493307 12.133321,-26.733307 12.48,-26.84 12.826654,-26.973306 13.146654,-27.14664 13.44,-27.36 13.759986,-27.573306 13.933319,-27.839972 13.96,-28.16 13.906653,-29.59997 13.21332,-30.31997 11.88,-30.32 10.43999,-30.266636 9.7199903,-29.55997 9.72,-28.2 9.7199903,-27.986639 9.626657,-27.786639 9.44,-27.6 9.2799907,-27.439973 9.0933242,-27.359973 8.88,-27.36 8.666658,-27.359973 8.4666582,-27.439973 8.28,-27.6 8.1199919,-27.786639 8.039992,-27.986639 8.04,-28.2 8.039992,-29.293304 8.4133249,-30.19997 9.16,-30.92 9.9066568,-31.639968 10.786656,-31.999968 11.8,-32 L 11.88,-32 C 12.946654,-31.999968 13.826653,-31.626635 14.52,-30.88 15.213318,-30.133303 15.559984,-29.253304 15.56,-28.24 M 12.8,-20.88 12.8,-1.64 18.36,-1.64 C 19.106648,-1.6399984 19.479981,-1.373332 19.48,-0.84 19.479981,-0.27999972 19.106648,0 18.36,0 L 5.6,0 C 4.8799951,0 4.5199955,-0.27999972 4.52,-0.84 4.5199955,-1.373332 4.8799951,-1.6399984 5.6,-1.64 L 11.16,-1.64 11.16,-20.88 5.6,-20.88 C 4.8799951,-20.879979 4.5199955,-21.159979 4.52,-21.72 4.5199955,-22.253311 4.8799951,-22.519977 5.6,-22.52 L 18.36,-22.52 C 19.106648,-22.519977 19.479981,-22.253311 19.48,-21.72 19.479981,-21.159979 19.106648,-20.879979 18.36,-20.88 L 12.8,-20.88"
         id="path2986"
         style="font-variant:normal;font-stretch:normal;font-family:FreeMono;-inkscape-font-specification:FreeMono" />
    </g>
  </g>
</svg>
