<?xml version="1.0" encoding="UTF-8" standalone="no"?>
<!-- Created with Inkscape (http://www.inkscape.org/) -->

<svg
   xmlns:dc="http://purl.org/dc/elements/1.1/"
   xmlns:cc="http://creativecommons.org/ns#"
   xmlns:rdf="http://www.w3.org/1999/02/22-rdf-syntax-ns#"
   xmlns:svg="http://www.w3.org/2000/svg"
   xmlns="http://www.w3.org/2000/svg"
   version="1.1"
   width="24"
   height="40"
   id="svg3224">
  <metadata
     id="metadata8">
    <rdf:RDF>
      <cc:Work
         rdf:about="">
        <dc:format>image/svg+xml</dc:format>
        <dc:type
           rdf:resource="http://purl.org/dc/dcmitype/StillImage" />
        <dc:title></dc:title>
      </cc:Work>
    </rdf:RDF>
  </metadata>
  <defs
     id="defs3226" />
  <g
     transform="translate(0,31.26)"
     id="layer1">
    <g
       id="text4426"
       style="font-size:40px;font-style:normal;font-weight:normal;line-height:125%;letter-spacing:0px;word-spacing:0px;fill:#000000;fill-opacity:1;stroke:none;font-family:Sans">
      <path
         d="M 15.64,-23.96 C 15.639984,-23.959976 15.639984,-23.906643 15.64,-23.8 15.639984,-23.266643 15.493318,-22.826644 15.2,-22.48 14.906652,-22.133311 14.573319,-21.893311 14.2,-21.76 13.826653,-21.653312 13.49332,-21.479979 13.2,-21.24 12.906654,-21.026646 12.759987,-20.746646 12.76,-20.4 L 12.76,-20 C 12.759987,-19.786647 12.679987,-19.586647 12.52,-19.4 12.359988,-19.239981 12.173321,-19.159981 11.96,-19.16 11.746655,-19.159981 11.559988,-19.239981 11.4,-19.4 11.239989,-19.586647 11.159989,-19.786647 11.16,-20 L 11.16,-20.4 C 11.159989,-20.986646 11.306655,-21.466645 11.6,-21.84 11.893321,-22.213311 12.213321,-22.453311 12.56,-22.56 12.906654,-22.693311 13.226653,-22.866644 13.52,-23.08 13.839986,-23.29331 14.013319,-23.559976 14.04,-23.88 13.986653,-25.319975 13.29332,-26.039974 11.96,-26.04 10.519989,-25.986641 9.7999902,-25.279975 9.8,-23.92 9.7999902,-23.706643 9.706657,-23.506643 9.52,-23.32 9.3599906,-23.159977 9.1733242,-23.079977 8.96,-23.08 8.7466579,-23.079977 8.5466581,-23.159977 8.36,-23.32 8.1999918,-23.506643 8.1199919,-23.706643 8.12,-23.92 8.1199919,-25.013308 8.4933248,-25.919974 9.24,-26.64 9.9866567,-27.359973 10.866656,-27.719972 11.88,-27.72 L 11.96,-27.72 C 13.026654,-27.719972 13.906653,-27.346639 14.6,-26.6 15.293318,-25.853307 15.639984,-24.973308 15.64,-23.96 M 12.8,-16.68 12.8,-1.64 19.2,-1.64 C 19.946647,-1.6399984 20.31998,-1.373332 20.32,-0.84 20.31998,-0.27999972 19.946647,0 19.2,0 L 4.76,0 C 4.039996,0 3.6799963,-0.27999972 3.68,-0.84 3.6799963,-1.373332 4.039996,-1.6399984 4.76,-1.64 L 11.16,-1.64 11.16,-15.04 6.44,-15.04 C 5.7199943,-15.039985 5.3599946,-15.319985 5.36,-15.88 5.3599946,-16.413317 5.7199943,-16.679983 6.44,-16.68 L 12.8,-16.68"
         id="path2986"
         style="font-variant:normal;font-stretch:normal;font-family:FreeMono;-inkscape-font-specification:FreeMono" />
    </g>
  </g>
</svg>
