<?xml version="1.0" encoding="UTF-8" standalone="no"?>
<!-- Created with Inkscape (http://www.inkscape.org/) -->

<svg
   xmlns:dc="http://purl.org/dc/elements/1.1/"
   xmlns:cc="http://creativecommons.org/ns#"
   xmlns:rdf="http://www.w3.org/1999/02/22-rdf-syntax-ns#"
   xmlns:svg="http://www.w3.org/2000/svg"
   xmlns="http://www.w3.org/2000/svg"
   version="1.1"
   width="24"
   height="40"
   id="svg3224">
  <metadata
     id="metadata8">
    <rdf:RDF>
      <cc:Work
         rdf:about="">
        <dc:format>image/svg+xml</dc:format>
        <dc:type
           rdf:resource="http://purl.org/dc/dcmitype/StillImage" />
        <dc:title></dc:title>
      </cc:Work>
    </rdf:RDF>
  </metadata>
  <defs
     id="defs3226" />
  <g
     transform="translate(0,31.26)"
     id="layer1">
    <g
       id="text4426"
       style="font-size:40px;font-style:normal;font-weight:normal;line-height:125%;letter-spacing:0px;word-spacing:0px;fill:#000000;fill-opacity:1;stroke:none;font-family:Sans">
      <path
         d="M 35.097656,-14.375 C 35.097621,-10.820302 34.700486,-7.7213464 33.90625,-5.078125 33.0208,-2.0833313 31.152313,0.49479117 28.300781,2.65625 25.957005,4.4270789 22.988258,5.9635357 19.394531,7.265625 17.858055,7.8124922 16.178369,8.2356688 14.355469,8.5351563 L 12.460938,5.9375 C 14.257798,5.6249944 15.943994,5.1562448 17.519531,4.53125 20.188782,3.476559 22.591123,2.1158833 24.726562,0.44921875 23.385393,0.14973943 22.272113,-0.42317666 21.386719,-1.2695312 20.084615,-2.4934871 19.179668,-4.2317666 18.671875,-6.484375 18.164044,-4.2317666 17.259097,-2.4934871 15.957031,-1.2695312 14.641912,-0.04557287 13.033841,0.56640568 11.132813,0.56640625 8.3854083,0.56640568 6.2239521,-0.58593691 4.6484375,-2.890625 3.046872,-5.2343698 2.2460915,-9.0624909 2.2460938,-14.375 2.2460915,-16.992171 2.8971325,-20.058574 4.1992187,-23.574219 4.9674429,-25.644506 5.9570253,-27.506483 7.1679687,-29.160156 L 12.03125,-29.160156 C 10.937489,-28.24867 9.5117092,-25.703099 7.7539062,-21.523437 6.8815035,-19.453106 6.4453061,-17.226545 6.4453125,-14.84375 6.4453061,-10.846343 6.9140556,-8.1510335 7.8515625,-6.7578125 8.8020745,-5.3385363 10.091136,-4.6289016 11.71875,-4.6289062 13.203112,-4.6289016 14.414048,-5.3124947 15.351563,-6.6796875 16.276025,-8.0338461 16.738265,-9.99999 16.738281,-12.578125 L 16.738281,-17.285156 20.625,-17.285156 20.625,-12.578125 C 20.624979,-9.99999 21.080708,-8.0338461 21.992187,-6.6796875 22.903623,-5.3124947 24.114559,-4.6289016 25.625,-4.6289062 27.369764,-4.6289016 28.665336,-5.3385363 29.511719,-6.7578125 30.436167,-8.3072834 30.898407,-11.002593 30.898437,-14.84375 30.898407,-17.226545 30.462209,-19.453106 29.589844,-21.523437 27.832003,-25.703099 26.406224,-28.24867 25.3125,-29.160156 L 30.195312,-29.160156 C 31.43226,-27.46742 32.415332,-25.605443 33.144531,-23.574219 34.44658,-19.967428 35.097621,-16.901025 35.097656,-14.375"
         id="path4226"
         style="font-variant:normal;font-stretch:normal;font-family:FreeMono;-inkscape-font-specification:FreeMono" />
    </g>
  </g>
</svg>
