<?xml version="1.0" encoding="UTF-8" standalone="no"?>
<!-- Created with Inkscape (http://www.inkscape.org/) -->

<svg
   xmlns:dc="http://purl.org/dc/elements/1.1/"
   xmlns:cc="http://creativecommons.org/ns#"
   xmlns:rdf="http://www.w3.org/1999/02/22-rdf-syntax-ns#"
   xmlns:svg="http://www.w3.org/2000/svg"
   xmlns="http://www.w3.org/2000/svg"
   version="1.1"
   width="24"
   height="40"
   id="svg3224">
  <metadata
     id="metadata3167">
    <rdf:RDF>
      <cc:Work
         rdf:about="">
        <dc:format>image/svg+xml</dc:format>
        <dc:type
           rdf:resource="http://purl.org/dc/dcmitype/StillImage" />
        <dc:title></dc:title>
      </cc:Work>
    </rdf:RDF>
  </metadata>
  <defs
     id="defs3226" />
  <g
     transform="translate(0,31.26)"
     id="layer1">
    <g
       id="text4426"
       style="font-size:40px;font-style:normal;font-weight:normal;line-height:125%;letter-spacing:0px;word-spacing:0px;fill:#000000;fill-opacity:1;stroke:none;font-family:Sans">
      <path
         d="M 12.64,-14.16 C 11.599988,-14.159986 10.666656,-14.026653 9.84,-13.76 9.0133243,-13.49332 8.3466583,-13.21332 7.84,-12.92 7.333326,-12.653321 6.959993,-12.519987 6.72,-12.52 6.2133271,-12.519987 5.959994,-12.813321 5.96,-13.4 L 5.96,-24.16 17.24,-24.16 C 17.986649,-24.159976 18.359982,-23.893309 18.36,-23.36 18.359982,-22.799977 17.986649,-22.519977 17.24,-22.52 L 7.6,-22.52 7.6,-14.6 C 9.5466571,-15.399985 11.306655,-15.799984 12.88,-15.8 14.933318,-15.799984 16.62665,-15.066652 17.96,-13.6 19.293314,-12.133321 19.95998,-10.27999 19.96,-8.04 19.95998,-5.5066612 19.186647,-3.4266632 17.64,-1.8 16.119984,-0.1999998 14.173319,0.5999994 11.8,0.6 10.759989,0.5999994 9.7199903,0.43999956 8.68,0.12 7.666659,-0.1999998 6.8133265,-0.57333276 6.12,-1 5.4533279,-1.4533319 4.9066618,-1.8933314 4.48,-2.32 4.0533293,-2.7466639 3.8399962,-3.0666636 3.84,-3.28 3.8399962,-3.4933298 3.9199961,-3.6799963 4.08,-3.84 4.2399958,-3.999996 4.4266622,-4.0799959 4.64,-4.08 4.8266618,-4.0799959 5.1999948,-3.8266628 5.76,-3.32 6.3199937,-2.8133305 7.1199929,-2.3066644 8.16,-1.8 9.1999908,-1.293332 10.386656,-1.039999 11.72,-1.04 13.666653,-1.039999 15.253318,-1.6933316 16.48,-3 17.706649,-4.3066624 18.319982,-6.0133273 18.32,-8.12 18.319982,-9.9066568 17.786649,-11.359989 16.72,-12.48 15.679984,-13.599986 14.319986,-14.159986 12.64,-14.16"
         id="path4431"
         style="font-variant:normal;font-stretch:normal;font-family:FreeMono;-inkscape-font-specification:FreeMono" />
    </g>
  </g>
</svg>
