{
    "data": [
        {
            "id": "9802",
            "type": "dispatch_group",
            "attributes": {
                "priority": 1,
                "redirection_strategy": "random",
                "queuing_timeout": 60
            },
            "relationships": {
                "dispatchable": {
                    "data": {
                        "id": "1014",
                        "type": "team"
                    }
                }
            }
        }
    ]
}