{
    "data": [
        {
            "id": "9069",
            "type": "dispatch_group",
            "attributes": {
                "priority": 1,
                "redirection_strategy": "concurrent",
                "queuing_timeout": 0
            },
            "relationships": {
                "dispatchable": {
                    "data": {
                        "id": "41815",
                        "type": "user"
                    }
                }
            }
        },
        {
            "id": "9070",
            "type": "dispatch_group",
            "attributes": {
                "priority": 2,
                "redirection_strategy": "concurrent",
                "queuing_timeout": 0
            },
            "relationships": {
                "dispatchable": {
                    "data": {
                        "id": "41816",
                        "type": "user"
                    }
                }
            }
        },
        {
            "id": "9071",
            "type": "dispatch_group",
            "attributes": {
                "priority": 3,
                "redirection_strategy": "concurrent",
                "queuing_timeout": 0
            },
            "relationships": {
                "dispatchable": {
                    "data": {
                        "id": "41817",
                        "type": "user"
                    }
                }
            }
        },
        {
            "id": "9109",
            "type": "dispatch_group",
            "attributes": {
                "priority": 4,
                "redirection_strategy": "concurrent",
                "queuing_timeout": 20
            },
            "relationships": {
                "dispatchable": {
                    "data": {
                        "id": "1804",
                        "type": "team"
                    }
                }
            }
        }
    ]
}