0.0005397447938165767, 1.0032397961066226
0.010287806296371632, 1.003248476481959
0.020035867798926715, 1.0032571568572952
0.029783929301481826, 1.0032658372326313
0.039532313627912985, 1.0026902063921546
0.04928044686910721, 1.0025690398306435
0.05902850837166229, 1.0025777202059796
0.06877656987421732, 1.0025864005813159
0.0785246313767724, 1.002595080956652
0.0882728004872862, 1.0024089909267173
0.09802114894439778, 1.0018982835546641
0.10776921044695287, 1.0019069639300004
0.11751737955746666, 1.0017208739000656
0.12726572801457825, 1.0012101665280124
0.13701414821032903, 1.0005696122191121
0.14676281949131686, 0.999474593631246
0.156510450562037, 1.0002623556276662
0.16625933705894225, 0.9987777962292582
0.17600800833993002, 0.9976827776413921
0.18575606984248505, 0.9976914580167283
0.1955048846007511, 0.9963367455551677
0.2052537352283368, 0.9949171096251833
0.2149404629536037, 0.9825553115074088
0.22033408195256965, 0.9674895387636355
0.2245090531434384, 0.9495916832912616
0.2265560697768887, 0.9336915767462632
0.2284359409608096, 0.9173469560715483
0.23011839936625117, 0.9018750200000778
0.23190221987016996, 0.8811599079071564
0.23289817996697126, 0.8606943549189862
0.23425999853928697, 0.8423077895326082
0.2354800217058582, 0.8213385853113528
0.23621695687644617, 0.7998495629108733
0.23751441233881937, 0.7748248729848164
0.2390663976885133, 0.7459980567058164
0.2402083154117184, 0.7205815231589011
0.24046140933061194, 0.6999360754160944
0.24176306555017013, 0.6770292271066796
0.241863845921862, 0.6550167543444926
0.24326202203504288, 0.6372513228203033
0.24356723806075326, 0.6194769829513246
0.24379986554372152, 0.5994212387787061
0.24465312671114453, 0.5788185257432363
0.2454820937876958, 0.5398103394073988
0.246017638670812, 0.5587973332905168
0.2466830145488556, 0.5210124485770593
0.2472868665728748, 0.48117159823346656
0.24758075187908063, 0.500107880869671
0.2485594797416093, 0.4589862072686419
0.24943118858549074, 0.43172653317652976
0.25030286736746615, 0.40452127113414427
0.25110712105218747, 0.3771459113125516
0.2518811399750233, 0.3510288038367163
0.25347912520767446, 0.32296124702417717
0.2543127637189285, 0.294690926269375
0.2544907889768921, 0.2740720469622322
0.2555864540096064, 0.25136278219378394
0.25701434193276745, 0.22564754603410908
0.258738072829887, 0.19912319367642928
0.25976380214071865, 0.17569599821386905
0.2602582248416865, 0.15570000037121612
0.2620016590976589, 0.13517490615201022
0.2642926957369889, 0.11297001753603375
0.26601311043011094, 0.09244799441380813
0.26860775353060484, 0.07447731585319706
0.2717929120435535, 0.057007074082802145
0.27578937375816315, 0.04141137063947453
0.2855432614630542, 0.030874624786567217
0.2965659648575102, 0.01521005224966343
0.30504985830947917, 0.011934332757530752
0.3147989600223017, 0.010060232548581016
0.3245477389112482, 0.008770443555443874
0.334296410192236, 0.007675424967577671
0.3440449379959455, 0.006840100253406423
0.3537932864530571, 0.006329392881353257
0.36354159904084915, 0.0058836089777238865
0.37328980402068246, 0.005632595479365454
0.38303811660847453, 0.005186811575736083
0.39278617811102967, 0.005195491951072162
0.40253434722154346, 0.005009401921137524
0.41228248046273763, 0.004888235359626458
0.42203036261869487, 0.005221533077080842
0.4317783882519304, 0.005295136920840715
0.4415260910612896, 0.005953051980413404
0.45127379387064903, 0.006610967039986537
0.46102181950388454, 0.006684570883746188
0.4707697375291613, 0.006952945132777
0.48051751207715987, 0.007481013255502322
0.49026517901719957, 0.008203851783499028
0.5000124872640436, 0.009575924995732121
0.5097605487665987, 0.0095846053710682
0.5195082157066385, 0.010307443899064905
0.5292558826466782, 0.011030282427061167
0.5390034419787594, 0.01194789136032881
0.54875103718016, 0.012800576825172438
0.5584984889042823, 0.013912956163711021
0.5682458688897656, 0.015155182439096526
0.5779931053979706, 0.016657102588176986
0.5877400549516189, 0.018678410484646912
0.5974870403745868, 0.020634794912692822
0.607233667104359, 0.023240414024975564
0.6169801862261725, 0.026040803542529023
0.6267265618707077, 0.029100886933777437
0.6364724712140886, 0.03300497541453318
0.6462178783869953, 0.03781799245322026
0.6559626399121499, 0.0437996319235332
0.6657068275281912, 0.05082004688862485
0.6754505847123977, 0.058619543474800695
0.6851938397261303, 0.06732796861890744
0.6949367001773475, 0.07675055191567437
0.7046794171512866, 0.08643282908613581
0.714422098255906, 0.09618002972502149
0.7241651021844016, 0.10534291914809368
0.7339085365447319, 0.11372672695008235
0.743652760030093, 0.1206822184467502
0.753398310680278, 0.12523554161174277
0.7631449374100502, 0.12784116072402552
0.7728921021796159, 0.12947292780995312
0.782639661511697, 0.13039053674322054
0.7930516999888325, 0.13160089312816736
0.8003625488344911, 0.1319644824859998
0.8114984962838804, 0.13789959909103033
0.8258621461544179, 0.1396933334186088
0.8534864419562628, 0.1397179320791624
0.8855316090328252, 0.1379655235013144
0.9048681241209054, 0.13887321407574715
0.9264155668195558, 0.13800192951893386
0.9617746654459173, 0.13803341580444273
0.9993437077364266, 0.13806686998279583
