%YAML 1.1
%TAG !u! tag:unity3d.com,2011:
--- !u!114 &11400000
MonoBehaviour:
  m_ObjectHideFlags: 0
  m_CorrespondingSourceObject: {fileID: 0}
  m_PrefabInstance: {fileID: 0}
  m_PrefabAsset: {fileID: 0}
  m_GameObject: {fileID: 0}
  m_Enabled: 1
  m_EditorHideFlags: 0
  m_Script: {fileID: 11500000, guid: f44fcf52060c0424d9a479ed15ea3e72, type: 3}
  m_Name: SO01 - Lantern (twosided)
  m_EditorClassIdentifier: 
  id: 48
  constructName: Lantern (twosided)
  constructPrefab: {fileID: 7883204862716897412, guid: 2d9f1e6f81989ff4ba45191ca9f402af, type: 3}
  description: A double lantern.
  constructionCost: 10
  unlocked: 0
  researchCost: 100
  authorityBoost: 0
  prestigeBoost: 0
  researchTime: 18000
