﻿TextType;DisplayMode;Trait;Faction;Race;Job;String
shop;merchant;null;villager;human;merchant;Greetings, friend./Please take a look at my goods.
shop;merchant;null;villager;monster;merchant;Greetings, friend./Please take a look at my goods.
shop;merchant;null;neutral;human;merchant;Greetings./I am a merchant traveling from one place to another to sell my goods./Feel free to take a look.
shop;merchant;null;neutral;monster;merchant;Please do not be afraid by my looks!/I am a merchant traveling from one place to another. I greet you./Please take a look!
shop;merchant;miser;villager;human;merchant;It is a pleasure to meet you, beloved friend./Quality has its price. I only offer the best items on the whole island./Please take a look!
shop;merchant;miser;villager;monster;merchant;It is a pleasure to meet you, beloved friend./Quality has its price. I only offer the best items on the whole island./Please take a look!
shop;merchant;miser;neutral;human;merchant;Greetings, stranger./I am a merchant traveling from one place to another to sell my goods./Quality has its price. I only offer the best items on the whole island./Please take a look!
shop;merchant;miser;neutral;monster;merchant;Please do not be afraid by my looks!/I am a merchant traveling from one place to another. I greet you./Quality has its price. I only offer the best items on the whole island./Please take a look!
shop;merchant;generous;villager;human;merchant;Welcome to my shop, dear friend./It might not be much, but maybe there is something that fits your interests./Please take a look!
shop;merchant;generous;villager;monster;merchant;Welcome to my shop, dear friend./It might not be much, but maybe there is something that fits your interests./Please take a look!
shop;merchant;generous;neutral;human;merchant;Greetings./I am a merchant traveling from one place to another to sell my goods./It might not be much, but maybe there is something that fits your interests./Please take a look!
shop;merchant;generous;neutral;monster;merchant;Please do not be afraid by my looks!/I am a merchant traveling from one place to another. I greet you./It might not be much, but maybe there is something that fits your interests./Please take a look!
