%YAML 1.1
%TAG !u! tag:unity3d.com,2011:
--- !u!29 &1
OcclusionCullingSettings:
  m_ObjectHideFlags: 0
  serializedVersion: 2
  m_OcclusionBakeSettings:
    smallestOccluder: 5
    smallestHole: 0.25
    backfaceThreshold: 100
  m_SceneGUID: 00000000000000000000000000000000
  m_OcclusionCullingData: {fileID: 0}
--- !u!104 &2
RenderSettings:
  m_ObjectHideFlags: 0
  serializedVersion: 9
  m_Fog: 0
  m_FogColor: {r: 0.5, g: 0.5, b: 0.5, a: 1}
  m_FogMode: 3
  m_FogDensity: 0.01
  m_LinearFogStart: 0
  m_LinearFogEnd: 300
  m_AmbientSkyColor: {r: 0.212, g: 0.227, b: 0.259, a: 1}
  m_AmbientEquatorColor: {r: 0.114, g: 0.125, b: 0.133, a: 1}
  m_AmbientGroundColor: {r: 0.047, g: 0.043, b: 0.035, a: 1}
  m_AmbientIntensity: 1
  m_AmbientMode: 0
  m_SubtractiveShadowColor: {r: 0.42, g: 0.478, b: 0.627, a: 1}
  m_SkyboxMaterial: {fileID: 2100000, guid: 06766a6624e8d6046be3a173082e5815, type: 2}
  m_HaloStrength: 0.5
  m_FlareStrength: 1
  m_FlareFadeSpeed: 3
  m_HaloTexture: {fileID: 0}
  m_SpotCookie: {fileID: 10001, guid: 0000000000000000e000000000000000, type: 0}
  m_DefaultReflectionMode: 0
  m_DefaultReflectionResolution: 128
  m_ReflectionBounces: 1
  m_ReflectionIntensity: 1
  m_CustomReflection: {fileID: 0}
  m_Sun: {fileID: 0}
  m_IndirectSpecularColor: {r: 0.5652214, g: 0.63551104, b: 0.71968406, a: 1}
  m_UseRadianceAmbientProbe: 0
--- !u!157 &3
LightmapSettings:
  m_ObjectHideFlags: 0
  serializedVersion: 12
  m_GIWorkflowMode: 0
  m_GISettings:
    serializedVersion: 2
    m_BounceScale: 1
    m_IndirectOutputScale: 1
    m_AlbedoBoost: 1
    m_EnvironmentLightingMode: 0
    m_EnableBakedLightmaps: 1
    m_EnableRealtimeLightmaps: 1
  m_LightmapEditorSettings:
    serializedVersion: 12
    m_Resolution: 2
    m_BakeResolution: 40
    m_AtlasSize: 1024
    m_AO: 0
    m_AOMaxDistance: 1
    m_CompAOExponent: 1
    m_CompAOExponentDirect: 0
    m_ExtractAmbientOcclusion: 0
    m_Padding: 2
    m_LightmapParameters: {fileID: 0}
    m_LightmapsBakeMode: 1
    m_TextureCompression: 1
    m_FinalGather: 0
    m_FinalGatherFiltering: 1
    m_FinalGatherRayCount: 256
    m_ReflectionCompression: 2
    m_MixedBakeMode: 0
    m_BakeBackend: 1
    m_PVRSampling: 1
    m_PVRDirectSampleCount: 32
    m_PVRSampleCount: 500
    m_PVRBounces: 2
    m_PVREnvironmentSampleCount: 500
    m_PVREnvironmentReferencePointCount: 2048
    m_PVRFilteringMode: 2
    m_PVRDenoiserTypeDirect: 0
    m_PVRDenoiserTypeIndirect: 0
    m_PVRDenoiserTypeAO: 0
    m_PVRFilterTypeDirect: 0
    m_PVRFilterTypeIndirect: 0
    m_PVRFilterTypeAO: 0
    m_PVREnvironmentMIS: 0
    m_PVRCulling: 1
    m_PVRFilteringGaussRadiusDirect: 1
    m_PVRFilteringGaussRadiusIndirect: 5
    m_PVRFilteringGaussRadiusAO: 2
    m_PVRFilteringAtrousPositionSigmaDirect: 0.5
    m_PVRFilteringAtrousPositionSigmaIndirect: 2
    m_PVRFilteringAtrousPositionSigmaAO: 1
    m_ExportTrainingData: 0
    m_TrainingDataDestination: TrainingData
    m_LightProbeSampleCountMultiplier: 4
  m_LightingDataAsset: {fileID: 0}
  m_LightingSettings: {fileID: 4890085278179872738, guid: 80f3b2f1bca822b4b99dad1af6d9f992, type: 2}
--- !u!196 &4
NavMeshSettings:
  serializedVersion: 2
  m_ObjectHideFlags: 0
  m_BuildSettings:
    serializedVersion: 2
    agentTypeID: 0
    agentRadius: 0.5
    agentHeight: 2
    agentSlope: 45
    agentClimb: 0.4
    ledgeDropHeight: 0
    maxJumpAcrossDistance: 0
    minRegionArea: 2
    manualCellSize: 0
    cellSize: 0.16666667
    manualTileSize: 0
    tileSize: 256
    accuratePlacement: 0
    maxJobWorkers: 0
    preserveTilesOutsideBounds: 0
    debug:
      m_Flags: 0
  m_NavMeshData: {fileID: 0}
--- !u!1001 &84515571
PrefabInstance:
  m_ObjectHideFlags: 0
  serializedVersion: 2
  m_Modification:
    m_TransformParent: {fileID: 0}
    m_Modifications:
    - target: {fileID: 4700302584741114, guid: fb6e154907ded46479e5d7ff1c7ef748, type: 3}
      propertyPath: m_RootOrder
      value: 7
      objectReference: {fileID: 0}
    - target: {fileID: 4700302584741114, guid: fb6e154907ded46479e5d7ff1c7ef748, type: 3}
      propertyPath: m_LocalPosition.x
      value: -2.99
      objectReference: {fileID: 0}
    - target: {fileID: 4700302584741114, guid: fb6e154907ded46479e5d7ff1c7ef748, type: 3}
      propertyPath: m_LocalPosition.y
      value: 0
      objectReference: {fileID: 0}
    - target: {fileID: 4700302584741114, guid: fb6e154907ded46479e5d7ff1c7ef748, type: 3}
      propertyPath: m_LocalPosition.z
      value: 1.79
      objectReference: {fileID: 0}
    - target: {fileID: 4700302584741114, guid: fb6e154907ded46479e5d7ff1c7ef748, type: 3}
      propertyPath: m_LocalRotation.w
      value: 0.9705218
      objectReference: {fileID: 0}
    - target: {fileID: 4700302584741114, guid: fb6e154907ded46479e5d7ff1c7ef748, type: 3}
      propertyPath: m_LocalRotation.x
      value: -0
      objectReference: {fileID: 0}
    - target: {fileID: 4700302584741114, guid: fb6e154907ded46479e5d7ff1c7ef748, type: 3}
      propertyPath: m_LocalRotation.y
      value: -0.24101344
      objectReference: {fileID: 0}
    - target: {fileID: 4700302584741114, guid: fb6e154907ded46479e5d7ff1c7ef748, type: 3}
      propertyPath: m_LocalRotation.z
      value: -0
      objectReference: {fileID: 0}
    - target: {fileID: 4700302584741114, guid: fb6e154907ded46479e5d7ff1c7ef748, type: 3}
      propertyPath: m_LocalEulerAnglesHint.y
      value: -27.893002
      objectReference: {fileID: 0}
    - target: {fileID: 137658475978441774, guid: fb6e154907ded46479e5d7ff1c7ef748, type: 3}
      propertyPath: m_Materials.Array.data[0]
      value: 
      objectReference: {fileID: 2100000, guid: c932271491e32294cb6db9b7af6518bc, type: 2}
    m_RemovedComponents: []
  m_SourcePrefab: {fileID: 100100000, guid: fb6e154907ded46479e5d7ff1c7ef748, type: 3}
--- !u!1 &230699112
GameObject:
  m_ObjectHideFlags: 0
  m_CorrespondingSourceObject: {fileID: 0}
  m_PrefabInstance: {fileID: 0}
  m_PrefabAsset: {fileID: 0}
  serializedVersion: 6
  m_Component:
  - component: {fileID: 230699114}
  - component: {fileID: 230699113}
  m_Layer: 0
  m_Name: Directional Light
  m_TagString: Untagged
  m_Icon: {fileID: 0}
  m_NavMeshLayer: 0
  m_StaticEditorFlags: 0
  m_IsActive: 1
--- !u!108 &230699113
Light:
  m_ObjectHideFlags: 0
  m_CorrespondingSourceObject: {fileID: 0}
  m_PrefabInstance: {fileID: 0}
  m_PrefabAsset: {fileID: 0}
  m_GameObject: {fileID: 230699112}
  m_Enabled: 1
  serializedVersion: 10
  m_Type: 1
  m_Shape: 0
  m_Color: {r: 1, g: 1, b: 1, a: 1}
  m_Intensity: 1.2
  m_Range: 10
  m_SpotAngle: 30
  m_InnerSpotAngle: 21.80208
  m_CookieSize: 10
  m_Shadows:
    m_Type: 2
    m_Resolution: 3
    m_CustomResolution: -1
    m_Strength: 1
    m_Bias: 0.05
    m_NormalBias: 0
    m_NearPlane: 0.2
    m_CullingMatrixOverride:
      e00: 1
      e01: 0
      e02: 0
      e03: 0
      e10: 0
      e11: 1
      e12: 0
      e13: 0
      e20: 0
      e21: 0
      e22: 1
      e23: 0
      e30: 0
      e31: 0
      e32: 0
      e33: 1
    m_UseCullingMatrixOverride: 0
  m_Cookie: {fileID: 0}
  m_DrawHalo: 0
  m_Flare: {fileID: 0}
  m_RenderMode: 0
  m_CullingMask:
    serializedVersion: 2
    m_Bits: 4294967295
  m_RenderingLayerMask: 1
  m_Lightmapping: 4
  m_LightShadowCasterMode: 0
  m_AreaSize: {x: 1, y: 1}
  m_BounceIntensity: 1
  m_ColorTemperature: 6570
  m_UseColorTemperature: 0
  m_BoundingSphereOverride: {x: 0, y: 0, z: 0, w: 0}
  m_UseBoundingSphereOverride: 0
  m_UseViewFrustumForShadowCasterCull: 1
  m_ShadowRadius: 0
  m_ShadowAngle: 0
--- !u!4 &230699114
Transform:
  m_ObjectHideFlags: 0
  m_CorrespondingSourceObject: {fileID: 0}
  m_PrefabInstance: {fileID: 0}
  m_PrefabAsset: {fileID: 0}
  m_GameObject: {fileID: 230699112}
  m_LocalRotation: {x: -0.19890663, y: -0.8990729, z: 0.3144675, w: -0.23068225}
  m_LocalPosition: {x: 0.23, y: 4.57, z: 0}
  m_LocalScale: {x: 1, y: 1, z: 1}
  m_Children: []
  m_Father: {fileID: 0}
  m_RootOrder: 1
  m_LocalEulerAnglesHint: {x: 41.089, y: -202.605, z: 16.383001}
--- !u!1001 &249081477
PrefabInstance:
  m_ObjectHideFlags: 0
  serializedVersion: 2
  m_Modification:
    m_TransformParent: {fileID: 0}
    m_Modifications:
    - target: {fileID: 4240512476921092, guid: 3e08eaa99fbf41647adc835cdda0472a, type: 3}
      propertyPath: m_RootOrder
      value: 8
      objectReference: {fileID: 0}
    - target: {fileID: 4240512476921092, guid: 3e08eaa99fbf41647adc835cdda0472a, type: 3}
      propertyPath: m_LocalPosition.x
      value: -0.67
      objectReference: {fileID: 0}
    - target: {fileID: 4240512476921092, guid: 3e08eaa99fbf41647adc835cdda0472a, type: 3}
      propertyPath: m_LocalPosition.y
      value: 0
      objectReference: {fileID: 0}
    - target: {fileID: 4240512476921092, guid: 3e08eaa99fbf41647adc835cdda0472a, type: 3}
      propertyPath: m_LocalPosition.z
      value: 2.98
      objectReference: {fileID: 0}
    - target: {fileID: 4240512476921092, guid: 3e08eaa99fbf41647adc835cdda0472a, type: 3}
      propertyPath: m_LocalRotation.w
      value: 1
      objectReference: {fileID: 0}
    - target: {fileID: 4240512476921092, guid: 3e08eaa99fbf41647adc835cdda0472a, type: 3}
      propertyPath: m_LocalRotation.x
      value: 0
      objectReference: {fileID: 0}
    - target: {fileID: 4240512476921092, guid: 3e08eaa99fbf41647adc835cdda0472a, type: 3}
      propertyPath: m_LocalRotation.y
      value: 0
      objectReference: {fileID: 0}
    - target: {fileID: 4240512476921092, guid: 3e08eaa99fbf41647adc835cdda0472a, type: 3}
      propertyPath: m_LocalRotation.z
      value: 0
      objectReference: {fileID: 0}
    - target: {fileID: 137100833973790644, guid: 3e08eaa99fbf41647adc835cdda0472a, type: 3}
      propertyPath: m_Materials.Array.data[0]
      value: 
      objectReference: {fileID: 2100000, guid: c932271491e32294cb6db9b7af6518bc, type: 2}
    - target: {fileID: 137954045272837610, guid: 3e08eaa99fbf41647adc835cdda0472a, type: 3}
      propertyPath: m_Materials.Array.data[0]
      value: 
      objectReference: {fileID: 2100000, guid: c932271491e32294cb6db9b7af6518bc, type: 2}
    m_RemovedComponents: []
  m_SourcePrefab: {fileID: 100100000, guid: 3e08eaa99fbf41647adc835cdda0472a, type: 3}
--- !u!1 &256692394
GameObject:
  m_ObjectHideFlags: 0
  m_CorrespondingSourceObject: {fileID: 0}
  m_PrefabInstance: {fileID: 0}
  m_PrefabAsset: {fileID: 0}
  serializedVersion: 6
  m_Component:
  - component: {fileID: 256692399}
  - component: {fileID: 256692398}
  - component: {fileID: 256692396}
  - component: {fileID: 256692395}
  m_Layer: 0
  m_Name: Main Camera
  m_TagString: MainCamera
  m_Icon: {fileID: 0}
  m_NavMeshLayer: 0
  m_StaticEditorFlags: 0
  m_IsActive: 1
--- !u!81 &256692395
AudioListener:
  m_ObjectHideFlags: 0
  m_CorrespondingSourceObject: {fileID: 0}
  m_PrefabInstance: {fileID: 0}
  m_PrefabAsset: {fileID: 0}
  m_GameObject: {fileID: 256692394}
  m_Enabled: 1
--- !u!124 &256692396
Behaviour:
  m_ObjectHideFlags: 0
  m_CorrespondingSourceObject: {fileID: 0}
  m_PrefabInstance: {fileID: 0}
  m_PrefabAsset: {fileID: 0}
  m_GameObject: {fileID: 256692394}
  m_Enabled: 1
--- !u!20 &256692398
Camera:
  m_ObjectHideFlags: 0
  m_CorrespondingSourceObject: {fileID: 0}
  m_PrefabInstance: {fileID: 0}
  m_PrefabAsset: {fileID: 0}
  m_GameObject: {fileID: 256692394}
  m_Enabled: 1
  serializedVersion: 2
  m_ClearFlags: 2
  m_BackGroundColor: {r: 0.13965182, g: 0.20258133, b: 0.30147058, a: 0}
  m_projectionMatrixMode: 1
  m_GateFitMode: 2
  m_FOVAxisMode: 0
  m_SensorSize: {x: 36, y: 24}
  m_LensShift: {x: 0, y: 0}
  m_FocalLength: 50
  m_NormalizedViewPortRect:
    serializedVersion: 2
    x: 0
    y: 0
    width: 1
    height: 1
  near clip plane: 0.3
  far clip plane: 1000
  field of view: 20
  orthographic: 0
  orthographic size: 5
  m_Depth: -1
  m_CullingMask:
    serializedVersion: 2
    m_Bits: 4294967295
  m_RenderingPath: -1
  m_TargetTexture: {fileID: 0}
  m_TargetDisplay: 0
  m_TargetEye: 3
  m_HDR: 1
  m_AllowMSAA: 1
  m_AllowDynamicResolution: 0
  m_ForceIntoRT: 0
  m_OcclusionCulling: 1
  m_StereoConvergence: 10
  m_StereoSeparation: 0.022
--- !u!4 &256692399
Transform:
  m_ObjectHideFlags: 0
  m_CorrespondingSourceObject: {fileID: 0}
  m_PrefabInstance: {fileID: 0}
  m_PrefabAsset: {fileID: 0}
  m_GameObject: {fileID: 256692394}
  m_LocalRotation: {x: -0, y: -0.99582326, z: 0.091302454, w: 0}
  m_LocalPosition: {x: 0, y: 3.672, z: 15.132}
  m_LocalScale: {x: 1, y: 1, z: 1}
  m_Children: []
  m_Father: {fileID: 0}
  m_RootOrder: 0
  m_LocalEulerAnglesHint: {x: 10.477, y: -180.00002, z: 0}
--- !u!1001 &494360728
PrefabInstance:
  m_ObjectHideFlags: 0
  serializedVersion: 2
  m_Modification:
    m_TransformParent: {fileID: 0}
    m_Modifications:
    - target: {fileID: 4047972025199878, guid: e5bf32a70c2e58f4f9ec61dad9659a4b, type: 3}
      propertyPath: m_RootOrder
      value: 10
      objectReference: {fileID: 0}
    - target: {fileID: 4047972025199878, guid: e5bf32a70c2e58f4f9ec61dad9659a4b, type: 3}
      propertyPath: m_LocalPosition.x
      value: -1.22
      objectReference: {fileID: 0}
    - target: {fileID: 4047972025199878, guid: e5bf32a70c2e58f4f9ec61dad9659a4b, type: 3}
      propertyPath: m_LocalPosition.y
      value: 0
      objectReference: {fileID: 0}
    - target: {fileID: 4047972025199878, guid: e5bf32a70c2e58f4f9ec61dad9659a4b, type: 3}
      propertyPath: m_LocalPosition.z
      value: 4.38
      objectReference: {fileID: 0}
    - target: {fileID: 4047972025199878, guid: e5bf32a70c2e58f4f9ec61dad9659a4b, type: 3}
      propertyPath: m_LocalRotation.w
      value: 1
      objectReference: {fileID: 0}
    - target: {fileID: 4047972025199878, guid: e5bf32a70c2e58f4f9ec61dad9659a4b, type: 3}
      propertyPath: m_LocalRotation.x
      value: 0
      objectReference: {fileID: 0}
    - target: {fileID: 4047972025199878, guid: e5bf32a70c2e58f4f9ec61dad9659a4b, type: 3}
      propertyPath: m_LocalRotation.y
      value: 0
      objectReference: {fileID: 0}
    - target: {fileID: 4047972025199878, guid: e5bf32a70c2e58f4f9ec61dad9659a4b, type: 3}
      propertyPath: m_LocalRotation.z
      value: 0
      objectReference: {fileID: 0}
    - target: {fileID: 137218116663036162, guid: e5bf32a70c2e58f4f9ec61dad9659a4b, type: 3}
      propertyPath: m_Materials.Array.data[0]
      value: 
      objectReference: {fileID: 2100000, guid: c932271491e32294cb6db9b7af6518bc, type: 2}
    m_RemovedComponents: []
  m_SourcePrefab: {fileID: 100100000, guid: e5bf32a70c2e58f4f9ec61dad9659a4b, type: 3}
--- !u!1001 &529347429
PrefabInstance:
  m_ObjectHideFlags: 0
  serializedVersion: 2
  m_Modification:
    m_TransformParent: {fileID: 0}
    m_Modifications:
    - target: {fileID: 4333204578251230, guid: ebf2cc118768d314988702254deb07a7, type: 3}
      propertyPath: m_RootOrder
      value: 9
      objectReference: {fileID: 0}
    - target: {fileID: 4333204578251230, guid: ebf2cc118768d314988702254deb07a7, type: 3}
      propertyPath: m_LocalPosition.x
      value: 1.07
      objectReference: {fileID: 0}
    - target: {fileID: 4333204578251230, guid: ebf2cc118768d314988702254deb07a7, type: 3}
      propertyPath: m_LocalPosition.y
      value: 0
      objectReference: {fileID: 0}
    - target: {fileID: 4333204578251230, guid: ebf2cc118768d314988702254deb07a7, type: 3}
      propertyPath: m_LocalPosition.z
      value: 4.25
      objectReference: {fileID: 0}
    - target: {fileID: 4333204578251230, guid: ebf2cc118768d314988702254deb07a7, type: 3}
      propertyPath: m_LocalRotation.w
      value: 1
      objectReference: {fileID: 0}
    - target: {fileID: 4333204578251230, guid: ebf2cc118768d314988702254deb07a7, type: 3}
      propertyPath: m_LocalRotation.x
      value: 0
      objectReference: {fileID: 0}
    - target: {fileID: 4333204578251230, guid: ebf2cc118768d314988702254deb07a7, type: 3}
      propertyPath: m_LocalRotation.y
      value: 0
      objectReference: {fileID: 0}
    - target: {fileID: 4333204578251230, guid: ebf2cc118768d314988702254deb07a7, type: 3}
      propertyPath: m_LocalRotation.z
      value: 0
      objectReference: {fileID: 0}
    - target: {fileID: 137309407090830218, guid: ebf2cc118768d314988702254deb07a7, type: 3}
      propertyPath: m_Materials.Array.data[0]
      value: 
      objectReference: {fileID: 2100000, guid: c932271491e32294cb6db9b7af6518bc, type: 2}
    - target: {fileID: 137323584463933184, guid: ebf2cc118768d314988702254deb07a7, type: 3}
      propertyPath: m_Materials.Array.data[0]
      value: 
      objectReference: {fileID: 2100000, guid: c932271491e32294cb6db9b7af6518bc, type: 2}
    - target: {fileID: 137487291929330776, guid: ebf2cc118768d314988702254deb07a7, type: 3}
      propertyPath: m_Materials.Array.data[0]
      value: 
      objectReference: {fileID: 2100000, guid: c932271491e32294cb6db9b7af6518bc, type: 2}
    m_RemovedComponents: []
  m_SourcePrefab: {fileID: 100100000, guid: ebf2cc118768d314988702254deb07a7, type: 3}
--- !u!1001 &530225395
PrefabInstance:
  m_ObjectHideFlags: 0
  serializedVersion: 2
  m_Modification:
    m_TransformParent: {fileID: 0}
    m_Modifications:
    - target: {fileID: 4258366756040210, guid: 33eba0da32885b84ebf38245df0735fa, type: 3}
      propertyPath: m_RootOrder
      value: 4
      objectReference: {fileID: 0}
    - target: {fileID: 4258366756040210, guid: 33eba0da32885b84ebf38245df0735fa, type: 3}
      propertyPath: m_LocalPosition.x
      value: 1.98
      objectReference: {fileID: 0}
    - target: {fileID: 4258366756040210, guid: 33eba0da32885b84ebf38245df0735fa, type: 3}
      propertyPath: m_LocalPosition.y
      value: 0.7
      objectReference: {fileID: 0}
    - target: {fileID: 4258366756040210, guid: 33eba0da32885b84ebf38245df0735fa, type: 3}
      propertyPath: m_LocalPosition.z
      value: -1.51
      objectReference: {fileID: 0}
    - target: {fileID: 4258366756040210, guid: 33eba0da32885b84ebf38245df0735fa, type: 3}
      propertyPath: m_LocalRotation.w
      value: 0.99501276
      objectReference: {fileID: 0}
    - target: {fileID: 4258366756040210, guid: 33eba0da32885b84ebf38245df0735fa, type: 3}
      propertyPath: m_LocalRotation.x
      value: -0
      objectReference: {fileID: 0}
    - target: {fileID: 4258366756040210, guid: 33eba0da32885b84ebf38245df0735fa, type: 3}
      propertyPath: m_LocalRotation.y
      value: 0.09974822
      objectReference: {fileID: 0}
    - target: {fileID: 4258366756040210, guid: 33eba0da32885b84ebf38245df0735fa, type: 3}
      propertyPath: m_LocalRotation.z
      value: -0
      objectReference: {fileID: 0}
    - target: {fileID: 4258366756040210, guid: 33eba0da32885b84ebf38245df0735fa, type: 3}
      propertyPath: m_LocalEulerAnglesHint.y
      value: 11.449
      objectReference: {fileID: 0}
    - target: {fileID: 137258613991233548, guid: 33eba0da32885b84ebf38245df0735fa, type: 3}
      propertyPath: m_Materials.Array.data[0]
      value: 
      objectReference: {fileID: 2100000, guid: c932271491e32294cb6db9b7af6518bc, type: 2}
    m_RemovedComponents: []
  m_SourcePrefab: {fileID: 100100000, guid: 33eba0da32885b84ebf38245df0735fa, type: 3}
--- !u!1001 &572367186
PrefabInstance:
  m_ObjectHideFlags: 0
  serializedVersion: 2
  m_Modification:
    m_TransformParent: {fileID: 0}
    m_Modifications:
    - target: {fileID: 4191744185429214, guid: 45f36e2270151a542be4982f9f1dd581, type: 3}
      propertyPath: m_RootOrder
      value: 6
      objectReference: {fileID: 0}
    - target: {fileID: 4191744185429214, guid: 45f36e2270151a542be4982f9f1dd581, type: 3}
      propertyPath: m_LocalPosition.x
      value: 0.35
      objectReference: {fileID: 0}
    - target: {fileID: 4191744185429214, guid: 45f36e2270151a542be4982f9f1dd581, type: 3}
      propertyPath: m_LocalPosition.y
      value: 0
      objectReference: {fileID: 0}
    - target: {fileID: 4191744185429214, guid: 45f36e2270151a542be4982f9f1dd581, type: 3}
      propertyPath: m_LocalPosition.z
      value: 0.35
      objectReference: {fileID: 0}
    - target: {fileID: 4191744185429214, guid: 45f36e2270151a542be4982f9f1dd581, type: 3}
      propertyPath: m_LocalRotation.w
      value: 0.99525744
      objectReference: {fileID: 0}
    - target: {fileID: 4191744185429214, guid: 45f36e2270151a542be4982f9f1dd581, type: 3}
      propertyPath: m_LocalRotation.x
      value: -0
      objectReference: {fileID: 0}
    - target: {fileID: 4191744185429214, guid: 45f36e2270151a542be4982f9f1dd581, type: 3}
      propertyPath: m_LocalRotation.y
      value: 0.09727638
      objectReference: {fileID: 0}
    - target: {fileID: 4191744185429214, guid: 45f36e2270151a542be4982f9f1dd581, type: 3}
      propertyPath: m_LocalRotation.z
      value: -0
      objectReference: {fileID: 0}
    - target: {fileID: 4191744185429214, guid: 45f36e2270151a542be4982f9f1dd581, type: 3}
      propertyPath: m_LocalEulerAnglesHint.y
      value: 11.165001
      objectReference: {fileID: 0}
    - target: {fileID: 137972834962319166, guid: 45f36e2270151a542be4982f9f1dd581, type: 3}
      propertyPath: m_Materials.Array.data[0]
      value: 
      objectReference: {fileID: 2100000, guid: c932271491e32294cb6db9b7af6518bc, type: 2}
    m_RemovedComponents: []
  m_SourcePrefab: {fileID: 100100000, guid: 45f36e2270151a542be4982f9f1dd581, type: 3}
--- !u!1001 &626430555
PrefabInstance:
  m_ObjectHideFlags: 0
  serializedVersion: 2
  m_Modification:
    m_TransformParent: {fileID: 0}
    m_Modifications:
    - target: {fileID: 4544219117696442, guid: ad121b684e3934947a2d412b4202d8fd, type: 3}
      propertyPath: m_RootOrder
      value: 12
      objectReference: {fileID: 0}
    - target: {fileID: 4544219117696442, guid: ad121b684e3934947a2d412b4202d8fd, type: 3}
      propertyPath: m_LocalPosition.x
      value: -2.19
      objectReference: {fileID: 0}
    - target: {fileID: 4544219117696442, guid: ad121b684e3934947a2d412b4202d8fd, type: 3}
      propertyPath: m_LocalPosition.y
      value: 0
      objectReference: {fileID: 0}
    - target: {fileID: 4544219117696442, guid: ad121b684e3934947a2d412b4202d8fd, type: 3}
      propertyPath: m_LocalPosition.z
      value: 3.29
      objectReference: {fileID: 0}
    - target: {fileID: 4544219117696442, guid: ad121b684e3934947a2d412b4202d8fd, type: 3}
      propertyPath: m_LocalRotation.w
      value: 0.977872
      objectReference: {fileID: 0}
    - target: {fileID: 4544219117696442, guid: ad121b684e3934947a2d412b4202d8fd, type: 3}
      propertyPath: m_LocalRotation.x
      value: -0
      objectReference: {fileID: 0}
    - target: {fileID: 4544219117696442, guid: ad121b684e3934947a2d412b4202d8fd, type: 3}
      propertyPath: m_LocalRotation.y
      value: -0.20920435
      objectReference: {fileID: 0}
    - target: {fileID: 4544219117696442, guid: ad121b684e3934947a2d412b4202d8fd, type: 3}
      propertyPath: m_LocalRotation.z
      value: -0
      objectReference: {fileID: 0}
    - target: {fileID: 4544219117696442, guid: ad121b684e3934947a2d412b4202d8fd, type: 3}
      propertyPath: m_LocalEulerAnglesHint.y
      value: -24.151001
      objectReference: {fileID: 0}
    - target: {fileID: 137034519132871808, guid: ad121b684e3934947a2d412b4202d8fd, type: 3}
      propertyPath: m_Materials.Array.data[0]
      value: 
      objectReference: {fileID: 2100000, guid: c932271491e32294cb6db9b7af6518bc, type: 2}
    m_RemovedComponents: []
  m_SourcePrefab: {fileID: 100100000, guid: ad121b684e3934947a2d412b4202d8fd, type: 3}
--- !u!1001 &681869250
PrefabInstance:
  m_ObjectHideFlags: 0
  serializedVersion: 2
  m_Modification:
    m_TransformParent: {fileID: 0}
    m_Modifications:
    - target: {fileID: 4843028258353612, guid: a81cfdb3f3b757345a955fb9947163c8, type: 3}
      propertyPath: m_RootOrder
      value: 11
      objectReference: {fileID: 0}
    - target: {fileID: 4843028258353612, guid: a81cfdb3f3b757345a955fb9947163c8, type: 3}
      propertyPath: m_LocalPosition.x
      value: 2.27
      objectReference: {fileID: 0}
    - target: {fileID: 4843028258353612, guid: a81cfdb3f3b757345a955fb9947163c8, type: 3}
      propertyPath: m_LocalPosition.y
      value: 0
      objectReference: {fileID: 0}
    - target: {fileID: 4843028258353612, guid: a81cfdb3f3b757345a955fb9947163c8, type: 3}
      propertyPath: m_LocalPosition.z
      value: 2.93
      objectReference: {fileID: 0}
    - target: {fileID: 4843028258353612, guid: a81cfdb3f3b757345a955fb9947163c8, type: 3}
      propertyPath: m_LocalRotation.w
      value: 0.9879663
      objectReference: {fileID: 0}
    - target: {fileID: 4843028258353612, guid: a81cfdb3f3b757345a955fb9947163c8, type: 3}
      propertyPath: m_LocalRotation.x
      value: -0
      objectReference: {fileID: 0}
    - target: {fileID: 4843028258353612, guid: a81cfdb3f3b757345a955fb9947163c8, type: 3}
      propertyPath: m_LocalRotation.y
      value: 0.15466958
      objectReference: {fileID: 0}
    - target: {fileID: 4843028258353612, guid: a81cfdb3f3b757345a955fb9947163c8, type: 3}
      propertyPath: m_LocalRotation.z
      value: -0
      objectReference: {fileID: 0}
    - target: {fileID: 4843028258353612, guid: a81cfdb3f3b757345a955fb9947163c8, type: 3}
      propertyPath: m_LocalEulerAnglesHint.y
      value: 17.795
      objectReference: {fileID: 0}
    - target: {fileID: 137161293094253770, guid: a81cfdb3f3b757345a955fb9947163c8, type: 3}
      propertyPath: m_Materials.Array.data[0]
      value: 
      objectReference: {fileID: 2100000, guid: c932271491e32294cb6db9b7af6518bc, type: 2}
    m_RemovedComponents: []
  m_SourcePrefab: {fileID: 100100000, guid: a81cfdb3f3b757345a955fb9947163c8, type: 3}
--- !u!1001 &1425909871
PrefabInstance:
  m_ObjectHideFlags: 0
  serializedVersion: 2
  m_Modification:
    m_TransformParent: {fileID: 0}
    m_Modifications:
    - target: {fileID: 4744821207475892, guid: f397a44c833ad65409eba4bce5ea62ed, type: 3}
      propertyPath: m_RootOrder
      value: 5
      objectReference: {fileID: 0}
    - target: {fileID: 4744821207475892, guid: f397a44c833ad65409eba4bce5ea62ed, type: 3}
      propertyPath: m_LocalPosition.x
      value: 3.05
      objectReference: {fileID: 0}
    - target: {fileID: 4744821207475892, guid: f397a44c833ad65409eba4bce5ea62ed, type: 3}
      propertyPath: m_LocalPosition.y
      value: 0
      objectReference: {fileID: 0}
    - target: {fileID: 4744821207475892, guid: f397a44c833ad65409eba4bce5ea62ed, type: 3}
      propertyPath: m_LocalPosition.z
      value: 0.67
      objectReference: {fileID: 0}
    - target: {fileID: 4744821207475892, guid: f397a44c833ad65409eba4bce5ea62ed, type: 3}
      propertyPath: m_LocalRotation.w
      value: 0.9908077
      objectReference: {fileID: 0}
    - target: {fileID: 4744821207475892, guid: f397a44c833ad65409eba4bce5ea62ed, type: 3}
      propertyPath: m_LocalRotation.x
      value: -0
      objectReference: {fileID: 0}
    - target: {fileID: 4744821207475892, guid: f397a44c833ad65409eba4bce5ea62ed, type: 3}
      propertyPath: m_LocalRotation.y
      value: 0.13527781
      objectReference: {fileID: 0}
    - target: {fileID: 4744821207475892, guid: f397a44c833ad65409eba4bce5ea62ed, type: 3}
      propertyPath: m_LocalRotation.z
      value: -0
      objectReference: {fileID: 0}
    - target: {fileID: 4744821207475892, guid: f397a44c833ad65409eba4bce5ea62ed, type: 3}
      propertyPath: m_LocalEulerAnglesHint.y
      value: 15.549001
      objectReference: {fileID: 0}
    - target: {fileID: 137450648769502806, guid: f397a44c833ad65409eba4bce5ea62ed, type: 3}
      propertyPath: m_Materials.Array.data[0]
      value: 
      objectReference: {fileID: 2100000, guid: c932271491e32294cb6db9b7af6518bc, type: 2}
    m_RemovedComponents: []
  m_SourcePrefab: {fileID: 100100000, guid: f397a44c833ad65409eba4bce5ea62ed, type: 3}
--- !u!1001 &1452099569
PrefabInstance:
  m_ObjectHideFlags: 0
  serializedVersion: 2
  m_Modification:
    m_TransformParent: {fileID: 0}
    m_Modifications:
    - target: {fileID: 4158631881214898, guid: e2ce315c37e32fd4b9d2fd8f2d56a7d0, type: 3}
      propertyPath: m_RootOrder
      value: 3
      objectReference: {fileID: 0}
    - target: {fileID: 4158631881214898, guid: e2ce315c37e32fd4b9d2fd8f2d56a7d0, type: 3}
      propertyPath: m_LocalPosition.x
      value: -1.91
      objectReference: {fileID: 0}
    - target: {fileID: 4158631881214898, guid: e2ce315c37e32fd4b9d2fd8f2d56a7d0, type: 3}
      propertyPath: m_LocalPosition.y
      value: 0.83
      objectReference: {fileID: 0}
    - target: {fileID: 4158631881214898, guid: e2ce315c37e32fd4b9d2fd8f2d56a7d0, type: 3}
      propertyPath: m_LocalPosition.z
      value: 0.596
      objectReference: {fileID: 0}
    - target: {fileID: 4158631881214898, guid: e2ce315c37e32fd4b9d2fd8f2d56a7d0, type: 3}
      propertyPath: m_LocalRotation.w
      value: 0.9950882
      objectReference: {fileID: 0}
    - target: {fileID: 4158631881214898, guid: e2ce315c37e32fd4b9d2fd8f2d56a7d0, type: 3}
      propertyPath: m_LocalRotation.x
      value: -0
      objectReference: {fileID: 0}
    - target: {fileID: 4158631881214898, guid: e2ce315c37e32fd4b9d2fd8f2d56a7d0, type: 3}
      propertyPath: m_LocalRotation.y
      value: -0.09899227
      objectReference: {fileID: 0}
    - target: {fileID: 4158631881214898, guid: e2ce315c37e32fd4b9d2fd8f2d56a7d0, type: 3}
      propertyPath: m_LocalRotation.z
      value: -0
      objectReference: {fileID: 0}
    - target: {fileID: 4158631881214898, guid: e2ce315c37e32fd4b9d2fd8f2d56a7d0, type: 3}
      propertyPath: m_LocalEulerAnglesHint.y
      value: -11.362
      objectReference: {fileID: 0}
    - target: {fileID: 4355229462433280, guid: e2ce315c37e32fd4b9d2fd8f2d56a7d0, type: 3}
      propertyPath: m_LocalRotation.w
      value: 0.35738942
      objectReference: {fileID: 0}
    - target: {fileID: 4355229462433280, guid: e2ce315c37e32fd4b9d2fd8f2d56a7d0, type: 3}
      propertyPath: m_LocalRotation.x
      value: -0.559977
      objectReference: {fileID: 0}
    - target: {fileID: 4355229462433280, guid: e2ce315c37e32fd4b9d2fd8f2d56a7d0, type: 3}
      propertyPath: m_LocalRotation.y
      value: 0.2906102
      objectReference: {fileID: 0}
    - target: {fileID: 4355229462433280, guid: e2ce315c37e32fd4b9d2fd8f2d56a7d0, type: 3}
      propertyPath: m_LocalRotation.z
      value: 0.68865395
      objectReference: {fileID: 0}
    - target: {fileID: 137835192699026074, guid: e2ce315c37e32fd4b9d2fd8f2d56a7d0, type: 3}
      propertyPath: m_Materials.Array.data[0]
      value: 
      objectReference: {fileID: 2100000, guid: c932271491e32294cb6db9b7af6518bc, type: 2}
    m_RemovedComponents: []
  m_SourcePrefab: {fileID: 100100000, guid: e2ce315c37e32fd4b9d2fd8f2d56a7d0, type: 3}
--- !u!1001 &1663957114
PrefabInstance:
  m_ObjectHideFlags: 0
  serializedVersion: 2
  m_Modification:
    m_TransformParent: {fileID: 0}
    m_Modifications:
    - target: {fileID: 400000, guid: 38c7340d5facd7e47aa420b7a1f6d784, type: 3}
      propertyPath: m_RootOrder
      value: 2
      objectReference: {fileID: 0}
    - target: {fileID: 400000, guid: 38c7340d5facd7e47aa420b7a1f6d784, type: 3}
      propertyPath: m_LocalPosition.x
      value: 0
      objectReference: {fileID: 0}
    - target: {fileID: 400000, guid: 38c7340d5facd7e47aa420b7a1f6d784, type: 3}
      propertyPath: m_LocalPosition.y
      value: 33.86
      objectReference: {fileID: 0}
    - target: {fileID: 400000, guid: 38c7340d5facd7e47aa420b7a1f6d784, type: 3}
      propertyPath: m_LocalPosition.z
      value: -7.3
      objectReference: {fileID: 0}
    - target: {fileID: 400000, guid: 38c7340d5facd7e47aa420b7a1f6d784, type: 3}
      propertyPath: m_LocalRotation.w
      value: 0.7071068
      objectReference: {fileID: 0}
    - target: {fileID: 400000, guid: 38c7340d5facd7e47aa420b7a1f6d784, type: 3}
      propertyPath: m_LocalRotation.x
      value: 0
      objectReference: {fileID: 0}
    - target: {fileID: 400000, guid: 38c7340d5facd7e47aa420b7a1f6d784, type: 3}
      propertyPath: m_LocalRotation.y
      value: -0
      objectReference: {fileID: 0}
    - target: {fileID: 400000, guid: 38c7340d5facd7e47aa420b7a1f6d784, type: 3}
      propertyPath: m_LocalRotation.z
      value: -0.7071068
      objectReference: {fileID: 0}
    - target: {fileID: 2300000, guid: 38c7340d5facd7e47aa420b7a1f6d784, type: 3}
      propertyPath: m_Materials.Array.data[0]
      value: 
      objectReference: {fileID: 2100000, guid: 809e1de97d0710c40a3770a01457172a, type: 2}
    m_RemovedComponents: []
  m_SourcePrefab: {fileID: 100100000, guid: 38c7340d5facd7e47aa420b7a1f6d784, type: 3}
