%YAML 1.1
%TAG !u! tag:unity3d.com,2011:
--- !u!114 &11400000
MonoBehaviour:
  m_ObjectHideFlags: 0
  m_CorrespondingSourceObject: {fileID: 0}
  m_PrefabInstance: {fileID: 0}
  m_PrefabAsset: {fileID: 0}
  m_GameObject: {fileID: 0}
  m_Enabled: 1
  m_EditorHideFlags: 0
  m_Script: {fileID: 11500000, guid: f44fcf52060c0424d9a479ed15ea3e72, type: 3}
  m_Name: SO07 - Big Tree
  m_EditorClassIdentifier: 
  id: 82
  constructName: Big Tree 2
  constructPrefab: {fileID: 5968918418339468427, guid: 36ac32d761ab2104ba4a79e29dca14b2, type: 3}
  description: A big tree.
  constructionCost: 10
  unlocked: 0
  researchCost: 100
  unlockedFromStart: 0
  authorityBoost: 0
  prestigeBoost: 0
  researchTime: 18000
