%YAML 1.1
%TAG !u! tag:unity3d.com,2011:
--- !u!114 &11400000
MonoBehaviour:
  m_ObjectHideFlags: 0
  m_CorrespondingSourceObject: {fileID: 0}
  m_PrefabInstance: {fileID: 0}
  m_PrefabAsset: {fileID: 0}
  m_GameObject: {fileID: 0}
  m_Enabled: 1
  m_EditorHideFlags: 0
  m_Script: {fileID: 11500000, guid: f44fcf52060c0424d9a479ed15ea3e72, type: 3}
  m_Name: SO08 - Big Tree
  m_EditorClassIdentifier: 
  id: 83
  constructName: Big Tree 3
  constructPrefab: {fileID: 7829214169289248951, guid: 35f8c96fe27edb24987df6231a4079eb, type: 3}
  description: A big tree.
  constructionCost: 10
  unlocked: 0
  researchCost: 100
  unlockedFromStart: 0
  authorityBoost: 0
  prestigeBoost: 0
  researchTime: 18000
