%YAML 1.1
%TAG !u! tag:unity3d.com,2011:
--- !u!114 &11400000
MonoBehaviour:
  m_ObjectHideFlags: 0
  m_CorrespondingSourceObject: {fileID: 0}
  m_PrefabInstance: {fileID: 0}
  m_PrefabAsset: {fileID: 0}
  m_GameObject: {fileID: 0}
  m_Enabled: 1
  m_EditorHideFlags: 0
  m_Script: {fileID: 11500000, guid: f8f6889c92917fc4ba42f13ed7a5b090, type: 3}
  m_Name: '#00 - Prison - empty'
  m_EditorClassIdentifier: 
  sentences:
  - This prison is empty.
  - A villager defeating an enemy might escort him to prison, instead of leaving
    him there.
  textType: 0
  displayMode: 0
  trait: 0
  faction: 0
  raceType: 0
  job: 0
  id: -1
  fromFile: 
  sList: []
