%YAML 1.1
%TAG !u! tag:unity3d.com,2011:
--- !u!1 &1871128528075666237
GameObject:
  m_ObjectHideFlags: 0
  m_CorrespondingSourceObject: {fileID: 0}
  m_PrefabInstance: {fileID: 0}
  m_PrefabAsset: {fileID: 0}
  serializedVersion: 6
  m_Component:
  - component: {fileID: 2363656785700427972}
  - component: {fileID: 8026699459311784747}
  - component: {fileID: -3050966094836438582}
  m_Layer: 0
  m_Name: Prefab_StoneSmall_03
  m_TagString: Untagged
  m_Icon: {fileID: 0}
  m_NavMeshLayer: 0
  m_StaticEditorFlags: 0
  m_IsActive: 1
--- !u!4 &2363656785700427972
Transform:
  m_ObjectHideFlags: 0
  m_CorrespondingSourceObject: {fileID: 0}
  m_PrefabInstance: {fileID: 0}
  m_PrefabAsset: {fileID: 0}
  m_GameObject: {fileID: 1871128528075666237}
  m_LocalRotation: {x: 0, y: 0, z: 0, w: 1}
  m_LocalPosition: {x: 0, y: 0, z: 0}
  m_LocalScale: {x: 1, y: 1, z: 1}
  m_Children:
  - {fileID: 3887455187239315932}
  m_Father: {fileID: 0}
  m_RootOrder: 0
  m_LocalEulerAnglesHint: {x: 0, y: 0, z: 0}
--- !u!205 &8026699459311784747
LODGroup:
  m_ObjectHideFlags: 0
  m_CorrespondingSourceObject: {fileID: 0}
  m_PrefabInstance: {fileID: 0}
  m_PrefabAsset: {fileID: 0}
  m_GameObject: {fileID: 1871128528075666237}
  serializedVersion: 2
  m_LocalReferencePoint: {x: -0.055638313, y: 0.009010375, z: 0.0051929355}
  m_Size: 1.5462959
  m_FadeMode: 0
  m_AnimateCrossFading: 0
  m_LastLODIsBillboard: 0
  m_LODs:
  - screenRelativeHeight: 0.009856977
    fadeTransitionWidth: 0
    renderers:
    - renderer: {fileID: 3887455187237022524}
  m_Enabled: 1
--- !u!64 &-3050966094836438582
MeshCollider:
  m_ObjectHideFlags: 0
  m_CorrespondingSourceObject: {fileID: 0}
  m_PrefabInstance: {fileID: 0}
  m_PrefabAsset: {fileID: 0}
  m_GameObject: {fileID: 1871128528075666237}
  m_Material: {fileID: 0}
  m_IsTrigger: 0
  m_Enabled: 1
  serializedVersion: 4
  m_Convex: 0
  m_CookingOptions: 30
  m_Mesh: {fileID: 0}
--- !u!64 &3482529809357899176
MeshCollider:
  m_ObjectHideFlags: 0
  m_CorrespondingSourceObject: {fileID: 0}
  m_PrefabInstance: {fileID: 0}
  m_PrefabAsset: {fileID: 0}
  m_GameObject: {fileID: 3887455187239024124}
  m_Material: {fileID: 0}
  m_IsTrigger: 0
  m_Enabled: 1
  serializedVersion: 4
  m_Convex: 1
  m_CookingOptions: 30
  m_Mesh: {fileID: 4300000, guid: 2847afbbf21ac6049bf7057de7f67c78, type: 3}
--- !u!1001 &3887455187238925148
PrefabInstance:
  m_ObjectHideFlags: 0
  serializedVersion: 2
  m_Modification:
    m_TransformParent: {fileID: 2363656785700427972}
    m_Modifications:
    - target: {fileID: 100000, guid: 2847afbbf21ac6049bf7057de7f67c78, type: 3}
      propertyPath: m_Name
      value: SM_StoneSmall_03
      objectReference: {fileID: 0}
    - target: {fileID: 400000, guid: 2847afbbf21ac6049bf7057de7f67c78, type: 3}
      propertyPath: m_RootOrder
      value: 0
      objectReference: {fileID: 0}
    - target: {fileID: 400000, guid: 2847afbbf21ac6049bf7057de7f67c78, type: 3}
      propertyPath: m_LocalPosition.x
      value: 0
      objectReference: {fileID: 0}
    - target: {fileID: 400000, guid: 2847afbbf21ac6049bf7057de7f67c78, type: 3}
      propertyPath: m_LocalPosition.y
      value: 0
      objectReference: {fileID: 0}
    - target: {fileID: 400000, guid: 2847afbbf21ac6049bf7057de7f67c78, type: 3}
      propertyPath: m_LocalPosition.z
      value: 0
      objectReference: {fileID: 0}
    - target: {fileID: 400000, guid: 2847afbbf21ac6049bf7057de7f67c78, type: 3}
      propertyPath: m_LocalRotation.w
      value: 1
      objectReference: {fileID: 0}
    - target: {fileID: 400000, guid: 2847afbbf21ac6049bf7057de7f67c78, type: 3}
      propertyPath: m_LocalRotation.x
      value: -0
      objectReference: {fileID: 0}
    - target: {fileID: 400000, guid: 2847afbbf21ac6049bf7057de7f67c78, type: 3}
      propertyPath: m_LocalRotation.y
      value: -0
      objectReference: {fileID: 0}
    - target: {fileID: 400000, guid: 2847afbbf21ac6049bf7057de7f67c78, type: 3}
      propertyPath: m_LocalRotation.z
      value: -0
      objectReference: {fileID: 0}
    - target: {fileID: 400000, guid: 2847afbbf21ac6049bf7057de7f67c78, type: 3}
      propertyPath: m_LocalEulerAnglesHint.x
      value: 0
      objectReference: {fileID: 0}
    - target: {fileID: 400000, guid: 2847afbbf21ac6049bf7057de7f67c78, type: 3}
      propertyPath: m_LocalEulerAnglesHint.y
      value: 0
      objectReference: {fileID: 0}
    - target: {fileID: 400000, guid: 2847afbbf21ac6049bf7057de7f67c78, type: 3}
      propertyPath: m_LocalEulerAnglesHint.z
      value: 0
      objectReference: {fileID: 0}
    - target: {fileID: 2300000, guid: 2847afbbf21ac6049bf7057de7f67c78, type: 3}
      propertyPath: m_Materials.Array.data[0]
      value: 
      objectReference: {fileID: 2100000, guid: 0253e72aa799a5b4390ad67e84de6fda, type: 2}
    m_RemovedComponents: []
  m_SourcePrefab: {fileID: 100100000, guid: 2847afbbf21ac6049bf7057de7f67c78, type: 3}
--- !u!1 &3887455187239024124 stripped
GameObject:
  m_CorrespondingSourceObject: {fileID: 100000, guid: 2847afbbf21ac6049bf7057de7f67c78, type: 3}
  m_PrefabInstance: {fileID: 3887455187238925148}
  m_PrefabAsset: {fileID: 0}
--- !u!4 &3887455187239315932 stripped
Transform:
  m_CorrespondingSourceObject: {fileID: 400000, guid: 2847afbbf21ac6049bf7057de7f67c78, type: 3}
  m_PrefabInstance: {fileID: 3887455187238925148}
  m_PrefabAsset: {fileID: 0}
--- !u!23 &3887455187237022524 stripped
MeshRenderer:
  m_CorrespondingSourceObject: {fileID: 2300000, guid: 2847afbbf21ac6049bf7057de7f67c78, type: 3}
  m_PrefabInstance: {fileID: 3887455187238925148}
  m_PrefabAsset: {fileID: 0}
