%YAML 1.1
%TAG !u! tag:unity3d.com,2011:
--- !u!1 &5368476702559195904
GameObject:
  m_ObjectHideFlags: 0
  m_CorrespondingSourceObject: {fileID: 0}
  m_PrefabInstance: {fileID: 0}
  m_PrefabAsset: {fileID: 0}
  serializedVersion: 6
  m_Component:
  - component: {fileID: 5534267239469847643}
  m_Layer: 0
  m_Name: EVP05 - Fainted NPC
  m_TagString: Fainted
  m_Icon: {fileID: 0}
  m_NavMeshLayer: 0
  m_StaticEditorFlags: 0
  m_IsActive: 1
--- !u!4 &5534267239469847643
Transform:
  m_ObjectHideFlags: 0
  m_CorrespondingSourceObject: {fileID: 0}
  m_PrefabInstance: {fileID: 0}
  m_PrefabAsset: {fileID: 0}
  m_GameObject: {fileID: 5368476702559195904}
  m_LocalRotation: {x: 0, y: 0, z: 0, w: 1}
  m_LocalPosition: {x: 0, y: 0, z: 0}
  m_LocalScale: {x: 1, y: 1, z: 1}
  m_Children:
  - {fileID: 5307582217615904996}
  m_Father: {fileID: 0}
  m_RootOrder: 0
  m_LocalEulerAnglesHint: {x: 0, y: 0, z: 0}
--- !u!1001 &2940757071023092965
PrefabInstance:
  m_ObjectHideFlags: 0
  serializedVersion: 2
  m_Modification:
    m_TransformParent: {fileID: 5534267239469847643}
    m_Modifications:
    - target: {fileID: 1324187324648847291, guid: 83a385e2fb062f049a8c7e335dc0974f, type: 3}
      propertyPath: randomValues
      value: 1
      objectReference: {fileID: 0}
    - target: {fileID: 1324187324648847291, guid: 83a385e2fb062f049a8c7e335dc0974f, type: 3}
      propertyPath: randomFaction
      value: 0
      objectReference: {fileID: 0}
    - target: {fileID: 1324187324648847291, guid: 83a385e2fb062f049a8c7e335dc0974f, type: 3}
      propertyPath: randomRaceList.Array.size
      value: 9
      objectReference: {fileID: 0}
    - target: {fileID: 7018854651959288833, guid: 83a385e2fb062f049a8c7e335dc0974f, type: 3}
      propertyPath: m_RootOrder
      value: 0
      objectReference: {fileID: 0}
    - target: {fileID: 7018854651959288833, guid: 83a385e2fb062f049a8c7e335dc0974f, type: 3}
      propertyPath: m_LocalPosition.x
      value: 0
      objectReference: {fileID: 0}
    - target: {fileID: 7018854651959288833, guid: 83a385e2fb062f049a8c7e335dc0974f, type: 3}
      propertyPath: m_LocalPosition.y
      value: 0
      objectReference: {fileID: 0}
    - target: {fileID: 7018854651959288833, guid: 83a385e2fb062f049a8c7e335dc0974f, type: 3}
      propertyPath: m_LocalPosition.z
      value: 0
      objectReference: {fileID: 0}
    - target: {fileID: 7018854651959288833, guid: 83a385e2fb062f049a8c7e335dc0974f, type: 3}
      propertyPath: m_LocalRotation.w
      value: 1
      objectReference: {fileID: 0}
    - target: {fileID: 7018854651959288833, guid: 83a385e2fb062f049a8c7e335dc0974f, type: 3}
      propertyPath: m_LocalRotation.x
      value: -0
      objectReference: {fileID: 0}
    - target: {fileID: 7018854651959288833, guid: 83a385e2fb062f049a8c7e335dc0974f, type: 3}
      propertyPath: m_LocalRotation.y
      value: -0
      objectReference: {fileID: 0}
    - target: {fileID: 7018854651959288833, guid: 83a385e2fb062f049a8c7e335dc0974f, type: 3}
      propertyPath: m_LocalRotation.z
      value: -0
      objectReference: {fileID: 0}
    - target: {fileID: 7018854651959288833, guid: 83a385e2fb062f049a8c7e335dc0974f, type: 3}
      propertyPath: m_LocalEulerAnglesHint.x
      value: 0
      objectReference: {fileID: 0}
    - target: {fileID: 7018854651959288833, guid: 83a385e2fb062f049a8c7e335dc0974f, type: 3}
      propertyPath: m_LocalEulerAnglesHint.y
      value: 0
      objectReference: {fileID: 0}
    - target: {fileID: 7018854651959288833, guid: 83a385e2fb062f049a8c7e335dc0974f, type: 3}
      propertyPath: m_LocalEulerAnglesHint.z
      value: 0
      objectReference: {fileID: 0}
    - target: {fileID: 7018854651959288835, guid: 83a385e2fb062f049a8c7e335dc0974f, type: 3}
      propertyPath: m_Name
      value: NPC
      objectReference: {fileID: 0}
    - target: {fileID: 7508481467297655108, guid: 83a385e2fb062f049a8c7e335dc0974f, type: 3}
      propertyPath: faction
      value: 1
      objectReference: {fileID: 0}
    - target: {fileID: 7508481467297655108, guid: 83a385e2fb062f049a8c7e335dc0974f, type: 3}
      propertyPath: currentState
      value: 
      objectReference: {fileID: 4393928337727574813}
    - target: {fileID: 7508481467297655108, guid: 83a385e2fb062f049a8c7e335dc0974f, type: 3}
      propertyPath: currentTextType
      value: 11
      objectReference: {fileID: 0}
    - target: {fileID: 7508481467297655108, guid: 83a385e2fb062f049a8c7e335dc0974f, type: 3}
      propertyPath: currentDisplayMode
      value: 6
      objectReference: {fileID: 0}
    m_RemovedComponents: []
  m_SourcePrefab: {fileID: 100100000, guid: 83a385e2fb062f049a8c7e335dc0974f, type: 3}
--- !u!4 &5307582217615904996 stripped
Transform:
  m_CorrespondingSourceObject: {fileID: 7018854651959288833, guid: 83a385e2fb062f049a8c7e335dc0974f, type: 3}
  m_PrefabInstance: {fileID: 2940757071023092965}
  m_PrefabAsset: {fileID: 0}
--- !u!114 &4393928337727574813 stripped
MonoBehaviour:
  m_CorrespondingSourceObject: {fileID: 1456338827802765304, guid: 83a385e2fb062f049a8c7e335dc0974f, type: 3}
  m_PrefabInstance: {fileID: 2940757071023092965}
  m_PrefabAsset: {fileID: 0}
  m_GameObject: {fileID: 0}
  m_Enabled: 1
  m_EditorHideFlags: 0
  m_Script: {fileID: 11500000, guid: fc11f734286d11c46863316f50d6c0d8, type: 3}
  m_Name: 
  m_EditorClassIdentifier: 
