%YAML 1.1
%TAG !u! tag:unity3d.com,2011:
--- !u!1 &3225451240112203017
GameObject:
  m_ObjectHideFlags: 0
  m_CorrespondingSourceObject: {fileID: 0}
  m_PrefabInstance: {fileID: 0}
  m_PrefabAsset: {fileID: 0}
  serializedVersion: 6
  m_Component:
  - component: {fileID: 3225451240112306473}
  - component: {fileID: 1760659634186591007}
  m_Layer: 7
  m_Name: BO01 - Flower 1
  m_TagString: NoCollision
  m_Icon: {fileID: 0}
  m_NavMeshLayer: 0
  m_StaticEditorFlags: 0
  m_IsActive: 1
--- !u!4 &3225451240112306473
Transform:
  m_ObjectHideFlags: 0
  m_CorrespondingSourceObject: {fileID: 0}
  m_PrefabInstance: {fileID: 0}
  m_PrefabAsset: {fileID: 0}
  m_GameObject: {fileID: 3225451240112203017}
  m_LocalRotation: {x: 0.000000021855694, y: -0, z: -0, w: 1}
  m_LocalPosition: {x: 0, y: 0, z: 0}
  m_LocalScale: {x: 1, y: 1, z: 1}
  m_Children:
  - {fileID: 4920686365831629213}
  m_Father: {fileID: 0}
  m_RootOrder: 0
  m_LocalEulerAnglesHint: {x: 0, y: 0, z: 0}
--- !u!205 &1760659634186591007
LODGroup:
  m_ObjectHideFlags: 0
  m_CorrespondingSourceObject: {fileID: 0}
  m_PrefabInstance: {fileID: 0}
  m_PrefabAsset: {fileID: 0}
  m_GameObject: {fileID: 3225451240112203017}
  serializedVersion: 2
  m_LocalReferencePoint: {x: -0.025888503, y: 0.30056226, z: -0.01978527}
  m_Size: 0.6774957
  m_FadeMode: 0
  m_AnimateCrossFading: 0
  m_LastLODIsBillboard: 0
  m_LODs:
  - screenRelativeHeight: 0.008348713
    fadeTransitionWidth: 0
    renderers:
    - renderer: {fileID: 4920686365834054525}
  m_Enabled: 1
--- !u!1001 &4920686365832024861
PrefabInstance:
  m_ObjectHideFlags: 0
  serializedVersion: 2
  m_Modification:
    m_TransformParent: {fileID: 3225451240112306473}
    m_Modifications:
    - target: {fileID: 100000, guid: 19e6313ae11973f49acec97736950fd9, type: 3}
      propertyPath: m_Name
      value: SM_Flower_01_Unity
      objectReference: {fileID: 0}
    - target: {fileID: 100000, guid: 19e6313ae11973f49acec97736950fd9, type: 3}
      propertyPath: m_Layer
      value: 7
      objectReference: {fileID: 0}
    - target: {fileID: 400000, guid: 19e6313ae11973f49acec97736950fd9, type: 3}
      propertyPath: m_RootOrder
      value: 0
      objectReference: {fileID: 0}
    - target: {fileID: 400000, guid: 19e6313ae11973f49acec97736950fd9, type: 3}
      propertyPath: m_LocalPosition.x
      value: 0.0056092665
      objectReference: {fileID: 0}
    - target: {fileID: 400000, guid: 19e6313ae11973f49acec97736950fd9, type: 3}
      propertyPath: m_LocalPosition.y
      value: -0.000028664022
      objectReference: {fileID: 0}
    - target: {fileID: 400000, guid: 19e6313ae11973f49acec97736950fd9, type: 3}
      propertyPath: m_LocalPosition.z
      value: -0.00058624207
      objectReference: {fileID: 0}
    - target: {fileID: 400000, guid: 19e6313ae11973f49acec97736950fd9, type: 3}
      propertyPath: m_LocalRotation.w
      value: 1
      objectReference: {fileID: 0}
    - target: {fileID: 400000, guid: 19e6313ae11973f49acec97736950fd9, type: 3}
      propertyPath: m_LocalRotation.x
      value: 0.000000021855694
      objectReference: {fileID: 0}
    - target: {fileID: 400000, guid: 19e6313ae11973f49acec97736950fd9, type: 3}
      propertyPath: m_LocalRotation.y
      value: 0
      objectReference: {fileID: 0}
    - target: {fileID: 400000, guid: 19e6313ae11973f49acec97736950fd9, type: 3}
      propertyPath: m_LocalRotation.z
      value: -0
      objectReference: {fileID: 0}
    - target: {fileID: 400000, guid: 19e6313ae11973f49acec97736950fd9, type: 3}
      propertyPath: m_LocalEulerAnglesHint.x
      value: 0
      objectReference: {fileID: 0}
    - target: {fileID: 400000, guid: 19e6313ae11973f49acec97736950fd9, type: 3}
      propertyPath: m_LocalEulerAnglesHint.y
      value: 0
      objectReference: {fileID: 0}
    - target: {fileID: 400000, guid: 19e6313ae11973f49acec97736950fd9, type: 3}
      propertyPath: m_LocalEulerAnglesHint.z
      value: 0
      objectReference: {fileID: 0}
    m_RemovedComponents: []
  m_SourcePrefab: {fileID: 100100000, guid: 19e6313ae11973f49acec97736950fd9, type: 3}
--- !u!4 &4920686365831629213 stripped
Transform:
  m_CorrespondingSourceObject: {fileID: 400000, guid: 19e6313ae11973f49acec97736950fd9, type: 3}
  m_PrefabInstance: {fileID: 4920686365832024861}
  m_PrefabAsset: {fileID: 0}
--- !u!23 &4920686365834054525 stripped
MeshRenderer:
  m_CorrespondingSourceObject: {fileID: 2300000, guid: 19e6313ae11973f49acec97736950fd9, type: 3}
  m_PrefabInstance: {fileID: 4920686365832024861}
  m_PrefabAsset: {fileID: 0}
