%YAML 1.1
%TAG !u! tag:unity3d.com,2011:
--- !u!114 &11400000
MonoBehaviour:
  m_ObjectHideFlags: 0
  m_CorrespondingSourceObject: {fileID: 0}
  m_PrefabInstance: {fileID: 0}
  m_PrefabAsset: {fileID: 0}
  m_GameObject: {fileID: 0}
  m_Enabled: 1
  m_EditorHideFlags: 0
  m_Script: {fileID: 11500000, guid: f44fcf52060c0424d9a479ed15ea3e72, type: 3}
  m_Name: SO02 - Prison
  m_EditorClassIdentifier: 
  id: 15
  constructName: Prison Cell
  constructPrefab: {fileID: 7474410183734274417, guid: da6a0c06495616743af5cb01599f4b60, type: 3}
  description: Fainted enemies can be brought to prison!
  constructionCost: 75
  unlocked: 1
  researchCost: 100
  unlockedFromStart: 1
  authorityBoost: 0
  prestigeBoost: 0
  researchTime: 18000
