%YAML 1.1
%TAG !u! tag:unity3d.com,2011:
--- !u!114 &11400000
MonoBehaviour:
  m_ObjectHideFlags: 0
  m_CorrespondingSourceObject: {fileID: 0}
  m_PrefabInstance: {fileID: 0}
  m_PrefabAsset: {fileID: 0}
  m_GameObject: {fileID: 0}
  m_Enabled: 1
  m_EditorHideFlags: 0
  m_Script: {fileID: 11500000, guid: f44fcf52060c0424d9a479ed15ea3e72, type: 3}
  m_Name: SO02 - WoodenCornerLight
  m_EditorClassIdentifier: 
  id: 18
  constructName: Light Corner
  constructPrefab: {fileID: 4559488544915894952, guid: d3f8165953bef9f43802d9f276a2da6e, type: 3}
  description: This is a wodden wall corner.
  constructionCost: 8
  unlocked: 1
  researchCost: 100
  authorityBoost: 0
  prestigeBoost: 0
  researchTime: 18000
