%YAML 1.1
%TAG !u! tag:unity3d.com,2011:
--- !u!114 &11400000
MonoBehaviour:
  m_ObjectHideFlags: 0
  m_CorrespondingSourceObject: {fileID: 0}
  m_PrefabInstance: {fileID: 0}
  m_PrefabAsset: {fileID: 0}
  m_GameObject: {fileID: 0}
  m_Enabled: 1
  m_EditorHideFlags: 0
  m_Script: {fileID: 11500000, guid: f44fcf52060c0424d9a479ed15ea3e72, type: 3}
  m_Name: SO04 - Bush 5
  m_EditorClassIdentifier: 
  id: 55
  constructName: Bush 5 (medium)
  constructPrefab: {fileID: 1321743904771407827, guid: 3b704f9f5185ec644b2b85a02f7d91e1, type: 3}
  description: A medium bush.
  constructionCost: 10
  unlocked: 0
  researchCost: 100
  unlockedFromStart: 0
  authorityBoost: 0
  prestigeBoost: 0
  researchTime: 18000
