%YAML 1.1
%TAG !u! tag:unity3d.com,2011:
--- !u!114 &11400000
MonoBehaviour:
  m_ObjectHideFlags: 0
  m_PrefabParentObject: {fileID: 0}
  m_PrefabInternal: {fileID: 0}
  m_GameObject: {fileID: 0}
  m_Enabled: 1
  m_EditorHideFlags: 0
  m_Script: {fileID: 11500000, guid: f6cc665d8f4824635820c3d72582ffdd, type: 3}
  m_Name: InnerCocoon
  m_EditorClassIdentifier: 
  Parameter:
    VolumeTexture: {fileID: 11700000, guid: 1c3307d9401451742ba2ddfc4e0584d9, type: 2}
    Tiling: {x: 1, y: 1}
    Octave: 1.8
    Sculpture: 1
    Phase: -1
    Renderer: 3
    Ramp: 1
    RampTexture: {fileID: 2800000, guid: 88e9b2b6a6458484998e691106885a1f, type: 3}
    RampScale: 0.512
    RampOffset: -1
    RampStrength: 1
    Softness: 0.497
    Density: 0.483
    Dissolve: 0
    Transparency: 0.515
    Scale: 0.1
    ScrollVelocity: {x: 250, y: 1000, z: 250}
    Lighting: 0.273
    LightingQuality: 0
    ConstantLightPower: 0
    LightSmoothness: 0.394
    LightScattering: 0
    Shading: 0.045
    EdgeLighting: 0
    GlobalLighting: 0
    GlobalLightingRange: 0
    Shadow: 0
    ShadowSoftness: 0
    ShadowQuality: 0
    ShadowStrength: 0
    ShadowThreshold: 0
    ShadowColor: {r: 0, g: 0, b: 0, a: 0}
    Brightness: -0.27
    Contrast: 0.8
    Horizontal: 0
    RelativeHeight: 0
    HorizontalSoftnessTop: 0
    HorizontalSoftnessBottom: 0
    HorizontalSoftnessFigure: 0
    FromHeight: 500
    ToHeight: 0
    Thickness: 2762
    FromDistance: 286
    MaxDistance: 20000
    Iteration: 8
    Fade: 0.01
    Optimize: 0
    HeightFog: 1
    GroundHeight: 0
    HeightFogFromDistance: 107
    HeightFogRange: 1000
