%YAML 1.1
%TAG !u! tag:unity3d.com,2011:
--- !u!114 &11400000
MonoBehaviour:
  m_ObjectHideFlags: 0
  m_CorrespondingSourceObject: {fileID: 0}
  m_PrefabInstance: {fileID: 0}
  m_PrefabAsset: {fileID: 0}
  m_GameObject: {fileID: 0}
  m_Enabled: 1
  m_EditorHideFlags: 0
  m_Script: {fileID: 11500000, guid: f44fcf52060c0424d9a479ed15ea3e72, type: 3}
  m_Name: SO06 - Stone 7
  m_EditorClassIdentifier: 
  id: 73
  constructName: Stone 7
  constructPrefab: {fileID: 3549726890709437755, guid: 648f1305642dc3e4c92b9c646d3f5b9d, type: 3}
  description: Just a stone.
  constructionCost: 3
  unlocked: 0
  researchCost: 100
  authorityBoost: 0
  prestigeBoost: 0
  researchTime: 18000
