%YAML 1.1
%TAG !u! tag:unity3d.com,2011:
--- !u!114 &11400000
MonoBehaviour:
  m_ObjectHideFlags: 0
  m_CorrespondingSourceObject: {fileID: 0}
  m_PrefabInstance: {fileID: 0}
  m_PrefabAsset: {fileID: 0}
  m_GameObject: {fileID: 0}
  m_Enabled: 1
  m_EditorHideFlags: 0
  m_Script: {fileID: 11500000, guid: f44fcf52060c0424d9a479ed15ea3e72, type: 3}
  m_Name: SO05 - Small Tree
  m_EditorClassIdentifier: 
  id: 80
  constructName: Small Tree 6
  constructPrefab: {fileID: 2010699808839454912, guid: 5af2bb1eadf98664d8984a5d81d3317e, type: 3}
  description: A small tree.
  constructionCost: 5
  unlocked: 0
  researchCost: 100
  unlockedFromStart: 0
  authorityBoost: 0
  prestigeBoost: 0
  researchTime: 18000
