{
  "projectType": "library",
  "root": "libs/feature-dashboard",
  "sourceRoot": "libs/feature-dashboard/src",
  "prefix": "frontend-coding-challenge",
  "targets": {
    "test": {
      "executor": "@nrwl/jest:jest",
      "outputs": ["coverage/libs/feature-dashboard"],
      "options": {
        "jestConfig": "libs/feature-dashboard/jest.config.js",
        "passWithNoTests": true
      }
    },
    "lint": {
      "executor": "@nrwl/linter:eslint",
      "options": {
        "lintFilePatterns": [
          "libs/feature-dashboard/src/**/*.ts",
          "libs/feature-dashboard/src/**/*.html"
        ]
      }
    }
  },
  "tags": []
}
