.........
----------------------------------------------------------------------
Ran 9 tests in 0.001s

OK
Name               Stmts   Miss Branch BrPart  Cover   Missing
--------------------------------------------------------------
Diplomacy.py          86      5     54      6    92%   23->26, 67, 86, 101->98, 143->139, 165, 167-168
TestDiplomacy.py      57      0      2      0   100%
--------------------------------------------------------------
TOTAL                143      5     56      6    94%
