...
----------------------------------------------------------------------
Ran 3 tests in 0.001s

OK
Name               Stmts   Miss Branch BrPart  Cover   Missing
--------------------------------------------------------------
Diplomacy.py          55      1     38      2    97%   47->50, 73
TestDiplomacy.py      19      0      0      0   100%
--------------------------------------------------------------
TOTAL                 74      1     38      2    97%
