.....
----------------------------------------------------------------------
Ran 5 tests in 0.001s

OK
Name               Stmts   Miss Branch BrPart  Cover   Missing
--------------------------------------------------------------
Diplomacy.py         120      0     53      0   100%
TestDiplomacy.py      34      0      0      0   100%
--------------------------------------------------------------
TOTAL                154      0     53      0   100%
