Name               Stmts   Miss Branch BrPart  Cover   Missing
--------------------------------------------------------------
Diplomacy.py          77      0     50      0   100%
TestDiplomacy.py      69      0      2      0   100%
--------------------------------------------------------------
TOTAL                146      0     52      0   100%
