...
----------------------------------------------------------------------
Ran 3 tests in 0.000s

OK
Name               Stmts   Miss Branch BrPart  Cover   Missing
--------------------------------------------------------------
Diplomacy.py         105      5     42      1    96%   10, 16, 37, 41, 63
TestDiplomacy.py      20      0      4      1    96%   48->exit
--------------------------------------------------------------
TOTAL                125      5     46      2    96%
