...........
----------------------------------------------------------------------
Ran 11 tests in 0.002s

OK
Name               Stmts   Miss Branch BrPart  Cover   Missing
--------------------------------------------------------------
Diplomacy.py          96      4     46      4    94%   62->55, 78, 84-86, 96->88
TestDiplomacy.py      50      0      0      0   100%
--------------------------------------------------------------
TOTAL                146      4     46      4    96%
