(module MOELLER_FAZ_BREAKER (layer F.Cu) (tedit 581563D4)
  (fp_text reference REF** (at 0 4) (layer F.SilkS)
    (effects (font (size 1 1) (thickness 0.15)))
  )
  (fp_text value MOELLER_FAZ_BREAKER (at 0 -0.5) (layer F.Fab)
    (effects (font (size 1 1) (thickness 0.15)))
  )
  (fp_line (start -8 -48) (end 8 -48) (layer F.SilkS) (width 0.15))
  (fp_line (start 8 -48) (end 8 48) (layer F.SilkS) (width 0.15))
  (fp_line (start 8 48) (end -8 48) (layer F.SilkS) (width 0.15))
  (fp_line (start -8 48) (end -8 -48) (layer F.SilkS) (width 0.15))
  (pad 1 thru_hole circle (at 0 -39) (size 8 8) (drill 7) (layers *.Cu *.Mask))
  (pad 2 thru_hole circle (at 0 41) (size 8 8) (drill 7) (layers *.Cu *.Mask))
)
