(module Transformer-0.75kva (layer F.Cu) (tedit 582DFB2D)
  (fp_text reference REF** (at 0 0.5) (layer F.SilkS)
    (effects (font (size 1 1) (thickness 0.15)))
  )
  (fp_text value Transformer-0.75kva (at 0 -0.5) (layer F.Fab)
    (effects (font (size 1 1) (thickness 0.15)))
  )
  (fp_line (start 58.482472 -85.894431) (end 58.482472 -98.594431) (layer F.SilkS) (width 2.54))
  (fp_line (start -62.167528 -85.894431) (end 58.482472 -85.894431) (layer F.SilkS) (width 2.54))
  (fp_line (start -62.167528 -85.894431) (end -62.167528 -98.594431) (layer F.SilkS) (width 2.54))
  (fp_line (start -62.167528 -98.594431) (end 58.482472 -98.594431) (layer F.SilkS) (width 2.54))
  (fp_line (start -60.580028 -85.894431) (end -60.580028 110.955569) (layer F.SilkS) (width 2.54))
  (fp_line (start 56.894972 110.955569) (end 56.894972 -85.894431) (layer F.SilkS) (width 2.54))
  (fp_line (start -60.580028 110.955569) (end 56.894972 110.955569) (layer F.SilkS) (width 2.54))
  (pad 1 thru_hole circle (at -48.26 101.6) (size 6.35 6.35) (drill 5.08) (layers *.Cu *.Mask))
  (pad 2 thru_hole circle (at -33.02 101.6) (size 6.35 6.35) (drill 5.08) (layers *.Cu *.Mask))
  (pad 3 thru_hole circle (at -17.78 101.6) (size 6.35 6.35) (drill 5.08) (layers *.Cu *.Mask))
  (pad 4 thru_hole circle (at -2.54 101.6) (size 6.35 6.35) (drill 5.08) (layers *.Cu *.Mask))
  (pad 5 thru_hole circle (at 12.7 101.6) (size 6.35 6.35) (drill 5.08) (layers *.Cu *.Mask))
  (pad 6 thru_hole circle (at 27.94 101.6) (size 6.35 6.35) (drill 5.08) (layers *.Cu *.Mask))
)
