{
  "general": {
    "locale": "fr-CH"
  },
  "gmfauth": {
    "url": "https://sitn.ne.ch"
  },
  "languages": {
    "translations": {
      "fr": ["i18n/fr.json", "https://sitn.ne.ch/static/dummy/fr.json"]
    },
    "defaultLanguage": "fr"
  },
  "interface": {
    "defaultSelectionComponent": "grid"
  },
  "themes": {
    "url": "https://sitn.ne.ch/themes?background=desktop_background&interface=desktop",
    "defaultTheme": "main"
  },
  "basemaps": {
    "show": false,
    "defaultBasemap": "OpenStreetMap",
    "OSM": false,
    "SwissTopoVectorTiles": false
  },
  "search": {
    "url": "https://sitn.ne.ch/search?limit=100&partitionlimit=40&interface=desktop&query=###SEARCHTERM###&lang=fr",
    "objectPreview": true,
    "layerPreview": true
  },
  "print": {
    "url": "https://sitn.ne.ch/printproxy/",
    "defaultLayout": "1 A4 paysage"
  },
  "lidar": {
    "url": "https://sitn.ne.ch/pytree"
  },
  "share": {
    "service": "lstu",
    "createUrl": "https://lstu.fr/a"
  },
  "projections": {
    "EPSG:3857": "W-M",
    "EPSG:4326": "WGS84",
    "EPSG:2056": "MN95"
  },
  "map": {
    "srid": "EPSG:2056",
    "startZoom": "1",
    "startPosition": "2535300,1206630",
    "maxExtent": "2420000,1030000,2900000,1360000",
    "scales": [1000000, 400000, 200000, 80000, 40000, 20000, 10000, 8000, 6000, 4000, 2000, 1000, 500, 250, 100, 50]
  },
  "map3d": {
    "terrainUrl": "https://terrain100.geo.admin.ch/1.0.0/ch.swisstopo.terrain.3d/",
    "terrainImagery": {
      "url": "https://wmts20.geo.admin.ch/1.0.0/ch.swisstopo.swissimage-product/default/current/4326/{z}/{x}/{y}.jpeg",
      "minLoD": 8,
      "maxLoD": 17,
      "coverageArea": [5.013926957923385, 45.35600133779394, 11.477436312994008, 48.27502358353741]
    },
    "tilesetsUrls": [
      "https://sitn.ne.ch/3dtiles/chaux81123/Production_1_pro_tie_3d_cesium.json",
      "https://sitn.ne.ch/3dtiles/le_locle_ouest/LeLocle_objmCesium3DTiles.json",
      "https://sitn.ne.ch/3dtiles/vdt/P1_cesium/patch1_cesium.json",
      "https://sitn.ne.ch/3dtiles/vdt/P2_cesium/patch2_cesium.json",
      "https://sitn.ne.ch/3dtiles/vdt/P3_cesium/patch3_cesium.json",
      "https://sitn.ne.ch/3dtiles/vdt/P4_cesium/patch4_cesium.json",
      "https://sitn.ne.ch/3dtiles/vdt/P5_cesium/patch5_cesium.json",
      "https://sitn.ne.ch/3dtiles/vdt/P6_Est_cesium/est_cesium.json",
      "https://sitn.ne.ch/3dtiles/vdt/P6_Ouest_cesium/ouest_cesium.json",
      "https://uzuflycesium.s3.amazonaws.com/LeLanderon/3Dtiles/LeLanderon_3DTiles_OUT/Scene/LeLanderon_3DTiles_OUT.json",
      "https://uzuflycesium.s3.amazonaws.com/LeLanderon/3Dtiles/LeLanderon_3Dtiles_IN_Raw/Scene/LeLanderon_3Dtiles_IN_Raw.json"
    ]
  }
}
