(['C:\\Users\\Matthew\\remote_python\\remote_python.py'],
 ['C:\\Users\\Matthew\\remote_python', 'C:\\Users\\Matthew\\remote_python'],
 ['codecs'],
 [],
 [],
 [],
 False,
 False,
 '3.7.0 (default, Jun 28 2018, 08:04:48) [MSC v.1912 64 bit (AMD64)]',
 [('remote_python',
   'C:\\Users\\Matthew\\remote_python\\remote_python.py',
   'PYSOURCE')],
 [('ntpath', 'c:\\users\\matthew\\anaconda3\\lib\\ntpath.py', 'PYMODULE'),
  ('_strptime', 'c:\\users\\matthew\\anaconda3\\lib\\_strptime.py', 'PYMODULE'),
  ('datetime', 'c:\\users\\matthew\\anaconda3\\lib\\datetime.py', 'PYMODULE'),
  ('typing', 'c:\\users\\matthew\\anaconda3\\lib\\typing.py', 'PYMODULE'),
  ('_py_abc', 'c:\\users\\matthew\\anaconda3\\lib\\_py_abc.py', 'PYMODULE'),
  ('stringprep',
   'c:\\users\\matthew\\anaconda3\\lib\\stringprep.py',
   'PYMODULE'),
  ('tracemalloc',
   'c:\\users\\matthew\\anaconda3\\lib\\tracemalloc.py',
   'PYMODULE'),
  ('__future__',
   'c:\\users\\matthew\\anaconda3\\lib\\__future__.py',
   'PYMODULE'),
  ('difflib', 'c:\\users\\matthew\\anaconda3\\lib\\difflib.py', 'PYMODULE'),
  ('ast', 'c:\\users\\matthew\\anaconda3\\lib\\ast.py', 'PYMODULE'),
  ('inspect', 'c:\\users\\matthew\\anaconda3\\lib\\inspect.py', 'PYMODULE'),
  ('cmd', 'c:\\users\\matthew\\anaconda3\\lib\\cmd.py', 'PYMODULE'),
  ('bdb', 'c:\\users\\matthew\\anaconda3\\lib\\bdb.py', 'PYMODULE'),
  ('opcode', 'c:\\users\\matthew\\anaconda3\\lib\\opcode.py', 'PYMODULE'),
  ('dis', 'c:\\users\\matthew\\anaconda3\\lib\\dis.py', 'PYMODULE'),
  ('codeop', 'c:\\users\\matthew\\anaconda3\\lib\\codeop.py', 'PYMODULE'),
  ('code', 'c:\\users\\matthew\\anaconda3\\lib\\code.py', 'PYMODULE'),
  ('glob', 'c:\\users\\matthew\\anaconda3\\lib\\glob.py', 'PYMODULE'),
  ('shlex', 'c:\\users\\matthew\\anaconda3\\lib\\shlex.py', 'PYMODULE'),
  ('runpy', 'c:\\users\\matthew\\anaconda3\\lib\\runpy.py', 'PYMODULE'),
  ('importlib._bootstrap',
   'c:\\users\\matthew\\anaconda3\\lib\\importlib\\_bootstrap.py',
   'PYMODULE'),
  ('importlib._bootstrap_external',
   'c:\\users\\matthew\\anaconda3\\lib\\importlib\\_bootstrap_external.py',
   'PYMODULE'),
  ('importlib.machinery',
   'c:\\users\\matthew\\anaconda3\\lib\\importlib\\machinery.py',
   'PYMODULE'),
  ('importlib.util',
   'c:\\users\\matthew\\anaconda3\\lib\\importlib\\util.py',
   'PYMODULE'),
  ('importlib.abc',
   'c:\\users\\matthew\\anaconda3\\lib\\importlib\\abc.py',
   'PYMODULE'),
  ('importlib',
   'c:\\users\\matthew\\anaconda3\\lib\\importlib\\__init__.py',
   'PYMODULE'),
  ('pkgutil', 'c:\\users\\matthew\\anaconda3\\lib\\pkgutil.py', 'PYMODULE'),
  ('xml', 'c:\\users\\matthew\\anaconda3\\lib\\xml\\__init__.py', 'PYMODULE'),
  ('xml.sax.expatreader',
   'c:\\users\\matthew\\anaconda3\\lib\\xml\\sax\\expatreader.py',
   'PYMODULE'),
  ('xml.sax.saxutils',
   'c:\\users\\matthew\\anaconda3\\lib\\xml\\sax\\saxutils.py',
   'PYMODULE'),
  ('urllib.request',
   'c:\\users\\matthew\\anaconda3\\lib\\urllib\\request.py',
   'PYMODULE'),
  ('getpass', 'c:\\users\\matthew\\anaconda3\\lib\\getpass.py', 'PYMODULE'),
  ('nturl2path',
   'c:\\users\\matthew\\anaconda3\\lib\\nturl2path.py',
   'PYMODULE'),
  ('ftplib', 'c:\\users\\matthew\\anaconda3\\lib\\ftplib.py', 'PYMODULE'),
  ('netrc', 'c:\\users\\matthew\\anaconda3\\lib\\netrc.py', 'PYMODULE'),
  ('http.cookiejar',
   'c:\\users\\matthew\\anaconda3\\lib\\http\\cookiejar.py',
   'PYMODULE'),
  ('urllib.response',
   'c:\\users\\matthew\\anaconda3\\lib\\urllib\\response.py',
   'PYMODULE'),
  ('urllib.error',
   'c:\\users\\matthew\\anaconda3\\lib\\urllib\\error.py',
   'PYMODULE'),
  ('xml.sax',
   'c:\\users\\matthew\\anaconda3\\lib\\xml\\sax\\__init__.py',
   'PYMODULE'),
  ('xml.sax.handler',
   'c:\\users\\matthew\\anaconda3\\lib\\xml\\sax\\handler.py',
   'PYMODULE'),
  ('xml.sax._exceptions',
   'c:\\users\\matthew\\anaconda3\\lib\\xml\\sax\\_exceptions.py',
   'PYMODULE'),
  ('xml.sax.xmlreader',
   'c:\\users\\matthew\\anaconda3\\lib\\xml\\sax\\xmlreader.py',
   'PYMODULE'),
  ('xml.parsers',
   'c:\\users\\matthew\\anaconda3\\lib\\xml\\parsers\\__init__.py',
   'PYMODULE'),
  ('xml.parsers.expat',
   'c:\\users\\matthew\\anaconda3\\lib\\xml\\parsers\\expat.py',
   'PYMODULE'),
  ('plistlib', 'c:\\users\\matthew\\anaconda3\\lib\\plistlib.py', 'PYMODULE'),
  ('platform', 'c:\\users\\matthew\\anaconda3\\lib\\platform.py', 'PYMODULE'),
  ('urllib.parse',
   'c:\\users\\matthew\\anaconda3\\lib\\urllib\\parse.py',
   'PYMODULE'),
  ('tempfile', 'c:\\users\\matthew\\anaconda3\\lib\\tempfile.py', 'PYMODULE'),
  ('tty', 'c:\\users\\matthew\\anaconda3\\lib\\tty.py', 'PYMODULE'),
  ('pydoc_data',
   'c:\\users\\matthew\\anaconda3\\lib\\pydoc_data\\__init__.py',
   'PYMODULE'),
  ('pydoc_data.topics',
   'c:\\users\\matthew\\anaconda3\\lib\\pydoc_data\\topics.py',
   'PYMODULE'),
  ('html.entities',
   'c:\\users\\matthew\\anaconda3\\lib\\html\\entities.py',
   'PYMODULE'),
  ('html', 'c:\\users\\matthew\\anaconda3\\lib\\html\\__init__.py', 'PYMODULE'),
  ('ssl', 'c:\\users\\matthew\\anaconda3\\lib\\ssl.py', 'PYMODULE'),
  ('http.client',
   'c:\\users\\matthew\\anaconda3\\lib\\http\\client.py',
   'PYMODULE'),
  ('mimetypes', 'c:\\users\\matthew\\anaconda3\\lib\\mimetypes.py', 'PYMODULE'),
  ('socketserver',
   'c:\\users\\matthew\\anaconda3\\lib\\socketserver.py',
   'PYMODULE'),
  ('http', 'c:\\users\\matthew\\anaconda3\\lib\\http\\__init__.py', 'PYMODULE'),
  ('http.server',
   'c:\\users\\matthew\\anaconda3\\lib\\http\\server.py',
   'PYMODULE'),
  ('optparse', 'c:\\users\\matthew\\anaconda3\\lib\\optparse.py', 'PYMODULE'),
  ('uu', 'c:\\users\\matthew\\anaconda3\\lib\\uu.py', 'PYMODULE'),
  ('quopri', 'c:\\users\\matthew\\anaconda3\\lib\\quopri.py', 'PYMODULE'),
  ('email.feedparser',
   'c:\\users\\matthew\\anaconda3\\lib\\email\\feedparser.py',
   'PYMODULE'),
  ('email.parser',
   'c:\\users\\matthew\\anaconda3\\lib\\email\\parser.py',
   'PYMODULE'),
  ('email',
   'c:\\users\\matthew\\anaconda3\\lib\\email\\__init__.py',
   'PYMODULE'),
  ('calendar', 'c:\\users\\matthew\\anaconda3\\lib\\calendar.py', 'PYMODULE'),
  ('email._parseaddr',
   'c:\\users\\matthew\\anaconda3\\lib\\email\\_parseaddr.py',
   'PYMODULE'),
  ('email.utils',
   'c:\\users\\matthew\\anaconda3\\lib\\email\\utils.py',
   'PYMODULE'),
  ('email.errors',
   'c:\\users\\matthew\\anaconda3\\lib\\email\\errors.py',
   'PYMODULE'),
  ('email.header',
   'c:\\users\\matthew\\anaconda3\\lib\\email\\header.py',
   'PYMODULE'),
  ('email._policybase',
   'c:\\users\\matthew\\anaconda3\\lib\\email\\_policybase.py',
   'PYMODULE'),
  ('email.base64mime',
   'c:\\users\\matthew\\anaconda3\\lib\\email\\base64mime.py',
   'PYMODULE'),
  ('email.encoders',
   'c:\\users\\matthew\\anaconda3\\lib\\email\\encoders.py',
   'PYMODULE'),
  ('email.charset',
   'c:\\users\\matthew\\anaconda3\\lib\\email\\charset.py',
   'PYMODULE'),
  ('base64', 'c:\\users\\matthew\\anaconda3\\lib\\base64.py', 'PYMODULE'),
  ('email._encoded_words',
   'c:\\users\\matthew\\anaconda3\\lib\\email\\_encoded_words.py',
   'PYMODULE'),
  ('hashlib', 'c:\\users\\matthew\\anaconda3\\lib\\hashlib.py', 'PYMODULE'),
  ('bisect', 'c:\\users\\matthew\\anaconda3\\lib\\bisect.py', 'PYMODULE'),
  ('random', 'c:\\users\\matthew\\anaconda3\\lib\\random.py', 'PYMODULE'),
  ('email.generator',
   'c:\\users\\matthew\\anaconda3\\lib\\email\\generator.py',
   'PYMODULE'),
  ('email.iterators',
   'c:\\users\\matthew\\anaconda3\\lib\\email\\iterators.py',
   'PYMODULE'),
  ('urllib',
   'c:\\users\\matthew\\anaconda3\\lib\\urllib\\__init__.py',
   'PYMODULE'),
  ('email._header_value_parser',
   'c:\\users\\matthew\\anaconda3\\lib\\email\\_header_value_parser.py',
   'PYMODULE'),
  ('email.headerregistry',
   'c:\\users\\matthew\\anaconda3\\lib\\email\\headerregistry.py',
   'PYMODULE'),
  ('email.quoprimime',
   'c:\\users\\matthew\\anaconda3\\lib\\email\\quoprimime.py',
   'PYMODULE'),
  ('email.contentmanager',
   'c:\\users\\matthew\\anaconda3\\lib\\email\\contentmanager.py',
   'PYMODULE'),
  ('email.policy',
   'c:\\users\\matthew\\anaconda3\\lib\\email\\policy.py',
   'PYMODULE'),
  ('email.message',
   'c:\\users\\matthew\\anaconda3\\lib\\email\\message.py',
   'PYMODULE'),
  ('bz2', 'c:\\users\\matthew\\anaconda3\\lib\\bz2.py', 'PYMODULE'),
  ('lzma', 'c:\\users\\matthew\\anaconda3\\lib\\lzma.py', 'PYMODULE'),
  ('_compression',
   'c:\\users\\matthew\\anaconda3\\lib\\_compression.py',
   'PYMODULE'),
  ('gzip', 'c:\\users\\matthew\\anaconda3\\lib\\gzip.py', 'PYMODULE'),
  ('tarfile', 'c:\\users\\matthew\\anaconda3\\lib\\tarfile.py', 'PYMODULE'),
  ('py_compile',
   'c:\\users\\matthew\\anaconda3\\lib\\py_compile.py',
   'PYMODULE'),
  ('zipfile', 'c:\\users\\matthew\\anaconda3\\lib\\zipfile.py', 'PYMODULE'),
  ('shutil', 'c:\\users\\matthew\\anaconda3\\lib\\shutil.py', 'PYMODULE'),
  ('socket', 'c:\\users\\matthew\\anaconda3\\lib\\socket.py', 'PYMODULE'),
  ('webbrowser',
   'c:\\users\\matthew\\anaconda3\\lib\\webbrowser.py',
   'PYMODULE'),
  ('pydoc', 'c:\\users\\matthew\\anaconda3\\lib\\pydoc.py', 'PYMODULE'),
  ('getopt', 'c:\\users\\matthew\\anaconda3\\lib\\getopt.py', 'PYMODULE'),
  ('pdb', 'c:\\users\\matthew\\anaconda3\\lib\\pdb.py', 'PYMODULE'),
  ('unittest.util',
   'c:\\users\\matthew\\anaconda3\\lib\\unittest\\util.py',
   'PYMODULE'),
  ('unittest.result',
   'c:\\users\\matthew\\anaconda3\\lib\\unittest\\result.py',
   'PYMODULE'),
  ('string', 'c:\\users\\matthew\\anaconda3\\lib\\string.py', 'PYMODULE'),
  ('_compat_pickle',
   'c:\\users\\matthew\\anaconda3\\lib\\_compat_pickle.py',
   'PYMODULE'),
  ('pickle', 'c:\\users\\matthew\\anaconda3\\lib\\pickle.py', 'PYMODULE'),
  ('logging',
   'c:\\users\\matthew\\anaconda3\\lib\\logging\\__init__.py',
   'PYMODULE'),
  ('pprint', 'c:\\users\\matthew\\anaconda3\\lib\\pprint.py', 'PYMODULE'),
  ('unittest.case',
   'c:\\users\\matthew\\anaconda3\\lib\\unittest\\case.py',
   'PYMODULE'),
  ('unittest.suite',
   'c:\\users\\matthew\\anaconda3\\lib\\unittest\\suite.py',
   'PYMODULE'),
  ('fnmatch', 'c:\\users\\matthew\\anaconda3\\lib\\fnmatch.py', 'PYMODULE'),
  ('unittest.loader',
   'c:\\users\\matthew\\anaconda3\\lib\\unittest\\loader.py',
   'PYMODULE'),
  ('unittest.runner',
   'c:\\users\\matthew\\anaconda3\\lib\\unittest\\runner.py',
   'PYMODULE'),
  ('unittest.main',
   'c:\\users\\matthew\\anaconda3\\lib\\unittest\\main.py',
   'PYMODULE'),
  ('unittest.signals',
   'c:\\users\\matthew\\anaconda3\\lib\\unittest\\signals.py',
   'PYMODULE'),
  ('unittest',
   'c:\\users\\matthew\\anaconda3\\lib\\unittest\\__init__.py',
   'PYMODULE'),
  ('doctest', 'c:\\users\\matthew\\anaconda3\\lib\\doctest.py', 'PYMODULE'),
  ('stat', 'c:\\users\\matthew\\anaconda3\\lib\\stat.py', 'PYMODULE'),
  ('genericpath',
   'c:\\users\\matthew\\anaconda3\\lib\\genericpath.py',
   'PYMODULE'),
  ('posixpath', 'c:\\users\\matthew\\anaconda3\\lib\\posixpath.py', 'PYMODULE'),
  ('signal', 'c:\\users\\matthew\\anaconda3\\lib\\signal.py', 'PYMODULE'),
  ('contextlib',
   'c:\\users\\matthew\\anaconda3\\lib\\contextlib.py',
   'PYMODULE'),
  ('_threading_local',
   'c:\\users\\matthew\\anaconda3\\lib\\_threading_local.py',
   'PYMODULE'),
  ('threading', 'c:\\users\\matthew\\anaconda3\\lib\\threading.py', 'PYMODULE'),
  ('selectors', 'c:\\users\\matthew\\anaconda3\\lib\\selectors.py', 'PYMODULE'),
  ('subprocess',
   'c:\\users\\matthew\\anaconda3\\lib\\subprocess.py',
   'PYMODULE'),
  ('token', 'c:\\users\\matthew\\anaconda3\\lib\\token.py', 'PYMODULE'),
  ('struct', 'c:\\users\\matthew\\anaconda3\\lib\\struct.py', 'PYMODULE'),
  ('gettext', 'c:\\users\\matthew\\anaconda3\\lib\\gettext.py', 'PYMODULE'),
  ('textwrap', 'c:\\users\\matthew\\anaconda3\\lib\\textwrap.py', 'PYMODULE'),
  ('tokenize', 'c:\\users\\matthew\\anaconda3\\lib\\tokenize.py', 'PYMODULE'),
  ('copy', 'c:\\users\\matthew\\anaconda3\\lib\\copy.py', 'PYMODULE'),
  ('os', 'c:\\users\\matthew\\anaconda3\\lib\\os.py', 'PYMODULE'),
  ('configparser',
   'c:\\users\\matthew\\anaconda3\\lib\\configparser.py',
   'PYMODULE'),
  ('argparse', 'c:\\users\\matthew\\anaconda3\\lib\\argparse.py', 'PYMODULE'),
  ('json', 'c:\\users\\matthew\\anaconda3\\lib\\json\\__init__.py', 'PYMODULE'),
  ('json.encoder',
   'c:\\users\\matthew\\anaconda3\\lib\\json\\encoder.py',
   'PYMODULE'),
  ('json.decoder',
   'c:\\users\\matthew\\anaconda3\\lib\\json\\decoder.py',
   'PYMODULE'),
  ('json.scanner',
   'c:\\users\\matthew\\anaconda3\\lib\\json\\scanner.py',
   'PYMODULE'),
  ('paramiko',
   'c:\\users\\matthew\\anaconda3\\lib\\site-packages\\paramiko\\__init__.py',
   'PYMODULE'),
  ('paramiko.common',
   'c:\\users\\matthew\\anaconda3\\lib\\site-packages\\paramiko\\common.py',
   'PYMODULE'),
  ('paramiko.py3compat',
   'c:\\users\\matthew\\anaconda3\\lib\\site-packages\\paramiko\\py3compat.py',
   'PYMODULE'),
  ('paramiko.proxy',
   'c:\\users\\matthew\\anaconda3\\lib\\site-packages\\paramiko\\proxy.py',
   'PYMODULE'),
  ('paramiko.config',
   'c:\\users\\matthew\\anaconda3\\lib\\site-packages\\paramiko\\config.py',
   'PYMODULE'),
  ('paramiko.hostkeys',
   'c:\\users\\matthew\\anaconda3\\lib\\site-packages\\paramiko\\hostkeys.py',
   'PYMODULE'),
  ('hmac', 'c:\\users\\matthew\\anaconda3\\lib\\hmac.py', 'PYMODULE'),
  ('paramiko.pkey',
   'c:\\users\\matthew\\anaconda3\\lib\\site-packages\\paramiko\\pkey.py',
   'PYMODULE'),
  ('cryptography.hazmat.primitives.ciphers.modes',
   'c:\\users\\matthew\\anaconda3\\lib\\site-packages\\cryptography\\hazmat\\primitives\\ciphers\\modes.py',
   'PYMODULE'),
  ('cryptography.utils',
   'c:\\users\\matthew\\anaconda3\\lib\\site-packages\\cryptography\\utils.py',
   'PYMODULE'),
  ('cryptography',
   'c:\\users\\matthew\\anaconda3\\lib\\site-packages\\cryptography\\__init__.py',
   'PYMODULE'),
  ('cryptography.hazmat.bindings.openssl._conditional',
   'c:\\users\\matthew\\anaconda3\\lib\\site-packages\\cryptography\\hazmat\\bindings\\openssl\\_conditional.py',
   'PYMODULE'),
  ('cryptography.hazmat.bindings.openssl',
   'c:\\users\\matthew\\anaconda3\\lib\\site-packages\\cryptography\\hazmat\\bindings\\openssl\\__init__.py',
   'PYMODULE'),
  ('cryptography.hazmat.bindings',
   'c:\\users\\matthew\\anaconda3\\lib\\site-packages\\cryptography\\hazmat\\bindings\\__init__.py',
   'PYMODULE'),
  ('cryptography.hazmat',
   'c:\\users\\matthew\\anaconda3\\lib\\site-packages\\cryptography\\hazmat\\__init__.py',
   'PYMODULE'),
  ('cryptography.hazmat.bindings.openssl.binding',
   'c:\\users\\matthew\\anaconda3\\lib\\site-packages\\cryptography\\hazmat\\bindings\\openssl\\binding.py',
   'PYMODULE'),
  ('cryptography.exceptions',
   'c:\\users\\matthew\\anaconda3\\lib\\site-packages\\cryptography\\exceptions.py',
   'PYMODULE'),
  ('cryptography.hazmat.backends.openssl.ciphers',
   'c:\\users\\matthew\\anaconda3\\lib\\site-packages\\cryptography\\hazmat\\backends\\openssl\\ciphers.py',
   'PYMODULE'),
  ('cryptography.hazmat.backends.openssl.ec',
   'c:\\users\\matthew\\anaconda3\\lib\\site-packages\\cryptography\\hazmat\\backends\\openssl\\ec.py',
   'PYMODULE'),
  ('cryptography.hazmat.primitives.asymmetric.ec',
   'c:\\users\\matthew\\anaconda3\\lib\\site-packages\\cryptography\\hazmat\\primitives\\asymmetric\\ec.py',
   'PYMODULE'),
  ('cryptography.hazmat.primitives.asymmetric',
   'c:\\users\\matthew\\anaconda3\\lib\\site-packages\\cryptography\\hazmat\\primitives\\asymmetric\\__init__.py',
   'PYMODULE'),
  ('cryptography.hazmat.primitives.asymmetric.dh',
   'c:\\users\\matthew\\anaconda3\\lib\\site-packages\\cryptography\\hazmat\\primitives\\asymmetric\\dh.py',
   'PYMODULE'),
  ('cryptography.hazmat.primitives.asymmetric.rsa',
   'c:\\users\\matthew\\anaconda3\\lib\\site-packages\\cryptography\\hazmat\\primitives\\asymmetric\\rsa.py',
   'PYMODULE'),
  ('fractions', 'c:\\users\\matthew\\anaconda3\\lib\\fractions.py', 'PYMODULE'),
  ('numbers', 'c:\\users\\matthew\\anaconda3\\lib\\numbers.py', 'PYMODULE'),
  ('decimal', 'c:\\users\\matthew\\anaconda3\\lib\\decimal.py', 'PYMODULE'),
  ('_pydecimal',
   'c:\\users\\matthew\\anaconda3\\lib\\_pydecimal.py',
   'PYMODULE'),
  ('contextvars',
   'c:\\users\\matthew\\anaconda3\\lib\\contextvars.py',
   'PYMODULE'),
  ('cryptography.hazmat.primitives.asymmetric.dsa',
   'c:\\users\\matthew\\anaconda3\\lib\\site-packages\\cryptography\\hazmat\\primitives\\asymmetric\\dsa.py',
   'PYMODULE'),
  ('cryptography.hazmat.primitives.hashes',
   'c:\\users\\matthew\\anaconda3\\lib\\site-packages\\cryptography\\hazmat\\primitives\\hashes.py',
   'PYMODULE'),
  ('cryptography.hazmat.backends.openssl.backend',
   'c:\\users\\matthew\\anaconda3\\lib\\site-packages\\cryptography\\hazmat\\backends\\openssl\\backend.py',
   'PYMODULE'),
  ('cryptography.hazmat.primitives.kdf.scrypt',
   'c:\\users\\matthew\\anaconda3\\lib\\site-packages\\cryptography\\hazmat\\primitives\\kdf\\scrypt.py',
   'PYMODULE'),
  ('cryptography.hazmat.primitives.constant_time',
   'c:\\users\\matthew\\anaconda3\\lib\\site-packages\\cryptography\\hazmat\\primitives\\constant_time.py',
   'PYMODULE'),
  ('cryptography.hazmat.primitives.kdf',
   'c:\\users\\matthew\\anaconda3\\lib\\site-packages\\cryptography\\hazmat\\primitives\\kdf\\__init__.py',
   'PYMODULE'),
  ('cryptography.hazmat.primitives.asymmetric.padding',
   'c:\\users\\matthew\\anaconda3\\lib\\site-packages\\cryptography\\hazmat\\primitives\\asymmetric\\padding.py',
   'PYMODULE'),
  ('cryptography.hazmat.backends.openssl.aead',
   'c:\\users\\matthew\\anaconda3\\lib\\site-packages\\cryptography\\hazmat\\backends\\openssl\\aead.py',
   'PYMODULE'),
  ('cryptography.hazmat.primitives.ciphers.aead',
   'c:\\users\\matthew\\anaconda3\\lib\\site-packages\\cryptography\\hazmat\\primitives\\ciphers\\aead.py',
   'PYMODULE'),
  ('cryptography.hazmat.backends.openssl',
   'c:\\users\\matthew\\anaconda3\\lib\\site-packages\\cryptography\\hazmat\\backends\\openssl\\__init__.py',
   'PYMODULE'),
  ('cryptography.hazmat.backends.openssl.x509',
   'c:\\users\\matthew\\anaconda3\\lib\\site-packages\\cryptography\\hazmat\\backends\\openssl\\x509.py',
   'PYMODULE'),
  ('cryptography.hazmat.backends.openssl.decode_asn1',
   'c:\\users\\matthew\\anaconda3\\lib\\site-packages\\cryptography\\hazmat\\backends\\openssl\\decode_asn1.py',
   'PYMODULE'),
  ('cryptography.x509.oid',
   'c:\\users\\matthew\\anaconda3\\lib\\site-packages\\cryptography\\x509\\oid.py',
   'PYMODULE'),
  ('cryptography.x509.name',
   'c:\\users\\matthew\\anaconda3\\lib\\site-packages\\cryptography\\x509\\name.py',
   'PYMODULE'),
  ('cryptography.x509.extensions',
   'c:\\users\\matthew\\anaconda3\\lib\\site-packages\\cryptography\\x509\\extensions.py',
   'PYMODULE'),
  ('cryptography.x509.general_name',
   'c:\\users\\matthew\\anaconda3\\lib\\site-packages\\cryptography\\x509\\general_name.py',
   'PYMODULE'),
  ('idna',
   'c:\\users\\matthew\\anaconda3\\lib\\site-packages\\idna\\__init__.py',
   'PYMODULE'),
  ('idna.core',
   'c:\\users\\matthew\\anaconda3\\lib\\site-packages\\idna\\core.py',
   'PYMODULE'),
  ('idna.uts46data',
   'c:\\users\\matthew\\anaconda3\\lib\\site-packages\\idna\\uts46data.py',
   'PYMODULE'),
  ('idna.intranges',
   'c:\\users\\matthew\\anaconda3\\lib\\site-packages\\idna\\intranges.py',
   'PYMODULE'),
  ('idna.idnadata',
   'c:\\users\\matthew\\anaconda3\\lib\\site-packages\\idna\\idnadata.py',
   'PYMODULE'),
  ('idna.package_data',
   'c:\\users\\matthew\\anaconda3\\lib\\site-packages\\idna\\package_data.py',
   'PYMODULE'),
  ('cryptography.x509.certificate_transparency',
   'c:\\users\\matthew\\anaconda3\\lib\\site-packages\\cryptography\\x509\\certificate_transparency.py',
   'PYMODULE'),
  ('asn1crypto.keys',
   'c:\\users\\matthew\\anaconda3\\lib\\site-packages\\asn1crypto\\keys.py',
   'PYMODULE'),
  ('asn1crypto',
   'c:\\users\\matthew\\anaconda3\\lib\\site-packages\\asn1crypto\\__init__.py',
   'PYMODULE'),
  ('asn1crypto._teletex_codec',
   'c:\\users\\matthew\\anaconda3\\lib\\site-packages\\asn1crypto\\_teletex_codec.py',
   'PYMODULE'),
  ('asn1crypto.version',
   'c:\\users\\matthew\\anaconda3\\lib\\site-packages\\asn1crypto\\version.py',
   'PYMODULE'),
  ('asn1crypto.util',
   'c:\\users\\matthew\\anaconda3\\lib\\site-packages\\asn1crypto\\util.py',
   'PYMODULE'),
  ('asn1crypto._inet',
   'c:\\users\\matthew\\anaconda3\\lib\\site-packages\\asn1crypto\\_inet.py',
   'PYMODULE'),
  ('asn1crypto._ordereddict',
   'c:\\users\\matthew\\anaconda3\\lib\\site-packages\\asn1crypto\\_ordereddict.py',
   'PYMODULE'),
  ('asn1crypto._iri',
   'c:\\users\\matthew\\anaconda3\\lib\\site-packages\\asn1crypto\\_iri.py',
   'PYMODULE'),
  ('asn1crypto.algos',
   'c:\\users\\matthew\\anaconda3\\lib\\site-packages\\asn1crypto\\algos.py',
   'PYMODULE'),
  ('asn1crypto._int',
   'c:\\users\\matthew\\anaconda3\\lib\\site-packages\\asn1crypto\\_int.py',
   'PYMODULE'),
  ('asn1crypto._perf._big_num_ctypes',
   'c:\\users\\matthew\\anaconda3\\lib\\site-packages\\asn1crypto\\_perf\\_big_num_ctypes.py',
   'PYMODULE'),
  ('asn1crypto._perf',
   'c:\\users\\matthew\\anaconda3\\lib\\site-packages\\asn1crypto\\_perf\\__init__.py',
   'PYMODULE'),
  ('ctypes.util',
   'c:\\users\\matthew\\anaconda3\\lib\\ctypes\\util.py',
   'PYMODULE'),
  ('ctypes._aix',
   'c:\\users\\matthew\\anaconda3\\lib\\ctypes\\_aix.py',
   'PYMODULE'),
  ('ctypes.macholib.dyld',
   'c:\\users\\matthew\\anaconda3\\lib\\ctypes\\macholib\\dyld.py',
   'PYMODULE'),
  ('ctypes.macholib',
   'c:\\users\\matthew\\anaconda3\\lib\\ctypes\\macholib\\__init__.py',
   'PYMODULE'),
  ('ctypes.macholib.dylib',
   'c:\\users\\matthew\\anaconda3\\lib\\ctypes\\macholib\\dylib.py',
   'PYMODULE'),
  ('ctypes.macholib.framework',
   'c:\\users\\matthew\\anaconda3\\lib\\ctypes\\macholib\\framework.py',
   'PYMODULE'),
  ('ctypes',
   'c:\\users\\matthew\\anaconda3\\lib\\ctypes\\__init__.py',
   'PYMODULE'),
  ('ctypes._endian',
   'c:\\users\\matthew\\anaconda3\\lib\\ctypes\\_endian.py',
   'PYMODULE'),
  ('asn1crypto._ffi',
   'c:\\users\\matthew\\anaconda3\\lib\\site-packages\\asn1crypto\\_ffi.py',
   'PYMODULE'),
  ('asn1crypto._types',
   'c:\\users\\matthew\\anaconda3\\lib\\site-packages\\asn1crypto\\_types.py',
   'PYMODULE'),
  ('asn1crypto._errors',
   'c:\\users\\matthew\\anaconda3\\lib\\site-packages\\asn1crypto\\_errors.py',
   'PYMODULE'),
  ('asn1crypto._elliptic_curve',
   'c:\\users\\matthew\\anaconda3\\lib\\site-packages\\asn1crypto\\_elliptic_curve.py',
   'PYMODULE'),
  ('asn1crypto.core',
   'c:\\users\\matthew\\anaconda3\\lib\\site-packages\\asn1crypto\\core.py',
   'PYMODULE'),
  ('asn1crypto.parser',
   'c:\\users\\matthew\\anaconda3\\lib\\site-packages\\asn1crypto\\parser.py',
   'PYMODULE'),
  ('ipaddress', 'c:\\users\\matthew\\anaconda3\\lib\\ipaddress.py', 'PYMODULE'),
  ('cryptography.hazmat.backends.openssl.rsa',
   'c:\\users\\matthew\\anaconda3\\lib\\site-packages\\cryptography\\hazmat\\backends\\openssl\\rsa.py',
   'PYMODULE'),
  ('cryptography.hazmat.backends.interfaces',
   'c:\\users\\matthew\\anaconda3\\lib\\site-packages\\cryptography\\hazmat\\backends\\interfaces.py',
   'PYMODULE'),
  ('cryptography.hazmat.backends.openssl.dsa',
   'c:\\users\\matthew\\anaconda3\\lib\\site-packages\\cryptography\\hazmat\\backends\\openssl\\dsa.py',
   'PYMODULE'),
  ('cryptography.hazmat.backends.openssl.hmac',
   'c:\\users\\matthew\\anaconda3\\lib\\site-packages\\cryptography\\hazmat\\backends\\openssl\\hmac.py',
   'PYMODULE'),
  ('cryptography.hazmat.primitives.mac',
   'c:\\users\\matthew\\anaconda3\\lib\\site-packages\\cryptography\\hazmat\\primitives\\mac.py',
   'PYMODULE'),
  ('cryptography.hazmat.backends.openssl.encode_asn1',
   'c:\\users\\matthew\\anaconda3\\lib\\site-packages\\cryptography\\hazmat\\backends\\openssl\\encode_asn1.py',
   'PYMODULE'),
  ('cryptography.hazmat.backends.openssl.hashes',
   'c:\\users\\matthew\\anaconda3\\lib\\site-packages\\cryptography\\hazmat\\backends\\openssl\\hashes.py',
   'PYMODULE'),
  ('cryptography.hazmat.backends.openssl.dh',
   'c:\\users\\matthew\\anaconda3\\lib\\site-packages\\cryptography\\hazmat\\backends\\openssl\\dh.py',
   'PYMODULE'),
  ('cryptography.hazmat.backends.openssl.utils',
   'c:\\users\\matthew\\anaconda3\\lib\\site-packages\\cryptography\\hazmat\\backends\\openssl\\utils.py',
   'PYMODULE'),
  ('cryptography.hazmat.primitives.asymmetric.utils',
   'c:\\users\\matthew\\anaconda3\\lib\\site-packages\\cryptography\\hazmat\\primitives\\asymmetric\\utils.py',
   'PYMODULE'),
  ('cryptography.hazmat.backends.openssl.x25519',
   'c:\\users\\matthew\\anaconda3\\lib\\site-packages\\cryptography\\hazmat\\backends\\openssl\\x25519.py',
   'PYMODULE'),
  ('cryptography.hazmat.primitives.asymmetric.x25519',
   'c:\\users\\matthew\\anaconda3\\lib\\site-packages\\cryptography\\hazmat\\primitives\\asymmetric\\x25519.py',
   'PYMODULE'),
  ('cryptography.hazmat.backends.openssl.cmac',
   'c:\\users\\matthew\\anaconda3\\lib\\site-packages\\cryptography\\hazmat\\backends\\openssl\\cmac.py',
   'PYMODULE'),
  ('cryptography.x509',
   'c:\\users\\matthew\\anaconda3\\lib\\site-packages\\cryptography\\x509\\__init__.py',
   'PYMODULE'),
  ('cryptography.x509.base',
   'c:\\users\\matthew\\anaconda3\\lib\\site-packages\\cryptography\\x509\\base.py',
   'PYMODULE'),
  ('cryptography.__about__',
   'c:\\users\\matthew\\anaconda3\\lib\\site-packages\\cryptography\\__about__.py',
   'PYMODULE'),
  ('six',
   'c:\\users\\matthew\\anaconda3\\lib\\site-packages\\six.py',
   'PYMODULE'),
  ('cryptography.hazmat.primitives.ciphers.algorithms',
   'c:\\users\\matthew\\anaconda3\\lib\\site-packages\\cryptography\\hazmat\\primitives\\ciphers\\algorithms.py',
   'PYMODULE'),
  ('cryptography.hazmat.primitives.ciphers',
   'c:\\users\\matthew\\anaconda3\\lib\\site-packages\\cryptography\\hazmat\\primitives\\ciphers\\__init__.py',
   'PYMODULE'),
  ('cryptography.hazmat.primitives.ciphers.base',
   'c:\\users\\matthew\\anaconda3\\lib\\site-packages\\cryptography\\hazmat\\primitives\\ciphers\\base.py',
   'PYMODULE'),
  ('cryptography.hazmat.primitives.serialization',
   'c:\\users\\matthew\\anaconda3\\lib\\site-packages\\cryptography\\hazmat\\primitives\\serialization.py',
   'PYMODULE'),
  ('cryptography.hazmat.primitives',
   'c:\\users\\matthew\\anaconda3\\lib\\site-packages\\cryptography\\hazmat\\primitives\\__init__.py',
   'PYMODULE'),
  ('cryptography.hazmat.backends',
   'c:\\users\\matthew\\anaconda3\\lib\\site-packages\\cryptography\\hazmat\\backends\\__init__.py',
   'PYMODULE'),
  ('paramiko.agent',
   'c:\\users\\matthew\\anaconda3\\lib\\site-packages\\paramiko\\agent.py',
   'PYMODULE'),
  ('paramiko.win_pageant',
   'c:\\users\\matthew\\anaconda3\\lib\\site-packages\\paramiko\\win_pageant.py',
   'PYMODULE'),
  ('ctypes.wintypes',
   'c:\\users\\matthew\\anaconda3\\lib\\ctypes\\wintypes.py',
   'PYMODULE'),
  ('paramiko.file',
   'c:\\users\\matthew\\anaconda3\\lib\\site-packages\\paramiko\\file.py',
   'PYMODULE'),
  ('paramiko.packet',
   'c:\\users\\matthew\\anaconda3\\lib\\site-packages\\paramiko\\packet.py',
   'PYMODULE'),
  ('paramiko.message',
   'c:\\users\\matthew\\anaconda3\\lib\\site-packages\\paramiko\\message.py',
   'PYMODULE'),
  ('paramiko.sftp_file',
   'c:\\users\\matthew\\anaconda3\\lib\\site-packages\\paramiko\\sftp_file.py',
   'PYMODULE'),
  ('paramiko.sftp_si',
   'c:\\users\\matthew\\anaconda3\\lib\\site-packages\\paramiko\\sftp_si.py',
   'PYMODULE'),
  ('paramiko.sftp_handle',
   'c:\\users\\matthew\\anaconda3\\lib\\site-packages\\paramiko\\sftp_handle.py',
   'PYMODULE'),
  ('paramiko.sftp_attr',
   'c:\\users\\matthew\\anaconda3\\lib\\site-packages\\paramiko\\sftp_attr.py',
   'PYMODULE'),
  ('paramiko.sftp_server',
   'c:\\users\\matthew\\anaconda3\\lib\\site-packages\\paramiko\\sftp_server.py',
   'PYMODULE'),
  ('paramiko.sftp_client',
   'c:\\users\\matthew\\anaconda3\\lib\\site-packages\\paramiko\\sftp_client.py',
   'PYMODULE'),
  ('paramiko.sftp',
   'c:\\users\\matthew\\anaconda3\\lib\\site-packages\\paramiko\\sftp.py',
   'PYMODULE'),
  ('paramiko.ed25519key',
   'c:\\users\\matthew\\anaconda3\\lib\\site-packages\\paramiko\\ed25519key.py',
   'PYMODULE'),
  ('nacl.signing',
   'c:\\users\\matthew\\anaconda3\\lib\\site-packages\\nacl\\signing.py',
   'PYMODULE'),
  ('nacl.utils',
   'c:\\users\\matthew\\anaconda3\\lib\\site-packages\\nacl\\utils.py',
   'PYMODULE'),
  ('nacl.public',
   'c:\\users\\matthew\\anaconda3\\lib\\site-packages\\nacl\\public.py',
   'PYMODULE'),
  ('nacl.exceptions',
   'c:\\users\\matthew\\anaconda3\\lib\\site-packages\\nacl\\exceptions.py',
   'PYMODULE'),
  ('nacl.encoding',
   'c:\\users\\matthew\\anaconda3\\lib\\site-packages\\nacl\\encoding.py',
   'PYMODULE'),
  ('nacl',
   'c:\\users\\matthew\\anaconda3\\lib\\site-packages\\nacl\\__init__.py',
   'PYMODULE'),
  ('nacl.bindings',
   'c:\\users\\matthew\\anaconda3\\lib\\site-packages\\nacl\\bindings\\__init__.py',
   'PYMODULE'),
  ('nacl.bindings.utils',
   'c:\\users\\matthew\\anaconda3\\lib\\site-packages\\nacl\\bindings\\utils.py',
   'PYMODULE'),
  ('nacl.bindings.sodium_core',
   'c:\\users\\matthew\\anaconda3\\lib\\site-packages\\nacl\\bindings\\sodium_core.py',
   'PYMODULE'),
  ('nacl.bindings.randombytes',
   'c:\\users\\matthew\\anaconda3\\lib\\site-packages\\nacl\\bindings\\randombytes.py',
   'PYMODULE'),
  ('nacl.bindings.crypto_sign',
   'c:\\users\\matthew\\anaconda3\\lib\\site-packages\\nacl\\bindings\\crypto_sign.py',
   'PYMODULE'),
  ('nacl.bindings.crypto_shorthash',
   'c:\\users\\matthew\\anaconda3\\lib\\site-packages\\nacl\\bindings\\crypto_shorthash.py',
   'PYMODULE'),
  ('nacl.bindings.crypto_secretstream',
   'c:\\users\\matthew\\anaconda3\\lib\\site-packages\\nacl\\bindings\\crypto_secretstream.py',
   'PYMODULE'),
  ('nacl.bindings.crypto_secretbox',
   'c:\\users\\matthew\\anaconda3\\lib\\site-packages\\nacl\\bindings\\crypto_secretbox.py',
   'PYMODULE'),
  ('nacl.bindings.crypto_scalarmult',
   'c:\\users\\matthew\\anaconda3\\lib\\site-packages\\nacl\\bindings\\crypto_scalarmult.py',
   'PYMODULE'),
  ('nacl.bindings.crypto_pwhash',
   'c:\\users\\matthew\\anaconda3\\lib\\site-packages\\nacl\\bindings\\crypto_pwhash.py',
   'PYMODULE'),
  ('nacl.bindings.crypto_kx',
   'c:\\users\\matthew\\anaconda3\\lib\\site-packages\\nacl\\bindings\\crypto_kx.py',
   'PYMODULE'),
  ('nacl.bindings.crypto_hash',
   'c:\\users\\matthew\\anaconda3\\lib\\site-packages\\nacl\\bindings\\crypto_hash.py',
   'PYMODULE'),
  ('nacl.bindings.crypto_generichash',
   'c:\\users\\matthew\\anaconda3\\lib\\site-packages\\nacl\\bindings\\crypto_generichash.py',
   'PYMODULE'),
  ('nacl.bindings.crypto_box',
   'c:\\users\\matthew\\anaconda3\\lib\\site-packages\\nacl\\bindings\\crypto_box.py',
   'PYMODULE'),
  ('nacl.bindings.crypto_aead',
   'c:\\users\\matthew\\anaconda3\\lib\\site-packages\\nacl\\bindings\\crypto_aead.py',
   'PYMODULE'),
  ('bcrypt',
   'c:\\users\\matthew\\anaconda3\\lib\\site-packages\\bcrypt\\__init__.py',
   'PYMODULE'),
  ('bcrypt.__about__',
   'c:\\users\\matthew\\anaconda3\\lib\\site-packages\\bcrypt\\__about__.py',
   'PYMODULE'),
  ('paramiko.ecdsakey',
   'c:\\users\\matthew\\anaconda3\\lib\\site-packages\\paramiko\\ecdsakey.py',
   'PYMODULE'),
  ('paramiko.dsskey',
   'c:\\users\\matthew\\anaconda3\\lib\\site-packages\\paramiko\\dsskey.py',
   'PYMODULE'),
  ('paramiko.ber',
   'c:\\users\\matthew\\anaconda3\\lib\\site-packages\\paramiko\\ber.py',
   'PYMODULE'),
  ('paramiko.rsakey',
   'c:\\users\\matthew\\anaconda3\\lib\\site-packages\\paramiko\\rsakey.py',
   'PYMODULE'),
  ('paramiko.server',
   'c:\\users\\matthew\\anaconda3\\lib\\site-packages\\paramiko\\server.py',
   'PYMODULE'),
  ('paramiko.ssh_exception',
   'c:\\users\\matthew\\anaconda3\\lib\\site-packages\\paramiko\\ssh_exception.py',
   'PYMODULE'),
  ('paramiko.channel',
   'c:\\users\\matthew\\anaconda3\\lib\\site-packages\\paramiko\\channel.py',
   'PYMODULE'),
  ('paramiko.buffered_pipe',
   'c:\\users\\matthew\\anaconda3\\lib\\site-packages\\paramiko\\buffered_pipe.py',
   'PYMODULE'),
  ('paramiko.ssh_gss',
   'c:\\users\\matthew\\anaconda3\\lib\\site-packages\\paramiko\\ssh_gss.py',
   'PYMODULE'),
  ('sspi',
   'c:\\users\\matthew\\anaconda3\\lib\\site-packages\\win32\\lib\\sspi.py',
   'PYMODULE'),
  ('sspicon',
   'c:\\users\\matthew\\anaconda3\\lib\\site-packages\\win32\\lib\\sspicon.py',
   'PYMODULE'),
  ('pywintypes',
   'c:\\users\\matthew\\anaconda3\\lib\\site-packages\\win32\\lib\\pywintypes.py',
   'PYMODULE'),
  ('distutils.sysconfig',
   'c:\\users\\matthew\\anaconda3\\lib\\distutils\\sysconfig.py',
   'PYMODULE'),
  ('distutils',
   'c:\\users\\matthew\\anaconda3\\lib\\distutils\\__init__.py',
   'PYMODULE'),
  ('distutils.log',
   'c:\\users\\matthew\\anaconda3\\lib\\distutils\\log.py',
   'PYMODULE'),
  ('distutils.text_file',
   'c:\\users\\matthew\\anaconda3\\lib\\distutils\\text_file.py',
   'PYMODULE'),
  ('_osx_support',
   'c:\\users\\matthew\\anaconda3\\lib\\_osx_support.py',
   'PYMODULE'),
  ('distutils.errors',
   'c:\\users\\matthew\\anaconda3\\lib\\distutils\\errors.py',
   'PYMODULE'),
  ('imp', 'c:\\users\\matthew\\anaconda3\\lib\\imp.py', 'PYMODULE'),
  ('pyasn1.codec.der.decoder',
   'c:\\users\\matthew\\anaconda3\\lib\\site-packages\\pyasn1\\codec\\der\\decoder.py',
   'PYMODULE'),
  ('pyasn1.type',
   'c:\\users\\matthew\\anaconda3\\lib\\site-packages\\pyasn1\\type\\__init__.py',
   'PYMODULE'),
  ('pyasn1.type.useful',
   'c:\\users\\matthew\\anaconda3\\lib\\site-packages\\pyasn1\\type\\useful.py',
   'PYMODULE'),
  ('pyasn1.compat.string',
   'c:\\users\\matthew\\anaconda3\\lib\\site-packages\\pyasn1\\compat\\string.py',
   'PYMODULE'),
  ('pyasn1.compat.dateandtime',
   'c:\\users\\matthew\\anaconda3\\lib\\site-packages\\pyasn1\\compat\\dateandtime.py',
   'PYMODULE'),
  ('pyasn1.compat',
   'c:\\users\\matthew\\anaconda3\\lib\\site-packages\\pyasn1\\compat\\__init__.py',
   'PYMODULE'),
  ('pyasn1.compat.integer',
   'c:\\users\\matthew\\anaconda3\\lib\\site-packages\\pyasn1\\compat\\integer.py',
   'PYMODULE'),
  ('pyasn1.compat.octets',
   'c:\\users\\matthew\\anaconda3\\lib\\site-packages\\pyasn1\\compat\\octets.py',
   'PYMODULE'),
  ('pyasn1.compat.binary',
   'c:\\users\\matthew\\anaconda3\\lib\\site-packages\\pyasn1\\compat\\binary.py',
   'PYMODULE'),
  ('pyasn1.compat.calling',
   'c:\\users\\matthew\\anaconda3\\lib\\site-packages\\pyasn1\\compat\\calling.py',
   'PYMODULE'),
  ('pyasn1.error',
   'c:\\users\\matthew\\anaconda3\\lib\\site-packages\\pyasn1\\error.py',
   'PYMODULE'),
  ('pyasn1.type.char',
   'c:\\users\\matthew\\anaconda3\\lib\\site-packages\\pyasn1\\type\\char.py',
   'PYMODULE'),
  ('pyasn1.type.namedval',
   'c:\\users\\matthew\\anaconda3\\lib\\site-packages\\pyasn1\\type\\namedval.py',
   'PYMODULE'),
  ('pyasn1.type.namedtype',
   'c:\\users\\matthew\\anaconda3\\lib\\site-packages\\pyasn1\\type\\namedtype.py',
   'PYMODULE'),
  ('pyasn1.type.base',
   'c:\\users\\matthew\\anaconda3\\lib\\site-packages\\pyasn1\\type\\base.py',
   'PYMODULE'),
  ('pyasn1.type.tagmap',
   'c:\\users\\matthew\\anaconda3\\lib\\site-packages\\pyasn1\\type\\tagmap.py',
   'PYMODULE'),
  ('pyasn1.type.tag',
   'c:\\users\\matthew\\anaconda3\\lib\\site-packages\\pyasn1\\type\\tag.py',
   'PYMODULE'),
  ('pyasn1.type.constraint',
   'c:\\users\\matthew\\anaconda3\\lib\\site-packages\\pyasn1\\type\\constraint.py',
   'PYMODULE'),
  ('pyasn1.type.error',
   'c:\\users\\matthew\\anaconda3\\lib\\site-packages\\pyasn1\\type\\error.py',
   'PYMODULE'),
  ('pyasn1',
   'c:\\users\\matthew\\anaconda3\\lib\\site-packages\\pyasn1\\__init__.py',
   'PYMODULE'),
  ('pyasn1.debug',
   'c:\\users\\matthew\\anaconda3\\lib\\site-packages\\pyasn1\\debug.py',
   'PYMODULE'),
  ('pyasn1.codec.cer.decoder',
   'c:\\users\\matthew\\anaconda3\\lib\\site-packages\\pyasn1\\codec\\cer\\decoder.py',
   'PYMODULE'),
  ('pyasn1.codec.ber.decoder',
   'c:\\users\\matthew\\anaconda3\\lib\\site-packages\\pyasn1\\codec\\ber\\decoder.py',
   'PYMODULE'),
  ('pyasn1.codec.ber.eoo',
   'c:\\users\\matthew\\anaconda3\\lib\\site-packages\\pyasn1\\codec\\ber\\eoo.py',
   'PYMODULE'),
  ('pyasn1.codec.ber',
   'c:\\users\\matthew\\anaconda3\\lib\\site-packages\\pyasn1\\codec\\ber\\__init__.py',
   'PYMODULE'),
  ('pyasn1.codec.ber.encoder',
   'c:\\users\\matthew\\anaconda3\\lib\\site-packages\\pyasn1\\codec\\ber\\encoder.py',
   'PYMODULE'),
  ('pyasn1.codec',
   'c:\\users\\matthew\\anaconda3\\lib\\site-packages\\pyasn1\\codec\\__init__.py',
   'PYMODULE'),
  ('pyasn1.codec.cer',
   'c:\\users\\matthew\\anaconda3\\lib\\site-packages\\pyasn1\\codec\\cer\\__init__.py',
   'PYMODULE'),
  ('pyasn1.codec.cer.encoder',
   'c:\\users\\matthew\\anaconda3\\lib\\site-packages\\pyasn1\\codec\\cer\\encoder.py',
   'PYMODULE'),
  ('pyasn1.codec.der.encoder',
   'c:\\users\\matthew\\anaconda3\\lib\\site-packages\\pyasn1\\codec\\der\\encoder.py',
   'PYMODULE'),
  ('pyasn1.codec.der',
   'c:\\users\\matthew\\anaconda3\\lib\\site-packages\\pyasn1\\codec\\der\\__init__.py',
   'PYMODULE'),
  ('pyasn1.type.univ',
   'c:\\users\\matthew\\anaconda3\\lib\\site-packages\\pyasn1\\type\\univ.py',
   'PYMODULE'),
  ('paramiko.auth_handler',
   'c:\\users\\matthew\\anaconda3\\lib\\site-packages\\paramiko\\auth_handler.py',
   'PYMODULE'),
  ('paramiko.client',
   'c:\\users\\matthew\\anaconda3\\lib\\site-packages\\paramiko\\client.py',
   'PYMODULE'),
  ('paramiko._winapi',
   'c:\\users\\matthew\\anaconda3\\lib\\site-packages\\paramiko\\_winapi.py',
   'PYMODULE'),
  ('paramiko.transport',
   'c:\\users\\matthew\\anaconda3\\lib\\site-packages\\paramiko\\transport.py',
   'PYMODULE'),
  ('paramiko.primes',
   'c:\\users\\matthew\\anaconda3\\lib\\site-packages\\paramiko\\primes.py',
   'PYMODULE'),
  ('paramiko.kex_gss',
   'c:\\users\\matthew\\anaconda3\\lib\\site-packages\\paramiko\\kex_gss.py',
   'PYMODULE'),
  ('paramiko.kex_ecdh_nist',
   'c:\\users\\matthew\\anaconda3\\lib\\site-packages\\paramiko\\kex_ecdh_nist.py',
   'PYMODULE'),
  ('paramiko.kex_group14',
   'c:\\users\\matthew\\anaconda3\\lib\\site-packages\\paramiko\\kex_group14.py',
   'PYMODULE'),
  ('paramiko.kex_group1',
   'c:\\users\\matthew\\anaconda3\\lib\\site-packages\\paramiko\\kex_group1.py',
   'PYMODULE'),
  ('paramiko.kex_gex',
   'c:\\users\\matthew\\anaconda3\\lib\\site-packages\\paramiko\\kex_gex.py',
   'PYMODULE'),
  ('paramiko.compress',
   'c:\\users\\matthew\\anaconda3\\lib\\site-packages\\paramiko\\compress.py',
   'PYMODULE'),
  ('paramiko.pipe',
   'c:\\users\\matthew\\anaconda3\\lib\\site-packages\\paramiko\\pipe.py',
   'PYMODULE'),
  ('paramiko.util',
   'c:\\users\\matthew\\anaconda3\\lib\\site-packages\\paramiko\\util.py',
   'PYMODULE'),
  ('paramiko._version',
   'c:\\users\\matthew\\anaconda3\\lib\\site-packages\\paramiko\\_version.py',
   'PYMODULE')],
 [('api-ms-win-crt-heap-l1-1-0.dll',
   'c:\\users\\matthew\\anaconda3\\api-ms-win-crt-heap-l1-1-0.dll',
   'BINARY'),
  ('VCRUNTIME140.dll',
   'c:\\users\\matthew\\anaconda3\\VCRUNTIME140.dll',
   'BINARY'),
  ('python37.dll', 'c:\\users\\matthew\\anaconda3\\python37.dll', 'BINARY'),
  ('api-ms-win-crt-math-l1-1-0.dll',
   'c:\\users\\matthew\\anaconda3\\api-ms-win-crt-math-l1-1-0.dll',
   'BINARY'),
  ('api-ms-win-crt-stdio-l1-1-0.dll',
   'c:\\users\\matthew\\anaconda3\\api-ms-win-crt-stdio-l1-1-0.dll',
   'BINARY'),
  ('api-ms-win-crt-locale-l1-1-0.dll',
   'c:\\users\\matthew\\anaconda3\\api-ms-win-crt-locale-l1-1-0.dll',
   'BINARY'),
  ('api-ms-win-crt-runtime-l1-1-0.dll',
   'c:\\users\\matthew\\anaconda3\\api-ms-win-crt-runtime-l1-1-0.dll',
   'BINARY'),
  ('ucrtbase.dll', 'c:\\users\\matthew\\anaconda3\\ucrtbase.dll', 'BINARY'),
  ('api-ms-win-crt-convert-l1-1-0.dll',
   'c:\\users\\matthew\\anaconda3\\api-ms-win-crt-convert-l1-1-0.dll',
   'BINARY'),
  ('api-ms-win-crt-string-l1-1-0.dll',
   'c:\\users\\matthew\\anaconda3\\api-ms-win-crt-string-l1-1-0.dll',
   'BINARY'),
  ('api-ms-win-crt-time-l1-1-0.dll',
   'c:\\users\\matthew\\anaconda3\\api-ms-win-crt-time-l1-1-0.dll',
   'BINARY'),
  ('api-ms-win-crt-filesystem-l1-1-0.dll',
   'c:\\users\\matthew\\anaconda3\\api-ms-win-crt-filesystem-l1-1-0.dll',
   'BINARY'),
  ('api-ms-win-crt-process-l1-1-0.dll',
   'c:\\users\\matthew\\anaconda3\\api-ms-win-crt-process-l1-1-0.dll',
   'BINARY'),
  ('api-ms-win-crt-conio-l1-1-0.dll',
   'c:\\users\\matthew\\anaconda3\\api-ms-win-crt-conio-l1-1-0.dll',
   'BINARY'),
  ('api-ms-win-crt-environment-l1-1-0.dll',
   'c:\\users\\matthew\\anaconda3\\api-ms-win-crt-environment-l1-1-0.dll',
   'BINARY'),
  ('api-ms-win-core-console-l1-1-0.dll',
   'c:\\users\\matthew\\anaconda3\\api-ms-win-core-console-l1-1-0.dll',
   'BINARY'),
  ('api-ms-win-core-localization-l1-2-0.dll',
   'c:\\users\\matthew\\anaconda3\\api-ms-win-core-localization-l1-2-0.dll',
   'BINARY'),
  ('api-ms-win-core-synch-l1-2-0.dll',
   'c:\\users\\matthew\\anaconda3\\api-ms-win-core-synch-l1-2-0.dll',
   'BINARY'),
  ('api-ms-win-core-processthreads-l1-1-0.dll',
   'c:\\users\\matthew\\anaconda3\\api-ms-win-core-processthreads-l1-1-0.dll',
   'BINARY'),
  ('api-ms-win-core-handle-l1-1-0.dll',
   'c:\\users\\matthew\\anaconda3\\api-ms-win-core-handle-l1-1-0.dll',
   'BINARY'),
  ('api-ms-win-core-file-l1-2-0.dll',
   'c:\\users\\matthew\\anaconda3\\api-ms-win-core-file-l1-2-0.dll',
   'BINARY'),
  ('api-ms-win-core-libraryloader-l1-1-0.dll',
   'c:\\users\\matthew\\anaconda3\\api-ms-win-core-libraryloader-l1-1-0.dll',
   'BINARY'),
  ('api-ms-win-core-profile-l1-1-0.dll',
   'c:\\users\\matthew\\anaconda3\\api-ms-win-core-profile-l1-1-0.dll',
   'BINARY'),
  ('api-ms-win-core-debug-l1-1-0.dll',
   'c:\\users\\matthew\\anaconda3\\api-ms-win-core-debug-l1-1-0.dll',
   'BINARY'),
  ('api-ms-win-core-processthreads-l1-1-1.dll',
   'c:\\users\\matthew\\anaconda3\\api-ms-win-core-processthreads-l1-1-1.dll',
   'BINARY'),
  ('api-ms-win-core-namedpipe-l1-1-0.dll',
   'c:\\users\\matthew\\anaconda3\\api-ms-win-core-namedpipe-l1-1-0.dll',
   'BINARY'),
  ('api-ms-win-core-datetime-l1-1-0.dll',
   'c:\\users\\matthew\\anaconda3\\api-ms-win-core-datetime-l1-1-0.dll',
   'BINARY'),
  ('api-ms-win-core-synch-l1-1-0.dll',
   'c:\\users\\matthew\\anaconda3\\api-ms-win-core-synch-l1-1-0.dll',
   'BINARY'),
  ('api-ms-win-core-interlocked-l1-1-0.dll',
   'c:\\users\\matthew\\anaconda3\\api-ms-win-core-interlocked-l1-1-0.dll',
   'BINARY'),
  ('api-ms-win-core-rtlsupport-l1-1-0.dll',
   'c:\\users\\matthew\\anaconda3\\api-ms-win-core-rtlsupport-l1-1-0.dll',
   'BINARY'),
  ('api-ms-win-core-string-l1-1-0.dll',
   'c:\\users\\matthew\\anaconda3\\api-ms-win-core-string-l1-1-0.dll',
   'BINARY'),
  ('api-ms-win-core-errorhandling-l1-1-0.dll',
   'c:\\users\\matthew\\anaconda3\\api-ms-win-core-errorhandling-l1-1-0.dll',
   'BINARY'),
  ('api-ms-win-core-util-l1-1-0.dll',
   'c:\\users\\matthew\\anaconda3\\api-ms-win-core-util-l1-1-0.dll',
   'BINARY'),
  ('api-ms-win-core-memory-l1-1-0.dll',
   'c:\\users\\matthew\\anaconda3\\api-ms-win-core-memory-l1-1-0.dll',
   'BINARY'),
  ('api-ms-win-core-sysinfo-l1-1-0.dll',
   'c:\\users\\matthew\\anaconda3\\api-ms-win-core-sysinfo-l1-1-0.dll',
   'BINARY'),
  ('api-ms-win-core-file-l2-1-0.dll',
   'c:\\users\\matthew\\anaconda3\\api-ms-win-core-file-l2-1-0.dll',
   'BINARY'),
  ('api-ms-win-core-heap-l1-1-0.dll',
   'c:\\users\\matthew\\anaconda3\\api-ms-win-core-heap-l1-1-0.dll',
   'BINARY'),
  ('api-ms-win-core-processenvironment-l1-1-0.dll',
   'c:\\users\\matthew\\anaconda3\\api-ms-win-core-processenvironment-l1-1-0.dll',
   'BINARY'),
  ('api-ms-win-core-file-l1-1-0.dll',
   'c:\\users\\matthew\\anaconda3\\api-ms-win-core-file-l1-1-0.dll',
   'BINARY'),
  ('api-ms-win-core-timezone-l1-1-0.dll',
   'c:\\users\\matthew\\anaconda3\\api-ms-win-core-timezone-l1-1-0.dll',
   'BINARY'),
  ('pywintypes37.dll',
   'c:\\users\\matthew\\anaconda3\\lib\\site-packages\\win32\\pywintypes37.dll',
   'BINARY'),
  ('_ssl', 'c:\\users\\matthew\\anaconda3\\DLLs\\_ssl.pyd', 'EXTENSION'),
  ('unicodedata',
   'c:\\users\\matthew\\anaconda3\\DLLs\\unicodedata.pyd',
   'EXTENSION'),
  ('pyexpat', 'c:\\users\\matthew\\anaconda3\\DLLs\\pyexpat.pyd', 'EXTENSION'),
  ('_hashlib',
   'c:\\users\\matthew\\anaconda3\\DLLs\\_hashlib.pyd',
   'EXTENSION'),
  ('_bz2', 'c:\\users\\matthew\\anaconda3\\DLLs\\_bz2.pyd', 'EXTENSION'),
  ('_lzma', 'c:\\users\\matthew\\anaconda3\\DLLs\\_lzma.pyd', 'EXTENSION'),
  ('_socket', 'c:\\users\\matthew\\anaconda3\\DLLs\\_socket.pyd', 'EXTENSION'),
  ('select', 'c:\\users\\matthew\\anaconda3\\DLLs\\select.pyd', 'EXTENSION'),
  ('_cffi_backend',
   'c:\\users\\matthew\\anaconda3\\lib\\site-packages\\_cffi_backend.cp37-win_amd64.pyd',
   'EXTENSION'),
  ('cryptography.hazmat.bindings._openssl',
   'c:\\users\\matthew\\anaconda3\\lib\\site-packages\\cryptography\\hazmat\\bindings\\_openssl.cp37-win_amd64.pyd',
   'EXTENSION'),
  ('_contextvars',
   'c:\\users\\matthew\\anaconda3\\DLLs\\_contextvars.pyd',
   'EXTENSION'),
  ('_decimal',
   'c:\\users\\matthew\\anaconda3\\DLLs\\_decimal.pyd',
   'EXTENSION'),
  ('cryptography.hazmat.bindings._constant_time',
   'c:\\users\\matthew\\anaconda3\\lib\\site-packages\\cryptography\\hazmat\\bindings\\_constant_time.cp37-win_amd64.pyd',
   'EXTENSION'),
  ('_ctypes', 'c:\\users\\matthew\\anaconda3\\DLLs\\_ctypes.pyd', 'EXTENSION'),
  ('nacl._sodium',
   'c:\\users\\matthew\\anaconda3\\lib\\site-packages\\nacl\\_sodium.cp37-win_amd64.pyd',
   'EXTENSION'),
  ('bcrypt._bcrypt',
   'c:\\users\\matthew\\anaconda3\\lib\\site-packages\\bcrypt\\_bcrypt.cp37-win_amd64.pyd',
   'EXTENSION'),
  ('win32security',
   'c:\\users\\matthew\\anaconda3\\lib\\site-packages\\win32\\win32security.pyd',
   'EXTENSION'),
  ('_win32sysloader',
   'c:\\users\\matthew\\anaconda3\\lib\\site-packages\\win32\\_win32sysloader.pyd',
   'EXTENSION'),
  ('libssl-1_1-x64.dll',
   'c:\\users\\matthew\\anaconda3\\DLLs\\libssl-1_1-x64.dll',
   'BINARY'),
  ('libcrypto-1_1-x64.dll',
   'c:\\users\\matthew\\anaconda3\\DLLs\\libcrypto-1_1-x64.dll',
   'BINARY'),
  ('LIBEAY32.dll',
   'C:\\Users\\Matthew\\Anaconda3\\Library\\bin\\libeay32.dll',
   'BINARY'),
  ('SSLEAY32.dll',
   'C:\\Users\\Matthew\\Anaconda3\\Library\\bin\\ssleay32.dll',
   'BINARY'),
  ('api-ms-win-crt-utility-l1-1-0.dll',
   'c:\\users\\matthew\\anaconda3\\api-ms-win-crt-utility-l1-1-0.dll',
   'BINARY')],
 [],
 [],
 [('base_library.zip',
   'C:\\Users\\Matthew\\remote_python\\build\\remote_python\\base_library.zip',
   'DATA'),
  ('cryptography-2.3.1-py3.7.egg-info\\WHEEL',
   'c:\\users\\matthew\\anaconda3\\lib\\site-packages\\cryptography-2.3.1.dist-info\\WHEEL',
   'DATA'),
  ('cryptography-2.3.1-py3.7.egg-info\\top_level.txt',
   'c:\\users\\matthew\\anaconda3\\lib\\site-packages\\cryptography-2.3.1.dist-info\\top_level.txt',
   'DATA'),
  ('Include\\pyconfig.h',
   'c:\\users\\matthew\\anaconda3\\Include\\pyconfig.h',
   'DATA'),
  ('cryptography-2.3.1-py3.7.egg-info\\INSTALLER',
   'c:\\users\\matthew\\anaconda3\\lib\\site-packages\\cryptography-2.3.1.dist-info\\INSTALLER',
   'DATA'),
  ('cryptography-2.3.1-py3.7.egg-info\\RECORD',
   'c:\\users\\matthew\\anaconda3\\lib\\site-packages\\cryptography-2.3.1.dist-info\\RECORD',
   'DATA'),
  ('cryptography-2.3.1-py3.7.egg-info\\METADATA',
   'c:\\users\\matthew\\anaconda3\\lib\\site-packages\\cryptography-2.3.1.dist-info\\METADATA',
   'DATA')],
 [])
