{
"spectrumId":"M9Glc1",
"peaks":[

{"mz":322.99,
"intensity":228},
{"mz":340.96,
"intensity":300},
{"mz":382.94,
"intensity":292},
{"mz":383.89,
"intensity":102},
{"mz":384.04,
"intensity":145},
{"mz":424.99,
"intensity":119},
{"mz":425.95,
"intensity":129},
{"mz":466.96,
"intensity":448},
{"mz":484.65,
"intensity":300},
{"mz":484.98,
"intensity":1185},
{"mz":485.98,
"intensity":222},
{"mz":502.93,
"intensity":224},
{"mz":509.66,
"intensity":151},
{"mz":545,
"intensity":801},
{"mz":545.95,
"intensity":143},
{"mz":546.04,
"intensity":150},
{"mz":576.97,
"intensity":141},
{"mz":595.95,
"intensity":120},
{"mz":596.45,
"intensity":110},
{"mz":598.28,
"intensity":542},
{"mz":616.91,
"intensity":202},
{"mz":624.32,
"intensity":112},
{"mz":627.04,
"intensity":115},
{"mz":646.96,
"intensity":369},
{"mz":647.96,
"intensity":102},
{"mz":664.95,
"intensity":303},
{"mz":665.28,
"intensity":216},
{"mz":665.6,
"intensity":120},
{"mz":677,
"intensity":482},
{"mz":677.48,
"intensity":366},
{"mz":678.04,
"intensity":206},
{"mz":684.19,
"intensity":166},
{"mz":698.99,
"intensity":126},
{"mz":749.03,
"intensity":376},
{"mz":749.55,
"intensity":182},
{"mz":750.04,
"intensity":132},
{"mz":758.05,
"intensity":1608},
{"mz":758.55,
"intensity":1001},
{"mz":759.05,
"intensity":468},
{"mz":779.06,
"intensity":452},
{"mz":779.58,
"intensity":255},
{"mz":780.08,
"intensity":176},
{"mz":800.02,
"intensity":122},
{"mz":809.06,
"intensity":757},
{"mz":809.66,
"intensity":122},
{"mz":809.99,
"intensity":233},
{"mz":810.99,
"intensity":139},
{"mz":821.11,
"intensity":167},
{"mz":821.53,
"intensity":112},
{"mz":827.05,
"intensity":769},
{"mz":827.93,
"intensity":163},
{"mz":829.55,
"intensity":253},
{"mz":830.11,
"intensity":760},
{"mz":830.55,
"intensity":694},
{"mz":839.08,
"intensity":4115},
{"mz":839.54,
"intensity":3533},
{"mz":840.05,
"intensity":1076},
{"mz":840.5,
"intensity":426},
{"mz":851.06,
"intensity":234},
{"mz":851.5,
"intensity":115},
{"mz":860.09,
"intensity":1196},
{"mz":860.58,
"intensity":1016},
{"mz":861.06,
"intensity":422},
{"mz":869.08,
"intensity":434},
{"mz":869.54,
"intensity":167},
{"mz":870.01,
"intensity":101},
{"mz":881.09,
"intensity":136},
{"mz":890.06,
"intensity":198},
{"mz":898.81,
"intensity":132},
{"mz":899.1,
"intensity":109},
{"mz":902.07,
"intensity":253},
{"mz":902.56,
"intensity":179},
{"mz":909.63,
"intensity":158},
{"mz":910.6,
"intensity":226},
{"mz":911.1,
"intensity":1187},
{"mz":911.6,
"intensity":688},
{"mz":912.1,
"intensity":461},
{"mz":920.1,
"intensity":229},
{"mz":920.67,
"intensity":349},
{"mz":921.17,
"intensity":155},
{"mz":921.57,
"intensity":456},
{"mz":922.06,
"intensity":117},
{"mz":932.11,
"intensity":293},
{"mz":932.65,
"intensity":389},
{"mz":933.09,
"intensity":102},
{"mz":941.11,
"intensity":2582},
{"mz":941.59,
"intensity":1800},
{"mz":942.08,
"intensity":1042},
{"mz":942.59,
"intensity":207},
{"mz":953.01,
"intensity":118},
{"mz":953.15,
"intensity":125},
{"mz":954.11,
"intensity":186},
{"mz":961.61,
"intensity":190},
{"mz":962.13,
"intensity":643},
{"mz":962.61,
"intensity":280},
{"mz":963.09,
"intensity":208},
{"mz":968.16,
"intensity":119},
{"mz":971.12,
"intensity":728},
{"mz":971.62,
"intensity":349},
{"mz":972.13,
"intensity":503},
{"mz":972.6,
"intensity":206},
{"mz":973.17,
"intensity":158},
{"mz":992.13,
"intensity":2402},
{"mz":992.61,
"intensity":2372},
{"mz":993.11,
"intensity":995},
{"mz":993.62,
"intensity":349},
{"mz":1001.11,
"intensity":748},
{"mz":1001.62,
"intensity":556},
{"mz":1002.15,
"intensity":412},
{"mz":1002.61,
"intensity":247},
{"mz":1012.11,
"intensity":1193},
{"mz":1012.61,
"intensity":582},
{"mz":1013.08,
"intensity":150},
{"mz":1013.64,
"intensity":128},
{"mz":1014.17,
"intensity":137},
{"mz":1137.28,
"intensity":108},
{"mz":1193.05,
"intensity":142},
{"mz":1276.22,
"intensity":147},
{"mz":1337.21,
"intensity":107},
{"mz":1355.21,
"intensity":278},
{"mz":1356.17,
"intensity":117},
{"mz":1357.29,
"intensity":183},
{"mz":1397.23,
"intensity":276},
{"mz":1397.38,
"intensity":105},
{"mz":1398.18,
"intensity":159},
{"mz":1398.26,
"intensity":159},
{"mz":1459.28,
"intensity":217},
{"mz":1482.13,
"intensity":160},
{"mz":1499.25,
"intensity":265},
{"mz":1500.32,
"intensity":112},
{"mz":1559.27,
"intensity":227},
{"mz":1560.11,
"intensity":147},
{"mz":1626.23,
"intensity":188},
{"mz":1630.22,
"intensity":135},
{"mz":1661.31,
"intensity":111},
{"mz":1679.18,
"intensity":196},
{"mz":1703.27,
"intensity":190},
{"mz":1721.29,
"intensity":466},
{"mz":1722.42,
"intensity":122},
{"mz":1723.38,
"intensity":135},
{"mz":1739.2,
"intensity":121},
{"mz":1763.41,
"intensity":101},
{"mz":1806.41,
"intensity":126},
{"mz":1822.39,
"intensity":323},
{"mz":1823.33,
"intensity":290},
{"mz":1824.28,
"intensity":207},
{"mz":1825.42,
"intensity":114},
{"mz":1883.45,
"intensity":118}
]
}
