{
    "melanoma":{
            "id":"0000002",
            "user_id":"0000001",
            "name":"Jodie Abrahams",
            "cellline":"IFG02",
            "date_created":30092019,
            "date_modified":30092019,
            "is_active":1,
            "cart_items":[
                {"glytoucan":"G31886NL","glycan":"M2","mass":749.36,"rt":27.7,"relarea":0.003264606,"gs":"706"}, 
                {"glytoucan":"G22768VO","glycan":"M3","mass":911.39,"rt":26.6,"relarea":0.002873938,"gs":"597"}, 
                {"glytoucan":"G22768VO","glycan":"M3","mass":911.39,"rt":33.4,"relarea":0.001197966,"gs":"597"}, 
                {"glytoucan":"G55982TK","glycan":"M4","mass":1073.39,"rt":30.3,"relarea":0.002265358,"gs":"935"}, 
                {"glytoucan":"G55982TK","glycan":"M4","mass":1073.39,"rt":31.7,"relarea":0.001516774,"gs":"935"}, 
                {"glytoucan":"G42466VF","glycan":"FM2","mass":895.42,"rt":34.9,"relarea":0.013202103,"gs":"625"}, 
                {"glytoucan":"G44201QD","glycan":"FM3","mass":1057.36,"rt":40.6,"relarea":0.018159178,"gs":"913"}, 
                {"glytoucan":"G45775XU","glycan":"FM4","mass":1219.4,"rt":36.8,"relarea":0.000397721,"gs":"880"}, 
                {"glytoucan":"G45775XU","glycan":"FM4","mass":1219.4,"rt":38.4,"relarea":0.001845721,"gs":"880"}, 
                {"glytoucan":"G99858XP","glycan":"FM5","mass":1381.5,"rt":41.9,"relarea":0.000860405,"gs":"1994"}, 
                {"glytoucan":"G40673VG","glycan":"M5","mass":1235.5,"rt":26.7,"relarea":0.000996873,"gs":"287"}, 
                {"glytoucan":"G40673VG","glycan":"M5","mass":1235.5,"rt":35.4,"relarea":0.015290353,"gs":"287"}, 
                {"glytoucan":"G15956KF","glycan":"M6","mass":698.33,"rt":30.3,"relarea":0.16426642,"gs":"27384"}, 
                {"glytoucan":"G15956KF","glycan":"M6","mass":698.33,"rt":32.2,"relarea":0.004002489,"gs":"27384"}, 
                {"glytoucan":"G87618BG","glycan":"M7","mass":779.39,"rt":29.9,"relarea":0.126581513,"gs":"617"}, 
                {"glytoucan":"G66723VB","glycan":"M8","mass":860.45,"rt":30.2,"relarea":0.168704773,"gs":"616"}, 
                {"glytoucan":"G66723VB","glycan":"M8","mass":860.45,"rt":33,"relarea":0.0070659,"gs":"616"}, 
                {"glytoucan":"G13847GJ","glycan":"M9","mass":941.42,"rt":30.5,"relarea":0.103349448,"gs":"297"}, 
                {"glytoucan":"G13847GJ","glycan":"M9","mass":941.42,"rt":31.6,"relarea":0.004742814,"gs":"297"}, 
                {"glytoucan":"G12775RU","glycan":"M9Glc1","mass":1022.43,"rt":32,"relarea":0.0044754,"gs":"989323246"}, 
                {"glytoucan":"G16828VN","glycan":"M5A1G1","mass":799.87,"rt":33.1,"relarea":0.001649736,"gs":"27932"}, 
                {"glytoucan":"G45454HN","glycan":"M4A1G1S1","mass":864.4,"rt":31.5,"relarea":0.008700458,"gs":"989323250"},
                {"glytoucan":"G45454HN","glycan":"M4A1G1S1","mass":864.4,"rt":38.7,"relarea":0.004221803,"gs":"989323250"},
                {"glytoucan":"G92570PJ","glycan":"M5A1G1S1","mass":945.47,"rt":33.8,"relarea":0.017503749,"gs":"989323257"},
                {"glytoucan":"G92570PJ","glycan":"M5A1G1S1","mass":945.47,"rt":40.5,"relarea":0.004009752,"gs":"989323257"},
                {"glytoucan":"G17978LE","glycan":"FM4A1G1S1","mass":937.42,"rt":35.5,"relarea":0.020564305,"gs":"989323258"},
                {"glytoucan":"G17978LE","glycan":"FM4A1G1S1","mass":937.42,"rt":42.5,"relarea":0.008785242,"gs":"989323258"},
                {"glytoucan":"G61714PI","glycan":"FM5A1G1S1","mass":1018.37,"rt":38.2,"relarea":0.006265176,"gs":"989323232"},
                {"glytoucan":"G61714PI","glycan":"FM5A1G1S1","mass":1018.37,"rt":44.3,"relarea":0.001634226,"gs":"989323232"},
                {"glytoucan":"G81874HD","glycan":"FA1","mass":1260.5,"rt":33.8,"relarea":0.001030942,"gs":"911"}, 
                {"glytoucan":"G81874HD","glycan":"FA1","mass":1260.5,"rt":42.5,"relarea":0.002028088,"gs":"911"}, 
                {"glytoucan":"G62094ME","glycan":"FA1G1S1","mass":856.4,"rt":37.4,"relarea":0.008190479,"gs":"989323240"}, 
                {"glytoucan":"G62094ME","glycan":"FA1G1S1","mass":856.4,"rt":42.9,"relarea":0.00128031,"gs":"989323240"}, 
                {"glytoucan":"G62094ME","glycan":"FA1G1S1","mass":856.4,"rt":43.6,"relarea":0.003170049,"gs":"989323240"}, 
                {"glytoucan":"G62094ME","glycan":"FA1G1S1","mass":856.4,"rt":50.6,"relarea":0.003426724,"gs":"989323240"}, 
                {"glytoucan":null,"glycan":"A1G1S1","mass":783.34,"rt":32.6,"relarea":0.001176743,"gs":"989323231"},
                {"glytoucan":null,"glycan":"A1G1S1","mass":783.34,"rt":39.3,"relarea":0.000492717,"gs":"989323231"},
                {"glytoucan":"G69812OF","glycan":"FA2","mass":731.34,"rt":35.4,"relarea":0.009601062,"gs":"735"}, 
                {"glytoucan":"G69812OF","glycan":"FA2","mass":731.34,"rt":40.1,"relarea":0.002162534,"gs":"735"}, 
                {"glytoucan":"G77561JZ","glycan":"FA2G1","mass":812.3,"rt":37.4,"relarea":0.001123122,"gs":"210519003"},
                {"glytoucan":"G28826SH","glycan":"FA2G2","mass":893.32,"rt":39.7,"relarea":0.001186454,"gs":"731"}, 


                {"glytoucan":"G18609BT","glycan":"A2G2S(6)1","mass":965.97,"rt":35.2,"relarea":0.010320563,"gs":"210519019"},
                {"glytoucan":"G71309WZ","glycan":"A2G2S(3)1","mass":965.97,"rt":41.8,"relarea":0.002884832,"gs":"707"},
                {"glytoucan":"G84467IZ","glycan":"A2G2S(6)2","mass":1111.65,"rt":35.7,"relarea":0.008248678,"gs":"1249"},
                {"glytoucan":"G80123ZU","glycan":"A2G2S(6,3)2","mass":1111.65,"rt":41.7,"relarea":0.000954653,"gs":"989323228"},
                {"glytoucan":"G45522SR","glycan":"A2G2S(3,6)2","mass":1111.65,"rt":42.4,"relarea":0.015037808,"gs":"919"},
                {"glytoucan":"G81328FA","glycan":"A2G2S(3)2","mass":1111.65,"rt":47.6,"relarea":0.005305195,"gs":"801"},
                 {"glytoucan":"","glycan":"F(6)A2G1S(6)1","mass":957.34,"rt":38.2,"relarea":0.000434871,"gs":"989323235"},
                {"glytoucan":"G81413UE","glycan":"F(6)A2G2S(6)1","mass":1038.99,"rt":39.7,"relarea":0.050408134,"gs":"989323246"},
                {"glytoucan":"G70248YW","glycan":"F(6)A2G2S(3)1","mass":1038.99,"rt":45.8,"relarea":0.009281798,"gs":"737"},
                {"glytoucan":"G83594ZB","glycan":"F(6)A2G2S(6)2","mass":1184.46,"rt":39.7,"relarea":0.025870542,"gs":"83"},
                {"glytoucan":null,"glycan":"F(6)A2G2S(6,3)2","mass":1184.46,"rt":45.8,"relarea":0.062725421,"gs":"989323229"},
                {"glytoucan":null,"glycan":"F(6)A2G2S2","mass":1184.46,"rt":48.9,"relarea":0.000881395,"gs":"819"},
                {"glytoucan":"G26800YB","glycan":"F(6)A2G2S(3)2","mass":1184.46,"rt":51,"relarea":0.019133206,"gs":"645"},
                {"glytoucan":"G34946TH","glycan":"F(6)A2G2S2","mass":1184.46,"rt":54.9,"relarea":0.001120464,"gs":"819"},
                
                {"glytoucan":"G02776IS","glycan":"FA2G1GalNAc1S2","mass":1204.88,"rt":44.9,"relarea":0.007170541,"gs":"989323233"},
                {"glytoucan":"G00955WX","glycan":"A3G3S1","mass":1148.4,"rt":37.2,"relarea":0.000580673,"gs":"989323245"},
                {"glytoucan":"G31639NG","glycan":"A3G3S2","mass":1293.9,"rt":44,"relarea":0.000740606,"gs":"989323238"},
                {"glytoucan":"G31639NG","glycan":"A3G3S2","mass":1293.9,"rt":45.8,"relarea":0.000166181,"gs":"989323238"},
                {"glytoucan":"G31639NG","glycan":"A3G3S2","mass":1293.9,"rt":47.2,"relarea":0.000445342,"gs":"989323238"},
                {"glytoucan":"G31639NG","glycan":"A3G3S2","mass":1293.9,"rt":50.2,"relarea":0.000439031,"gs":"989323238"},
                {"glytoucan":"G31639NG","glycan":"A3G3S2","mass":1293.9,"rt":55.2,"relarea":0.000165214,"gs":"989323238"},
                {"glytoucan":"G37070WM","glycan":"A3G3S3","mass":1439.5,"rt":43.7,"relarea":0.000113341,"gs":"989323236"},
                {"glytoucan":"G37070WM","glycan":"A3G3S3","mass":1439.5,"rt":46.9,"relarea":8.7227e-05,"gs":"989323236"},
                {"glytoucan":"G37070WM","glycan":"A3G3S3","mass":1439.5,"rt":49.7,"relarea":0.00058139,"gs":"989323236"},
                {"glytoucan":"G23472ZS","glycan":"FA3G3S1","mass":1221.4,"rt":38.4,"relarea":0.000386593,"gs":"989323239"},
                {"glytoucan":"G23472ZS","glycan":"FA3G3S1","mass":1221.4,"rt":41,"relarea":0.000513205,"gs":"989323239"},
                {"glytoucan":null,"glycan":"FA3G3S2","mass":1366.9,"rt":45.8,"relarea":0.000201052,"gs":"989323234"},
                {"glytoucan":null,"glycan":"FA3G3S2","mass":1366.9,"rt":47.2,"relarea":0.001172891,"gs":"989323234"},
                {"glytoucan":null,"glycan":"FA3G3S2","mass":1366.9,"rt":48.8,"relarea":0.000819774,"gs":"989323234"},
                {"glytoucan":null,"glycan":"FA3G3S2","mass":1366.9,"rt":50.6,"relarea":0.002045132,"gs":"989323234"},
                {"glytoucan":null,"glycan":"FA3G3S2","mass":1366.9,"rt":52.3,"relarea":0.000350023,"gs":"989323234"},
                {"glytoucan":null,"glycan":"FA3G3S2","mass":1366.9,"rt":53.3,"relarea":0.000601635,"gs":"989323234"},
                {"glytoucan":null,"glycan":"FA3G3S2","mass":1366.9,"rt":58.1,"relarea":0.000345169,"gs":"989323234"},
                {"glytoucan":"G53342VT","glycan":"FA3G3S3","mass":1512.5,"rt":46.5,"relarea":0.001275664,"gs":"989323259"},
                {"glytoucan":"G53342VT","glycan":"FA3G3S3","mass":1512.5,"rt":50.2,"relarea":0.001069541,"gs":"989323259"},
                {"glytoucan":"G53342VT","glycan":"FA3G3S3","mass":1512.5,"rt":52.3,"relarea":0.00296475,"gs":"989323259"},
                {"glytoucan":"G53342VT","glycan":"FA3G3S3","mass":1512.5,"rt":53.3,"relarea":0.001571573,"gs":"989323259"},
                {"glytoucan":"G53342VT","glycan":"FA3G3S3","mass":1512.5,"rt":54.2,"relarea":0.000981572,"gs":"989323259"},
                {"glytoucan":"G53342VT","glycan":"FA3G3S3","mass":1512.5,"rt":56,"relarea":0.000393159,"gs":"989323259"},
                {"glytoucan":null,"glycan":"FA4G4S2","mass":1549.6,"rt":48.7,"relarea":0.000200729,"gs":"989323242"},
                {"glytoucan":"G92975MH","glycan":"FA4G4S3","mass":1695.1,"rt":52.5,"relarea":0.000814576,"gs":"989323243"},
                {"glytoucan":"G92975MH","glycan":"FA4G4S3","mass":1695.1,"rt":54.5,"relarea":0.0013243,"gs":"989323243"},
                {"glytoucan":"G92975MH","glycan":"FA4G4S3","mass":1695.1,"rt":63.9,"relarea":0.000755167,"gs":"989323243"},
                {"glytoucan":"G13676RE","glycan":"FA4G4S4","mass":1226.8,"rt":53.7,"relarea":0.002153236,"gs":"989323244"},
                {"glytoucan":"G13676RE","glycan":"FA4G4S4","mass":1226.8,"rt":55.7,"relarea":0.002858665,"gs":"989323244"}
            ]
    }
}
