{
"spectrumId":"A1G1S1",
"peaks":[


{"mz":322.85,
"intensity":107},
{"mz":599.96,
"intensity":694},
{"mz":600.45,
"intensity":369},
{"mz":600.95,
"intensity":111},
{"mz":753.03,
"intensity":391},
{"mz":753.47,
"intensity":132},
{"mz":763.98,
"intensity":166},
{"mz":764.49,
"intensity":102},
{"mz":773.02,
"intensity":190},
{"mz":773.47,
"intensity":190},
{"mz":773.98,
"intensity":234},
{"mz":817.04,
"intensity":167},
{"mz":835.08,
"intensity":900},
{"mz":836.07,
"intensity":319},
{"mz":951.5,
"intensity":123},
{"mz":1159.18,
"intensity":139},
{"mz":1261.19,
"intensity":115},
{"mz":1344.17,
"intensity":115}]}