	
{
"spectrumId":"FA2",
"peaks":[


{"mz":201.99,
"intensity":137},
{"mz":261.96,
"intensity":179},
{"mz":303.98,
"intensity":180},
{"mz":350,
"intensity":473},
{"mz":367.99,
"intensity":183},
{"mz":454,
"intensity":103},
{"mz":466.49,
"intensity":144},
{"mz":466.98,
"intensity":106},
{"mz":475.02,
"intensity":100},
{"mz":507.98,
"intensity":124},
{"mz":525.96,
"intensity":153},
{"mz":526.95,
"intensity":143},
{"mz":527.98,
"intensity":144},
{"mz":547.51,
"intensity":411},
{"mz":547.96,
"intensity":150},
{"mz":548.5,
"intensity":340},
{"mz":548.97,
"intensity":214},
{"mz":549.47,
"intensity":125},
{"mz":571.02,
"intensity":178},
{"mz":581.54,
"intensity":101},
{"mz":583.49,
"intensity":131},
{"mz":599.51,
"intensity":110},
{"mz":619,
"intensity":310},
{"mz":620.48,
"intensity":102},
{"mz":628.01,
"intensity":161},
{"mz":628.52,
"intensity":142},
{"mz":629.02,
"intensity":130},
{"mz":629.52,
"intensity":1363},
{"mz":629.98,
"intensity":1065},
{"mz":630.49,
"intensity":243},
{"mz":649.03,
"intensity":1059},
{"mz":649.51,
"intensity":634},
{"mz":650.02,
"intensity":346},
{"mz":658.05,
"intensity":141},
{"mz":699.97,
"intensity":242},
{"mz":700.48,
"intensity":119},
{"mz":701.01,
"intensity":401},
{"mz":701.52,
"intensity":237},
{"mz":710.01,
"intensity":349},
{"mz":710.54,
"intensity":164},
{"mz":712.6,
"intensity":127},
{"mz":748.02,
"intensity":177},
{"mz":909.97,
"intensity":123},
{"mz":951.13,
"intensity":590},
{"mz":952.14,
"intensity":208},
{"mz":1094.17,
"intensity":169},
{"mz":1096.15,
"intensity":250},
{"mz":1097.11,
"intensity":105},
{"mz":1097.23,
"intensity":114},
{"mz":1098.15,
"intensity":287},
{"mz":1260.21,
"intensity":319},
{"mz":1261.27,
"intensity":120},
{"mz":1300.18,
"intensity":117}]}