{
"spectrumId":"A1G1S1",
"peaks":[


{"mz":290.03,
"intensity":199},
{"mz":356.99,
"intensity":162},
{"mz":437.95,
"intensity":125},
{"mz":518.96,
"intensity":416},
{"mz":519.48,
"intensity":101},
{"mz":571.98,
"intensity":187},
{"mz":572.97,
"intensity":107},
{"mz":599.98,
"intensity":460},
{"mz":600.43,
"intensity":414},
{"mz":600.95,
"intensity":108},
{"mz":672,
"intensity":230},
{"mz":680.99,
"intensity":117},
{"mz":702.01,
"intensity":606},
{"mz":702.52,
"intensity":417},
{"mz":702.99,
"intensity":185},
{"mz":715.05,
"intensity":215},
{"mz":753.02,
"intensity":267},
{"mz":761.99,
"intensity":102},
{"mz":773,
"intensity":273},
{"mz":773.5,
"intensity":259},
{"mz":773.98,
"intensity":330},
{"mz":774.55,
"intensity":155},
{"mz":911.15,
"intensity":114},
{"mz":961.04,
"intensity":119},
{"mz":962.06,
"intensity":107},
{"mz":979.08,
"intensity":216},
{"mz":980.13,
"intensity":120},
{"mz":1114.25,
"intensity":140},
{"mz":1141.18,
"intensity":153},
{"mz":1159.13,
"intensity":163},
{"mz":1160.16,
"intensity":108},
{"mz":1276.26,
"intensity":194},
{"mz":1277.24,
"intensity":135},
{"mz":1344.2,
"intensity":152},
{"mz":1362.18,
"intensity":111}]}