{
"spectrumId":"M4A1G1S(6)1",
"peaks":[


{"mz":466.98,
"intensity":208},
{"mz":484.94,
"intensity":165},
{"mz":545.35,
"intensity":116},
{"mz":599.97,
"intensity":1304},
{"mz":600.48,
"intensity":391},
{"mz":600.97,
"intensity":443},
{"mz":655.01,
"intensity":385},
{"mz":672.05,
"intensity":111},
{"mz":673.02,
"intensity":197},
{"mz":681.02,
"intensity":2359},
{"mz":681.5,
"intensity":1227},
{"mz":682.02,
"intensity":476},
{"mz":682.52,
"intensity":125},
{"mz":702.04,
"intensity":185},
{"mz":702.47,
"intensity":112},
{"mz":732.07,
"intensity":224},
{"mz":753.06,
"intensity":450},
{"mz":753.55,
"intensity":230},
{"mz":753.98,
"intensity":182},
{"mz":762.07,
"intensity":188},
{"mz":783.07,
"intensity":605},
{"mz":783.57,
"intensity":311},
{"mz":784.06,
"intensity":101},
{"mz":804.03,
"intensity":493},
{"mz":804.58,
"intensity":102},
{"mz":813.08,
"intensity":485},
{"mz":813.55,
"intensity":246},
{"mz":814.05,
"intensity":241},
{"mz":817.08,
"intensity":925},
{"mz":818.05,
"intensity":342},
{"mz":834.12,
"intensity":1326},
{"mz":834.59,
"intensity":1102},
{"mz":835.08,
"intensity":3459},
{"mz":836.07,
"intensity":1158},
{"mz":837.04,
"intensity":333},
{"mz":838.13,
"intensity":126},
{"mz":843.05,
"intensity":518},
{"mz":843.54,
"intensity":304},
{"mz":844.06,
"intensity":190},
{"mz":854.07,
"intensity":329},
{"mz":854.48,
"intensity":224},
{"mz":854.64,
"intensity":109},
{"mz":855.08,
"intensity":112},
{"mz":911.09,
"intensity":176},
{"mz":1073.22,
"intensity":117},
{"mz":1276.25,
"intensity":217},
{"mz":1321.21,
"intensity":587},
{"mz":1322.19,
"intensity":259},
{"mz":1438.29,
"intensity":337},
{"mz":1439.24,
"intensity":101},
{"mz":1440.18,
"intensity":100},
{"mz":1506.25,
"intensity":368},
{"mz":1507.17,
"intensity":272},
{"mz":1508.26,
"intensity":124},
{"mz":1524.25,
"intensity":217},
{"mz":1525.13,
"intensity":101},
{"mz":1525.26,
"intensity":110},
{"mz":2160.19,
"intensity":103},
{"mz":2160.33,
"intensity":121}]}