{
"spectrumId":"FM5A1G1S1",
"peaks":[

{"mz":367.88,
"intensity":112},
{"mz":762,
"intensity":263},
{"mz":762.54,
"intensity":191},
{"mz":835.08,
"intensity":378},
{"mz":936.12,
"intensity":255},
{"mz":936.61,
"intensity":160},
{"mz":937.08,
"intensity":278},
{"mz":937.58,
"intensity":140},
{"mz":945.17,
"intensity":122},
{"mz":945.61,
"intensity":134},
{"mz":988.12,
"intensity":119},
{"mz":997.15,
"intensity":101},
{"mz":997.64,
"intensity":110},
{"mz":1008.1,
"intensity":127},
{"mz":1483.24,
"intensity":311},
{"mz":1484.19,
"intensity":188},
{"mz":1668.24,
"intensity":158},
{"mz":1746.35,
"intensity":226},
{"mz":1747.31,
"intensity":188}
]
}
