{
"spectrumId":"FA1G1S1",
"peaks":[


{"mz":350.04,
"intensity":100},
{"mz":599.96,
"intensity":293},
{"mz":600.46,
"intensity":119},
{"mz":693.5,
"intensity":117},
{"mz":744.05,
"intensity":227},
{"mz":744.51,
"intensity":137},
{"mz":753.06,
"intensity":427},
{"mz":753.51,
"intensity":250},
{"mz":754.06,
"intensity":150},
{"mz":774.08,
"intensity":1210},
{"mz":774.56,
"intensity":855},
{"mz":775.02,
"intensity":388},
{"mz":775.59,
"intensity":117},
{"mz":796.03,
"intensity":108},
{"mz":817.03,
"intensity":239},
{"mz":835.06,
"intensity":709},
{"mz":836.08,
"intensity":239},
{"mz":846.04,
"intensity":172},
{"mz":1159.17,
"intensity":403},
{"mz":1159.41,
"intensity":105},
{"mz":1160.16,
"intensity":305},
{"mz":1261.18,
"intensity":200},
{"mz":1344.17,
"intensity":246},
{"mz":1345.15,
"intensity":174},
{"mz":1362.24,
"intensity":381},
{"mz":1363.25,
"intensity":183},
{"mz":2428.82,
"intensity":120}]}