{
"spectrumId":"F(6)A2G2S(6)2",
"peaks":[


{"mz":551.59,
"intensity":522},
{"mz":655.98,
"intensity":108},
{"mz":907.09,
"intensity":107},
{"mz":908.1,
"intensity":180},
{"mz":999.61,
"intensity":278},
{"mz":1000.08,
"intensity":200},
{"mz":1001.01,
"intensity":171},
{"mz":1038.75,
"intensity":122},
{"mz":1073.62,
"intensity":354},
{"mz":1074.11,
"intensity":267},
{"mz":1074.65,
"intensity":129},
{"mz":1075.16,
"intensity":127},
{"mz":1111.65,
"intensity":203},
{"mz":1112.13,
"intensity":134},
{"mz":1154.21,
"intensity":105},
{"mz":1163.13,
"intensity":128},
{"mz":1174.15,
"intensity":160},
{"mz":1174.68,
"intensity":109},
{"mz":1175.13,
"intensity":172},
{"mz":1175.69,
"intensity":224},
{"mz":1176.11,
"intensity":142},
{"mz":1551.35,
"intensity":101},
{"mz":1552.26,
"intensity":121},
{"mz":1709.35,
"intensity":188},
{"mz":1710.28,
"intensity":108},
{"mz":1712.2,
"intensity":110},
{"mz":1713.26,
"intensity":113},
{"mz":1787.44,
"intensity":161},
{"mz":1788.3,
"intensity":145},
{"mz":1858.31,
"intensity":133},
{"mz":1859.31,
"intensity":114},
{"mz":1916.47,
"intensity":276},
{"mz":2060.43,
"intensity":136},
{"mz":2062.46,
"intensity":262},
{"mz":2078.48,
"intensity":4171},
{"mz":2079.39,
"intensity":3721},
{"mz":2079.82,
"intensity":114},
{"mz":2080.42,
"intensity":1772},
{"mz":2081.34,
"intensity":878},
{"mz":2082.43,
"intensity":186},
{"mz":2331.22,
"intensity":313},
{"mz":2331.78,
"intensity":125}]}