{
"spectrumId":"FM5A1G1S(6)1",
"peaks":[

{"mz":350.11,
"intensity":124},
{"mz":368.07,
"intensity":167},
{"mz":503.91,
"intensity":213},
{"mz":569.94,
"intensity":115},
{"mz":572.88,
"intensity":122},
{"mz":599.93,
"intensity":149},
{"mz":655.05,
"intensity":470},
{"mz":656.07,
"intensity":304},
{"mz":681.04,
"intensity":555},
{"mz":681.53,
"intensity":396},
{"mz":682.01,
"intensity":380},
{"mz":682.48,
"intensity":108},
{"mz":687.97,
"intensity":103},
{"mz":743.57,
"intensity":103},
{"mz":753.02,
"intensity":182},
{"mz":762.03,
"intensity":1798},
{"mz":762.54,
"intensity":981},
{"mz":763.07,
"intensity":585},
{"mz":763.55,
"intensity":108},
{"mz":774.6,
"intensity":107},
{"mz":804.49,
"intensity":102},
{"mz":804.6,
"intensity":122},
{"mz":817.08,
"intensity":1286},
{"mz":818.08,
"intensity":346},
{"mz":819.14,
"intensity":144},
{"mz":825.06,
"intensity":158},
{"mz":826.09,
"intensity":128},
{"mz":833.56,
"intensity":344},
{"mz":834.1,
"intensity":302},
{"mz":834.62,
"intensity":201},
{"mz":835.09,
"intensity":2015},
{"mz":836.1,
"intensity":819},
{"mz":837.08,
"intensity":210},
{"mz":855.09,
"intensity":447},
{"mz":855.61,
"intensity":442},
{"mz":856.08,
"intensity":160},
{"mz":856.63,
"intensity":139},
{"mz":859.22,
"intensity":148},
{"mz":871.69,
"intensity":114},
{"mz":877.14,
"intensity":105},
{"mz":885.06,
"intensity":209},
{"mz":895.1,
"intensity":122},
{"mz":906.11,
"intensity":442},
{"mz":906.29,
"intensity":102},
{"mz":906.58,
"intensity":468},
{"mz":907.1,
"intensity":321},
{"mz":907.61,
"intensity":174},
{"mz":915.13,
"intensity":465},
{"mz":915.62,
"intensity":524},
{"mz":916.11,
"intensity":315},
{"mz":916.61,
"intensity":198},
{"mz":917.11,
"intensity":105},
{"mz":936.12,
"intensity":1275},
{"mz":936.63,
"intensity":1152},
{"mz":937.11,
"intensity":1066},
{"mz":937.61,
"intensity":624},
{"mz":938.12,
"intensity":312},
{"mz":938.63,
"intensity":201},
{"mz":945.1,
"intensity":451},
{"mz":945.6,
"intensity":274},
{"mz":967.07,
"intensity":219},
{"mz":967.62,
"intensity":124},
{"mz":968.19,
"intensity":126},
{"mz":987.13,
"intensity":172},
{"mz":988.12,
"intensity":535},
{"mz":988.61,
"intensity":430},
{"mz":989.09,
"intensity":214},
{"mz":997.14,
"intensity":789},
{"mz":997.64,
"intensity":827},
{"mz":998.13,
"intensity":385},
{"mz":1008.12,
"intensity":529},
{"mz":1008.62,
"intensity":469},
{"mz":1009.18,
"intensity":186},
{"mz":1009.56,
"intensity":150},
{"mz":1235.17,
"intensity":111},
{"mz":1321.13,
"intensity":114},
{"mz":1321.3,
"intensity":149},
{"mz":1423.22,
"intensity":110},
{"mz":1447.19,
"intensity":110},
{"mz":1465.1,
"intensity":109},
{"mz":1465.27,
"intensity":120},
{"mz":1466.22,
"intensity":162},
{"mz":1473.16,
"intensity":163},
{"mz":1483.25,
"intensity":1067},
{"mz":1483.64,
"intensity":137},
{"mz":1484.26,
"intensity":624},
{"mz":1485.23,
"intensity":442},
{"mz":1506.21,
"intensity":132},
{"mz":1507.24,
"intensity":141},
{"mz":1513.28,
"intensity":142},
{"mz":1524.28,
"intensity":161},
{"mz":1585.3,
"intensity":307},
{"mz":1586.17,
"intensity":187},
{"mz":1586.33,
"intensity":201},
{"mz":1587.2,
"intensity":149},
{"mz":1666.22,
"intensity":101},
{"mz":1668.28,
"intensity":948},
{"mz":1669.25,
"intensity":635},
{"mz":1670.23,
"intensity":430},
{"mz":1686.31,
"intensity":373},
{"mz":1687.26,
"intensity":303},
{"mz":1688.34,
"intensity":179},
{"mz":1746.45,
"intensity":316},
{"mz":1747.38,
"intensity":226},
{"mz":1749.25,
"intensity":116}
]
}
