{
"spectrumId":"FM2",
"peaks":[


{"mz":184.31,
"intensity":160},
{"mz":280.87,
"intensity":513},
{"mz":290.07,
"intensity":264},
{"mz":304.97,
"intensity":191},
{"mz":308.05,
"intensity":176},
{"mz":328.96,
"intensity":183},
{"mz":340.99,
"intensity":805},
{"mz":349.67,
"intensity":148},
{"mz":349.99,
"intensity":2350},
{"mz":350.98,
"intensity":380},
{"mz":364.91,
"intensity":919},
{"mz":366.03,
"intensity":363},
{"mz":368.04,
"intensity":963},
{"mz":369.35,
"intensity":137},
{"mz":383.01,
"intensity":1213},
{"mz":383.94,
"intensity":145},
{"mz":388.98,
"intensity":561},
{"mz":406.95,
"intensity":463},
{"mz":408.01,
"intensity":789},
{"mz":424.23,
"intensity":169},
{"mz":424.83,
"intensity":107},
{"mz":426.02,
"intensity":265},
{"mz":442.85,
"intensity":165},
{"mz":468.01,
"intensity":121},
{"mz":491.04,
"intensity":196},
{"mz":493.03,
"intensity":226},
{"mz":498,
"intensity":145},
{"mz":511.02,
"intensity":217},
{"mz":511.93,
"intensity":291},
{"mz":525.91,
"intensity":441},
{"mz":526.02,
"intensity":377},
{"mz":526.94,
"intensity":195},
{"mz":552.96,
"intensity":2488},
{"mz":554.04,
"intensity":282},
{"mz":570.03,
"intensity":217},
{"mz":570.91,
"intensity":306},
{"mz":571.08,
"intensity":178},
{"mz":572.09,
"intensity":112},
{"mz":600.04,
"intensity":206},
{"mz":609.91,
"intensity":248},
{"mz":610.92,
"intensity":517},
{"mz":623.41,
"intensity":103},
{"mz":629.01,
"intensity":115},
{"mz":647.04,
"intensity":113},
{"mz":670.98,
"intensity":266},
{"mz":689.07,
"intensity":1514},
{"mz":690.04,
"intensity":434},
{"mz":713.06,
"intensity":307},
{"mz":714.05,
"intensity":608},
{"mz":715,
"intensity":113},
{"mz":715.07,
"intensity":121},
{"mz":731.05,
"intensity":3969},
{"mz":732.03,
"intensity":2040},
{"mz":733,
"intensity":142},
{"mz":733.15,
"intensity":188},
{"mz":734.11,
"intensity":395},
{"mz":749.06,
"intensity":273},
{"mz":750.07,
"intensity":327},
{"mz":751.06,
"intensity":338},
{"mz":794.07,
"intensity":377},
{"mz":811.16,
"intensity":129},
{"mz":835.11,
"intensity":1177},
{"mz":835.53,
"intensity":124},
{"mz":836.17,
"intensity":204},
{"mz":853.11,
"intensity":2196},
{"mz":854.11,
"intensity":802},
{"mz":864.03,
"intensity":126},
{"mz":876.03,
"intensity":188},
{"mz":877.07,
"intensity":336},
{"mz":877.54,
"intensity":154},
{"mz":878.1,
"intensity":116},
{"mz":878.51,
"intensity":108},
{"mz":1863.91,
"intensity":421},
{"mz":1864.16,
"intensity":179},
{"mz":2429.93,
"intensity":307},
{"mz":2430.22,
"intensity":276}]}