{
    "melanoma":{
            "id":"0000002",
            "user_id":"0000001",
            "name":"Jodie Abrahams",
            "cellline":"IFG02",
            "date_created":30092019,
            "date_modified":30092019,
            "is_active":1,
            "cart_items":[
    { "glytoucan":"G62094ME", "ms":"_7724_FA1G1S1_361", "glycan":"FA1G1S1","mass":856.4 ,"rt":36.1,"relarea":0.009200135,"gs":"989323266"},
{ "glytoucan":"G40673VG", "ms":"_7724_M5_339", "glycan":"M5","mass":1235.5 ,"rt":33.9,"relarea":0.008221401,"gs":"287"},
{ "glytoucan":"G71309WZ", "ms":"_7724_A2G2S31_405", "glycan":"A2G2S(3)1","mass":965.97 ,"rt":40.5,"relarea":0.002159908,"gs":"707"},
{ "glytoucan":"G62094ME", "ms":"_7724_FA1G1S1_419", "glycan":"FA1G1S1","mass":856.4 ,"rt":41.9,"relarea":0.001203224,"gs":"989323266"},
{ "glytoucan":"", "ms":"_7724_FA2G2S6,32_453", "glycan":"F(6)A2G2S(6,3)2","mass":1184.46 ,"rt":45.3,"relarea":0.026980745,"gs":"989323229"},
{ "glytoucan":"G31639NG", "ms":"_7724_A3G3S2_494", "glycan":"A3G3S2","mass":1293.9 ,"rt":49.4,"relarea":0.000440702,"gs":"989323234"},
{ "glytoucan":"G18609BT", "ms":"_7724_A2G2S61_34", "glycan":"A2G2S(6)1","mass":965.97 ,"rt":34,"relarea":0.007603822,"gs":"210519019"},
{ "glytoucan":"G15956KF", "ms":"_7724_M6_282", "glycan":"M6","mass":698.33 ,"rt":28.2,"relarea":0.13909629,"gs":"27384"},
{ "glytoucan":"G02776IS", "ms":"_7724_FA2G1GalNAc1S2_441", "glycan":"FA2G1GalNAc1S2","mass":1204.88 ,"rt":44.1,"relarea":0.006093612,"gs":"989323233"},
{ "glytoucan":"G31639NG", "ms":"_7724_A3G3S2_432", "glycan":"A3G3S2","mass":1293.9 ,"rt":43.2,"relarea":0.001691658,"gs":"989323234"},
{ "glytoucan":"", "ms":"_7724_FA3G3S2_479", "glycan":"FA3G3S2","mass":1366.9 ,"rt":47.9,"relarea":0.000821918,"gs":"989323234"},
{ "glytoucan":"G45775XU", "ms":"_7724_FM4_351", "glycan":"FM4","mass":1219.4 ,"rt":35.1,"relarea":0.000775051,"gs":"880"},
{ "glytoucan":"G37070WM", "ms":"_7724_A3G3S3_498", "glycan":"A3G3S3","mass":1439.5 ,"rt":49.8,"relarea":0.000919141,"gs":"989323259"},
{ "glytoucan":"", "ms":"_7724_FA3G3S2_575", "glycan":"FA3G3S2","mass":1366.9 ,"rt":57.5,"relarea":0.000570866,"gs":"989323234"},
{ "glytoucan":"G62094ME", "ms":"_7724_FA1G1S1_425", "glycan":"FA1G1S1","mass":856.4 ,"rt":42.5,"relarea":0.002576552,"gs":"989323266"},
{ "glytoucan":"G13676RE", "ms":"_7724_FA4G4S4_547", "glycan":"FA4G4S4","mass":1226.8 ,"rt":54.7,"relarea":0.003015027,"gs":"989323244"},
{ "glytoucan":"G70248YW", "ms":"_7724_FA2G2S31_449", "glycan":"F(6)A2G2S(3)1","mass":1038.99 ,"rt":44.9,"relarea":0.005523157,"gs":"737"},
{ "glytoucan":"G81413UE", "ms":"_7724_FA2G2S61_383", "glycan":"F(6)A2G2S(6)1","mass":1038.99 ,"rt":38.3,"relarea":0.019727683,"gs":"989323246"},
{ "glytoucan":"G44201QD", "ms":"_7724_FM3_389", "glycan":"FM3","mass":1057.36 ,"rt":38.9,"relarea":0.028612751,"gs":"913"},
{ "glytoucan":"G31639NG", "ms":"_7724_A3G3S2_452", "glycan":"A3G3S2","mass":1293.9 ,"rt":45.2,"relarea":0.000538792,"gs":"989323234"},
{ "glytoucan":"G15956KF", "ms":"_7724_M6_302", "glycan":"M6","mass":698.33 ,"rt":30.2,"relarea":0.00712701,"gs":"27384"},
{ "glytoucan":"G16828VN", "ms":"_7724_M5A1G1_313", "glycan":"M5A1G1","mass":799.87 ,"rt":31.3,"relarea":0.004381919,"gs":"27932"},
{ "glytoucan":"", "ms":"_7724_FA3G3S2_466", "glycan":"FA3G3S2","mass":1366.9 ,"rt":46.6,"relarea":0.001972547,"gs":"989323234"},
{ "glytoucan":"", "ms":"_7724_FA2G2S2_426", "glycan":"F(6)A2G2S2","mass":1184.46 ,"rt":42.6,"relarea":0.004146013,"gs":"819"},
{ "glytoucan":"G00955WX", "ms":"_7724_A3G3S1_43", "glycan":"A3G3S1","mass":1148.4 ,"rt":43,"relarea":0.000362424,"gs":"989323239"},
{ "glytoucan":"G84467IZ", "ms":"_7724_A2G2S62_349", "glycan":"A2G2S(6)2","mass":1111.65 ,"rt":34.9,"relarea":0.00839218,"gs":"1249"},
{ "glytoucan":"G55982TK", "ms":"_7724_M4_282", "glycan":"M4","mass":1073.39 ,"rt":28.2,"relarea":0.006624032,"gs":"935"},
{ "glytoucan":"", "ms":"_7724_A1G1S1_38", "glycan":"A1G1S1","mass":783.34 ,"rt":38,"relarea":0.001234811,"gs":"989323231"},
{ "glytoucan":"G69812OF", "ms":"_7724_FA2_337", "glycan":"FA2","mass":731.34 ,"rt":33.7,"relarea":0.001553846,"gs":"735"},
{ "glytoucan":"", "ms":"_7724_FA2G2S2_486", "glycan":"F(6)A2G2S2","mass":1184.46 ,"rt":48.6,"relarea":0.003764421,"gs":"819"},
{ "glytoucan":"G13676RE", "ms":"_7724_FA4G4S4_57", "glycan":"FA4G4S4","mass":1226.8 ,"rt":57,"relarea":0.00294304,"gs":"989323244"},
{ "glytoucan":"", "ms":"_7724_A1G1S1_31", "glycan":"A1G1S1","mass":783.34 ,"rt":31,"relarea":0.003162631,"gs":"989323231"},
{ "glytoucan":"G55982TK", "ms":"_7724_M4_297", "glycan":"M4","mass":1073.39 ,"rt":29.7,"relarea":0.003863043,"gs":"935"},
{ "glytoucan":"G28826SH", "ms":"_7724_FA2G2_38", "glycan":"FA2G2","mass":893.32 ,"rt":38,"relarea":0.001405935,"gs":"731"},
{ "glytoucan":"G66723VB", "ms":"_7724_M8_281", "glycan":"M8","mass":860.45 ,"rt":28.1,"relarea":0.142705984,"gs":"616"},
{ "glytoucan":"G83594ZB", "ms":"_7724_FA2G2S62_384", "glycan":"F(6)A2G2S(6)2","mass":1184.46 ,"rt":38.4,"relarea":0.011149954,"gs":"83"},
{ "glytoucan":"G87618BG", "ms":"_7724_M7_279", "glycan":"M7","mass":779.39 ,"rt":27.9,"relarea":0.219796747,"gs":"617"},
{ "glytoucan":"G22768VO", "ms":"_7724_M3_316", "glycan":"M3","mass":911.39 ,"rt":31.6,"relarea":0.005297819,"gs":"597"},
{ "glytoucan":"G66723VB", "ms":"_7724_M8_31", "glycan":"M8","mass":860.45 ,"rt":31,"relarea":0.002909493,"gs":"616"},
{ "glytoucan":"G23472ZS", "ms":"_7724_FA3G3S1_395", "glycan":"FA3G3S1","mass":1221.4 ,"rt":39.5,"relarea":0.000505093,"gs":"989323239"},
{ "glytoucan":"G22768VO", "ms":"_7724_M3_25", "glycan":"M3","mass":911.39 ,"rt":25,"relarea":0.005293255,"gs":"597"},
{ "glytoucan":"G37166HP", "ms":"_7724_FM5A1G1S1_431", "glycan":"FM5A1G1S1","mass":1018.37 ,"rt":43.1,"relarea":0.001304571,"gs":"989323232"},
{ "glytoucan":"G45454HN", "ms":"_7724_M4A1G1S1_296", "glycan":"M4A1G1S1","mass":864.4 ,"rt":29.6,"relarea":0.011764902,"gs":"989323250"},
{ "glytoucan":"G00955WX", "ms":"_7724_A3G3S1_358", "glycan":"A3G3S1","mass":1148.4 ,"rt":35.8,"relarea":0.000236756,"gs":"989323239"},
{ "glytoucan":"G93107BF", "ms":"_7724_FM5A1G1S61_37", "glycan":"FM5A1G1S(6)1","mass":1018.37 ,"rt":37,"relarea":0.004721857,"gs":"7945"},
{ "glytoucan":"G92570PJ", "ms":"_7724_M5A1G1S1_324", "glycan":"M5A1G1S1","mass":945.47 ,"rt":32.4,"relarea":0.026874669,"gs":"989323257"},
{ "glytoucan":"G31639NG", "ms":"_7724_A3G3S2_466", "glycan":"A3G3S2","mass":1293.9 ,"rt":46.6,"relarea":0.001131348,"gs":"989323234"},
{ "glytoucan":"G13847GJ", "ms":"_7724_M9_296", "glycan":"M9","mass":941.42 ,"rt":29.6,"relarea":0.005543582,"gs":"297"},
{ "glytoucan":"G53342VT", "ms":"_7724_FA3G3S3_462", "glycan":"FA3G3S3","mass":1512.5 ,"rt":46.2,"relarea":0.002859231,"gs":"989323259"},
{ "glytoucan":"G99858XP", "ms":"_7724_FM5_402", "glycan":"FM5","mass":1381.5 ,"rt":40.2,"relarea":0.000608999,"gs":"1994"},
{ "glytoucan":"G53342VT", "ms":"_7724_FA3G3S3_541", "glycan":"FA3G3S3","mass":1512.5 ,"rt":54.1,"relarea":0.001192308,"gs":"989323259"},
{ "glytoucan":"", "ms":"_7724_FA2G2S32_509", "glycan":"F(6)A2G2S(3)2","mass":1184.46 ,"rt":50.9,"relarea":0.012042352,"gs":""},
{ "glytoucan":"G45775XU", "ms":"_7724_FM4_367", "glycan":"FM4","mass":1219.4 ,"rt":36.7,"relarea":0.001719665,"gs":"880"},
{ "glytoucan":"G81874HD", "ms":"_7724_FA1_408", "glycan":"FA1","mass":1260.5 ,"rt":40.8,"relarea":0.000292196,"gs":"911"},
{ "glytoucan":"G92975MH", "ms":"_7724_FA4G4S3_553", "glycan":"FA4G4S3","mass":1695.1 ,"rt":55.3,"relarea":0.002052573,"gs":"989323243"},
{ "glytoucan":"G40673VG", "ms":"_7724_M5_249", "glycan":"M5","mass":1235.5 ,"rt":24.9,"relarea":0.000942102,"gs":"287"},
{ "glytoucan":"G13847GJ", "ms":"_7724_M9_284", "glycan":"M9","mass":941.42 ,"rt":28.4,"relarea":0.091789978,"gs":"297"},
{ "glytoucan":"G83258AP", "ms":"_7724_FM4A1G1S31_414", "glycan":"FM4A1G1S(3)1","mass":937.42 ,"rt":41.4,"relarea":0.006408366,"gs":"989323258"},
{ "glytoucan":"G53342VT", "ms":"_7724_FA3G3S3_505", "glycan":"FA3G3S3","mass":1512.5 ,"rt":50.5,"relarea":0.002528525,"gs":"989323259"},
{ "glytoucan":"G92570PJ", "ms":"_7724_M5A1G1S1_392", "glycan":"M5A1G1S1","mass":945.47 ,"rt":39.2,"relarea":0.008136461,"gs":"989323257"},
{ "glytoucan":"G12775RU", "ms":"_7724_M9Glc1_30", "glycan":"M9Glc1","mass":1022.43 ,"rt":30,"relarea":0.005908071,"gs":"27712"},
{ "glytoucan":"G62094ME", "ms":"_7724_FA1G1S1_503", "glycan":"FA1G1S1","mass":856.4 ,"rt":50.3,"relarea":0.004002252,"gs":"989323266"},
{ "glytoucan":"G45522SR", "ms":"_7724_A2G2S3,62_448", "glycan":"A2G2S(3,6)2","mass":1111.65 ,"rt":44.8,"relarea":0.001845469,"gs":"989323267"},
{ "glytoucan":"G31886NL", "ms":"_7724_M2_259", "glycan":"M2","mass":749.36 ,"rt":25.9,"relarea":0.015167918,"gs":"706"},
{ "glytoucan":"G80123ZU", "ms":"_7724_A2G2S6,32_415", "glycan":"A2G2S(6,3)2","mass":1111.65 ,"rt":41.5,"relarea":0.013034753,"gs":"989323228"},
{ "glytoucan":"", "ms":"_7724_FA3G3S2_501", "glycan":"FA3G3S2","mass":1366.9 ,"rt":50.1,"relarea":0.002080988,"gs":"989323234"},
{ "glytoucan":"G37070WM", "ms":"_7724_A3G3S3_432", "glycan":"A3G3S3","mass":1439.5 ,"rt":43.2,"relarea":0.000394569,"gs":"989323259"},
{ "glytoucan":"G45454HN", "ms":"_7724_M4A1G1S1_373", "glycan":"M4A1G1S1","mass":864.4 ,"rt":37.3,"relarea":0.005553535,"gs":"989323250"},
{ "glytoucan":"G53342VT", "ms":"_7724_FA3G3S3_527", "glycan":"FA3G3S3","mass":1512.5 ,"rt":52.7,"relarea":0.004478297,"gs":"989323259"},
{ "glytoucan":"", "ms":"_7724_FA3G3S2_525", "glycan":"FA3G3S2","mass":1366.9 ,"rt":52.5,"relarea":0.001033643,"gs":"989323234"},
{ "glytoucan":"G42466VF", "ms":"_7724_FM2_332", "glycan":"FM2","mass":895.42 ,"rt":33.2,"relarea":0.033577555,"gs":"625"},
{ "glytoucan":"G53342VT", "ms":"_7724_FA3G3S3_569", "glycan":"FA3G3S3","mass":1512.5 ,"rt":56.9,"relarea":0.001751063,"gs":"989323259"},
{ "glytoucan":"", "ms":"_7724_FA3G3S2_429", "glycan":"FA3G3S2","mass":1366.9 ,"rt":42.9,"relarea":0.000563721,"gs":"989323234"},
{ "glytoucan":"G37070WM", "ms":"_7724_A3G3S3_468", "glycan":"A3G3S3","mass":1439.5 ,"rt":46.8,"relarea":0.000297783,"gs":"989323259"},
{ "glytoucan":"G81874HD", "ms":"_7724_FA1_318", "glycan":"FA1","mass":1260.5 ,"rt":31.8,"relarea":0.000171426,"gs":"911"},
{ "glytoucan":"G13676RE", "ms":"_7724_FA4G4S4_584", "glycan":"FA4G4S4","mass":1226.8 ,"rt":58.4,"relarea":0.001714272,"gs":"989323244"},
{ "glytoucan":"", "ms":"_7724_FA2G1S61_368", "glycan":"F(6)A2G1S(6)1","mass":957.34 ,"rt":36.8,"relarea":0.001323964,"gs":"989323235"},
{ "glytoucan":"G92975MH", "ms":"_7724_FA4G4S3_528", "glycan":"FA4G4S3","mass":1695.1 ,"rt":52.8,"relarea":0.001028901,"gs":"989323243"},
{ "glytoucan":"G30439IP", "ms":"_7724_FM4A1G1S61_344", "glycan":"FM4A1G1S(6)1","mass":937.42 ,"rt":34.4,"relarea":0.015604621,"gs":"7909"},
{ "glytoucan":"G81328FA", "ms":"_7724_A2G2S32_471", "glycan":"A2G2S(3)2","mass":1111.65 ,"rt":47.1,"relarea":0.003030892,"gs":"801"}
]
    }
}
