{
"spectrumId":"M2",
"peaks":[


{"mz":340.63,
"intensity":166},
{"mz":340.94,
"intensity":185},
{"mz":382.95,
"intensity":162},
{"mz":730.52,
"intensity":131},
{"mz":737.02,
"intensity":286},
{"mz":742.44,
"intensity":150},
{"mz":852.82,
"intensity":307}]}