{
"spectrumId":"M3",
"peaks":[

{"mz":334.98,
"intensity":124},
{"mz":340.98,
"intensity":287},
{"mz":364.98,
"intensity":147},
{"mz":366.05,
"intensity":144},
{"mz":382.96,
"intensity":4684},
{"mz":383.7,
"intensity":135},
{"mz":383.99,
"intensity":550},
{"mz":406.98,
"intensity":145},
{"mz":412.92,
"intensity":147},
{"mz":425.02,
"intensity":446},
{"mz":425.95,
"intensity":104},
{"mz":442.95,
"intensity":759},
{"mz":443.94,
"intensity":169},
{"mz":448.2,
"intensity":111},
{"mz":484.06,
"intensity":128},
{"mz":502.93,
"intensity":234},
{"mz":526.95,
"intensity":190},
{"mz":544.95,
"intensity":1605},
{"mz":545.97,
"intensity":280},
{"mz":586.94,
"intensity":511},
{"mz":588.01,
"intensity":264},
{"mz":604.9,
"intensity":243},
{"mz":605.98,
"intensity":123},
{"mz":628.99,
"intensity":104},
{"mz":647.07,
"intensity":104},
{"mz":688.02,
"intensity":721},
{"mz":689.01,
"intensity":106},
{"mz":689.99,
"intensity":108},
{"mz":731.03,
"intensity":162},
{"mz":749.1,
"intensity":907},
{"mz":750.04,
"intensity":178},
{"mz":791.08,
"intensity":266},
{"mz":809.09,
"intensity":570},
{"mz":809.96,
"intensity":140},
{"mz":810.14,
"intensity":366},
{"mz":851.11,
"intensity":1665},
{"mz":852.08,
"intensity":651},
{"mz":869.1,
"intensity":792},
{"mz":870.13,
"intensity":433},
{"mz":892.13,
"intensity":139},
{"mz":893.16,
"intensity":159}
]
}
