{
"spectrumId":"FM5A1G1S(6)1",
"peaks":[


{"mz":368,
"intensity":109},
{"mz":481.31,
"intensity":107},
{"mz":502.88,
"intensity":215},
{"mz":565.85,
"intensity":126},
{"mz":634.6,
"intensity":109},
{"mz":680.95,
"intensity":102},
{"mz":762.03,
"intensity":355},
{"mz":762.99,
"intensity":126},
{"mz":817.04,
"intensity":165},
{"mz":834.58,
"intensity":178},
{"mz":835.08,
"intensity":416},
{"mz":836.08,
"intensity":198},
{"mz":855.51,
"intensity":157},
{"mz":871.52,
"intensity":127},
{"mz":906.03,
"intensity":111},
{"mz":906.52,
"intensity":149},
{"mz":906.69,
"intensity":102},
{"mz":907.07,
"intensity":328},
{"mz":915.1,
"intensity":319},
{"mz":936.1,
"intensity":358},
{"mz":936.66,
"intensity":218},
{"mz":937.11,
"intensity":463},
{"mz":937.63,
"intensity":120},
{"mz":945.12,
"intensity":134},
{"mz":958.04,
"intensity":143},
{"mz":986.57,
"intensity":193},
{"mz":988.11,
"intensity":169},
{"mz":989.15,
"intensity":137},
{"mz":997.16,
"intensity":202},
{"mz":997.6,
"intensity":202},
{"mz":998.11,
"intensity":114},
{"mz":1008.18,
"intensity":105},
{"mz":1009.65,
"intensity":129},
{"mz":1321.19,
"intensity":131},
{"mz":1483.12,
"intensity":117},
{"mz":1483.3,
"intensity":107},
{"mz":1484.25,
"intensity":165},
{"mz":1583.28,
"intensity":108},
{"mz":1585.25,
"intensity":157},
{"mz":1668.27,
"intensity":163},
{"mz":1687.25,
"intensity":111}]}