"name","mass","charge","hex","hexnac","dhex","neunac","charge-2","mi","glycoprotein_standard_id","css","mode","native_structure","glycoprotein_standard_id-2","ionmob_gas_id","name-2","adduct_id"
"Dextran","0",0,"0","0","0","0",0,"0",6,"105.6","negative",NULL,6,1,"He",NULL
"Dextran","0",0,"0","0","0","0",0,"0",6,"107.65","negative",NULL,6,1,"He",NULL
"Dextran","0",0,"0","0","0","0",0,"0",6,"107.73","negative",NULL,6,1,"He",NULL
"Dextran","0",0,"0","0","0","0",0,"0",6,"110.64","negative",NULL,6,1,"He",NULL
"Dextran","0",0,"0","0","0","0",0,"0",6,"121.8","negative",NULL,6,1,"He",NULL
"Dextran","0",0,"0","0","0","0",0,"0",3,"123.61","negative",NULL,3,1,"He",NULL
"Dextran","0",0,"0","0","0","0",0,"0",6,"124.93","negative",NULL,6,1,"He",NULL
"Dextran","0",0,"0","0","0","0",0,"0",6,"126.09","negative",NULL,6,1,"He",NULL
"Dextran","0",0,"0","0","0","0",0,"0",6,"130.52","negative",NULL,6,1,"He",NULL
"Dextran","0",0,"0","0","0","0",0,"0",3,"130.76","negative",NULL,3,1,"He",NULL
"Dextran","0",0,"0","0","0","0",0,"0",4,"132.07","negative",NULL,4,1,"He",NULL
"Dextran","0",0,"0","0","0","0",0,"0",3,"138.13","negative",NULL,3,1,"He",NULL
"Dextran","0",0,"0","0","0","0",0,"0",4,"139.53","negative",NULL,4,1,"He",NULL
"Dextran","0",0,"0","0","0","0",0,"0",3,"142.29","negative",NULL,3,1,"He",NULL
"Dextran","0",0,"0","0","0","0",0,"0",3,"142.51","negative",NULL,3,1,"He",NULL
"Dextran","0",0,"0","0","0","0",0,"0",4,"144.19","negative",NULL,4,1,"He",NULL
"Dextran","0",0,"0","0","0","0",0,"0",4,"144.97","negative",NULL,4,1,"He",NULL
"Dextran","0",0,"0","0","0","0",0,"0",3,"145.4","negative",NULL,3,1,"He",NULL
"Dextran","0",0,"0","0","0","0",0,"0",4,"146.28","negative",NULL,4,1,"He",NULL
"Dextran","0",0,"0","0","0","0",0,"0",6,"146.77","negative",NULL,6,1,"He",NULL
"Dextran","0",0,"0","0","0","0",0,"0",3,"147.11","negative",NULL,3,1,"He",NULL
"Dextran","0",0,"0","0","0","0",0,"0",4,"148.15","negative",NULL,4,1,"He",NULL
"Dextran","0",0,"0","0","0","0",0,"0",4,"148.35","negative",NULL,4,1,"He",NULL
"Dextran","0",0,"0","0","0","0",0,"0",4,"148.74","negative",NULL,4,1,"He",NULL
"Dextran","0",0,"0","0","0","0",0,"0",3,"149.19","negative",NULL,3,1,"He",NULL
"Dextran","0",0,"0","0","0","0",0,"0",6,"149.26","negative",NULL,6,1,"He",NULL
"Dextran","0",0,"0","0","0","0",0,"0",6,"151.88","negative",NULL,6,1,"He",NULL
"Dextran","0",0,"0","0","0","0",0,"0",3,"155.76","negative",NULL,3,1,"He",NULL
"Dextran","0",0,"0","0","0","0",0,"0",3,"158.23","negative",NULL,3,1,"He",NULL
"Dextran","0",0,"0","0","0","0",0,"0",3,"160.59","negative",NULL,3,1,"He",NULL
"Dextran","0",0,"0","0","0","0",0,"0",4,"164.42","negative",NULL,4,1,"He",NULL
"Dextran","0",0,"0","0","0","0",0,"0",4,"168.4","negative",NULL,4,1,"He",NULL
"Dextran","0",0,"0","0","0","0",0,"0",3,"168.52","negative",NULL,3,1,"He",NULL
"Dextran","0",0,"0","0","0","0",0,"0",3,"168.65","negative",NULL,3,1,"He",NULL
"Dextran","0",0,"0","0","0","0",0,"0",3,"170.35","negative",NULL,3,1,"He",NULL
"Dextran","0",0,"0","0","0","0",0,"0",6,"172.09","negative",NULL,6,1,"He",NULL
"Dextran","0",0,"0","0","0","0",0,"0",3,"174.31","negative",NULL,3,1,"He",NULL
"Dextran","0",0,"0","0","0","0",0,"0",3,"175.26","negative",NULL,3,1,"He",NULL
"Dextran","0",0,"0","0","0","0",0,"0",3,"177.9","negative",NULL,3,1,"He",NULL
"Dextran","0",0,"0","0","0","0",0,"0",3,"181.81","negative",NULL,3,1,"He",NULL
"Dextran","0",0,"0","0","0","0",0,"0",3,"182.55","negative",NULL,3,1,"He",NULL
"Dextran","0",0,"0","0","0","0",0,"0",3,"182.64","negative",NULL,3,1,"He",NULL
"Dextran","0",0,"0","0","0","0",0,"0",6,"184.58","negative",NULL,6,1,"He",NULL
"Dextran","0",0,"0","0","0","0",0,"0",3,"188.07","negative",NULL,3,1,"He",NULL
"Dextran","0",0,"0","0","0","0",0,"0",3,"188.38","negative",NULL,3,1,"He",NULL
"Dextran","0",0,"0","0","0","0",0,"0",3,"189.75","negative",NULL,3,1,"He",NULL
"Dextran","0",0,"0","0","0","0",0,"0",4,"190.85","negative",NULL,4,1,"He",NULL
"Dextran","0",0,"0","0","0","0",0,"0",3,"191.78","negative",NULL,3,1,"He",NULL
"Dextran","0",0,"0","0","0","0",0,"0",6,"194.14","negative",NULL,6,1,"He",NULL
"Dextran","0",0,"0","0","0","0",0,"0",3,"196.58","negative",NULL,3,1,"He",NULL
"Dextran","0",0,"0","0","0","0",0,"0",3,"197.4","negative",NULL,3,1,"He",NULL
"Dextran","0",0,"0","0","0","0",0,"0",3,"198.76","negative",NULL,3,1,"He",NULL
"Dextran","0",0,"0","0","0","0",0,"0",3,"201.85","negative",NULL,3,1,"He",NULL
"Dextran","0",0,"0","0","0","0",0,"0",3,"202.32","negative",NULL,3,1,"He",NULL
"Dextran","0",0,"0","0","0","0",0,"0",3,"203.65","negative",NULL,3,1,"He",NULL
"Dextran","0",0,"0","0","0","0",0,"0",4,"210.12","negative",NULL,4,1,"He",NULL
"Dextran","0",0,"0","0","0","0",0,"0",6,"211.15","negative",NULL,6,1,"He",NULL
"Dextran","0",0,"0","0","0","0",0,"0",3,"211.57","negative",NULL,3,1,"He",NULL
"Dextran","0",0,"0","0","0","0",0,"0",3,"212.39","negative",NULL,3,1,"He",NULL
"Dextran","0",0,"0","0","0","0",0,"0",3,"212.77","negative",NULL,3,1,"He",NULL
"Dextran","0",0,"0","0","0","0",0,"0",3,"213.21","negative",NULL,3,1,"He",NULL
"Dextran","0",0,"0","0","0","0",0,"0",3,"213.69","negative",NULL,3,1,"He",NULL
"Dextran","0",0,"0","0","0","0",0,"0",3,"214.18","negative",NULL,3,1,"He",NULL
"Dextran","0",0,"0","0","0","0",0,"0",3,"215.05","negative",NULL,3,1,"He",NULL
"Dextran","0",0,"0","0","0","0",0,"0",3,"215.19","negative",NULL,3,1,"He",NULL
"Dextran","0",0,"0","0","0","0",0,"0",3,"215.33","negative",NULL,3,1,"He",NULL
"Dextran","0",0,"0","0","0","0",0,"0",3,"215.8","negative",NULL,3,1,"He",NULL
"Dextran","0",0,"0","0","0","0",0,"0",4,"218.89","negative",NULL,4,1,"He",NULL
"Dextran","0",0,"0","0","0","0",0,"0",3,"222.49","negative",NULL,3,1,"He",NULL
"Dextran","0",0,"0","0","0","0",0,"0",3,"223.59","negative",NULL,3,1,"He",NULL
"Dextran","0",0,"0","0","0","0",0,"0",3,"224.61","negative",NULL,3,1,"He",NULL
"Dextran","0",0,"0","0","0","0",0,"0",4,"225.5","negative",NULL,4,1,"He",NULL
"Dextran","0",0,"0","0","0","0",0,"0",4,"228.62","negative",NULL,4,1,"He",NULL
"Dextran","0",0,"0","0","0","0",0,"0",4,"231.09","negative",NULL,4,1,"He",NULL
"Dextran","0",0,"0","0","0","0",0,"0",3,"231.82","negative",NULL,3,1,"He",NULL
"Dextran","0",0,"0","0","0","0",0,"0",4,"233.21","negative",NULL,4,1,"He",NULL
"Dextran","0",0,"0","0","0","0",0,"0",3,"234.55","negative",NULL,3,1,"He",NULL
"Dextran","0",0,"0","0","0","0",0,"0",4,"234.71","negative",NULL,4,1,"He",NULL
"Dextran","0",0,"0","0","0","0",0,"0",3,"240.76","negative",NULL,3,1,"He",NULL
"Dextran","0",0,"0","0","0","0",0,"0",3,"240.93","negative",NULL,3,1,"He",NULL
"Dextran","0",0,"0","0","0","0",0,"0",3,"241.96","negative",NULL,3,1,"He",NULL
"Dextran","0",0,"0","0","0","0",0,"0",4,"244.53","negative",NULL,4,1,"He",NULL
"Dextran","0",0,"0","0","0","0",0,"0",3,"245.82","negative",NULL,3,1,"He",NULL
"Dextran","0",0,"0","0","0","0",0,"0",3,"252.6","negative",NULL,3,1,"He",NULL
"Dextran","0",0,"0","0","0","0",0,"0",3,"252.89","negative",NULL,3,1,"He",NULL
"Dextran","0",0,"0","0","0","0",0,"0",4,"254.25","negative",NULL,4,1,"He",NULL
"Dextran","0",0,"0","0","0","0",0,"0",3,"254.67","negative",NULL,3,1,"He",NULL
"Dextran","0",0,"0","0","0","0",0,"0",3,"259.24","negative",NULL,3,1,"He",NULL
"Dextran","0",0,"0","0","0","0",0,"0",3,"259.5","negative",NULL,3,1,"He",NULL
"Dextran","0",0,"0","0","0","0",0,"0",3,"259.88","negative",NULL,3,1,"He",NULL
"Dextran","0",0,"0","0","0","0",0,"0",4,"260.05","negative",NULL,4,1,"He",NULL
"Dextran","0",0,"0","0","0","0",0,"0",4,"260.59","negative",NULL,4,1,"He",NULL
"Dextran","0",0,"0","0","0","0",0,"0",3,"260.79","negative",NULL,3,1,"He",NULL
"Dextran","0",0,"0","0","0","0",0,"0",3,"260.85","negative",NULL,3,1,"He",NULL
"Dextran","0",0,"0","0","0","0",0,"0",4,"261.58","negative",NULL,4,1,"He",NULL
"Dextran","0",0,"0","0","0","0",0,"0",4,"262.41","negative",NULL,4,1,"He",NULL
"Dextran","0",0,"0","0","0","0",0,"0",3,"263.14","negative",NULL,3,1,"He",NULL
"Dextran","0",0,"0","0","0","0",0,"0",4,"263.43","negative",NULL,4,1,"He",NULL
"Dextran","0",0,"0","0","0","0",0,"0",3,"264.82","negative",NULL,3,1,"He",NULL
"Dextran","0",0,"0","0","0","0",0,"0",3,"267.55","negative",NULL,3,1,"He",NULL
"Dextran","0",0,"0","0","0","0",0,"0",4,"268.16","negative",NULL,4,1,"He",NULL
"Dextran","0",0,"0","0","0","0",0,"0",4,"268.33","negative",NULL,4,1,"He",NULL
"Dextran","0",0,"0","0","0","0",0,"0",3,"269.12","negative",NULL,3,1,"He",NULL
"Dextran","0",0,"0","0","0","0",0,"0",3,"270.54","negative",NULL,3,1,"He",NULL
"Dextran","0",0,"0","0","0","0",0,"0",6,"274.39","negative",NULL,6,1,"He",NULL
"Dextran","0",0,"0","0","0","0",0,"0",4,"279.12","negative",NULL,4,1,"He",NULL
"Dextran","0",0,"0","0","0","0",0,"0",3,"279.4","negative",NULL,3,1,"He",NULL
"Dextran","0",0,"0","0","0","0",0,"0",3,"279.44","negative",NULL,3,1,"He",NULL
"Dextran","0",0,"0","0","0","0",0,"0",3,"279.61","negative",NULL,3,1,"He",NULL
"Dextran","0",0,"0","0","0","0",0,"0",6,"279.92","negative",NULL,6,1,"He",NULL
"Dextran","0",0,"0","0","0","0",0,"0",6,"282.27","negative",NULL,6,1,"He",NULL
"Dextran","0",0,"0","0","0","0",0,"0",6,"283","negative",NULL,6,1,"He",NULL
"Dextran","0",0,"0","0","0","0",0,"0",3,"283.38","negative",NULL,3,1,"He",NULL
"Dextran","0",0,"0","0","0","0",0,"0",6,"285.38","negative",NULL,6,1,"He",NULL
"Dextran","0",0,"0","0","0","0",0,"0",6,"285.76","negative",NULL,6,1,"He",NULL
"Dextran","0",0,"0","0","0","0",0,"0",3,"285.99","negative",NULL,3,1,"He",NULL
"Dextran","0",0,"0","0","0","0",0,"0",6,"286.37","negative",NULL,6,1,"He",NULL
"Dextran","0",0,"0","0","0","0",0,"0",6,"286.51","negative",NULL,6,1,"He",NULL
"Dextran","0",0,"0","0","0","0",0,"0",3,"289.47","negative",NULL,3,1,"He",NULL
"Dextran","0",0,"0","0","0","0",0,"0",4,"290.1","negative",NULL,4,1,"He",NULL
"Dextran","0",0,"0","0","0","0",0,"0",4,"291.12","negative",NULL,4,1,"He",NULL
"Dextran","0",0,"0","0","0","0",0,"0",3,"291.19","negative",NULL,3,1,"He",NULL
"Dextran","0",0,"0","0","0","0",0,"0",6,"292.05","negative",NULL,6,1,"He",NULL
"Dextran","0",0,"0","0","0","0",0,"0",6,"293.18","negative",NULL,6,1,"He",NULL
"Dextran","0",0,"0","0","0","0",0,"0",6,"295.66","negative",NULL,6,1,"He",NULL
"Dextran","0",0,"0","0","0","0",0,"0",4,"295.76","negative",NULL,4,1,"He",NULL
"Dextran","0",0,"0","0","0","0",0,"0",3,"300.41","negative",NULL,3,1,"He",NULL
"Dextran","0",0,"0","0","0","0",0,"0",6,"301.97","negative",NULL,6,1,"He",NULL
"Dextran","0",0,"0","0","0","0",0,"0",3,"304.01","negative",NULL,3,1,"He",NULL
"Dextran","0",0,"0","0","0","0",0,"0",3,"304.52","negative",NULL,3,1,"He",NULL
"Dextran","0",0,"0","0","0","0",0,"0",6,"304.82","negative",NULL,6,1,"He",NULL
"Dextran","0",0,"0","0","0","0",0,"0",6,"307.4","negative",NULL,6,1,"He",NULL
"Dextran","0",0,"0","0","0","0",0,"0",6,"307.8","negative",NULL,6,1,"He",NULL
"Dextran","0",0,"0","0","0","0",0,"0",4,"310.1","negative",NULL,4,1,"He",NULL
"Dextran","0",0,"0","0","0","0",0,"0",3,"310.22","negative",NULL,3,1,"He",NULL
"Dextran","0",0,"0","0","0","0",0,"0",3,"311.08","negative",NULL,3,1,"He",NULL
"Dextran","0",0,"0","0","0","0",0,"0",6,"311.77","negative",NULL,6,1,"He",NULL
"Dextran","0",0,"0","0","0","0",0,"0",6,"311.78","negative",NULL,6,1,"He",NULL
"Dextran","0",0,"0","0","0","0",0,"0",6,"313.8","negative",NULL,6,1,"He",NULL
"Dextran","0",0,"0","0","0","0",0,"0",3,"314.78","negative",NULL,3,1,"He",NULL
"Dextran","0",0,"0","0","0","0",0,"0",3,"315.1","negative",NULL,3,1,"He",NULL
"Dextran","0",0,"0","0","0","0",0,"0",6,"315.48","negative",NULL,6,1,"He",NULL
"Dextran","0",0,"0","0","0","0",0,"0",4,"317.2","negative",NULL,4,1,"He",NULL
"Dextran","0",0,"0","0","0","0",0,"0",3,"320.43","negative",NULL,3,1,"He",NULL
"Dextran","0",0,"0","0","0","0",0,"0",6,"320.48","negative",NULL,6,1,"He",NULL
"Dextran","0",0,"0","0","0","0",0,"0",6,"323.65","negative",NULL,6,1,"He",NULL
"Dextran","0",0,"0","0","0","0",0,"0",6,"323.74","negative",NULL,6,1,"He",NULL
"Dextran","0",0,"0","0","0","0",0,"0",3,"323.9","negative",NULL,3,1,"He",NULL
"Dextran","0",0,"0","0","0","0",0,"0",6,"324.56","negative",NULL,6,1,"He",NULL
"Dextran","0",0,"0","0","0","0",0,"0",6,"326.6","negative",NULL,6,1,"He",NULL
"Dextran","0",0,"0","0","0","0",0,"0",3,"328.01","negative",NULL,3,1,"He",NULL
"Dextran","0",0,"0","0","0","0",0,"0",3,"330.77","negative",NULL,3,1,"He",NULL
"Dextran","0",0,"0","0","0","0",0,"0",3,"330.98","negative",NULL,3,1,"He",NULL
"Dextran","0",0,"0","0","0","0",0,"0",6,"332.07","negative",NULL,6,1,"He",NULL
"Dextran","0",0,"0","0","0","0",0,"0",4,"332.73","negative",NULL,4,1,"He",NULL
"Dextran","0",0,"0","0","0","0",0,"0",3,"339.98","negative",NULL,3,1,"He",NULL
"Dextran","0",0,"0","0","0","0",0,"0",3,"344.54","negative",NULL,3,1,"He",NULL
"Dextran","0",0,"0","0","0","0",0,"0",3,"350.28","negative",NULL,3,1,"He",NULL
"Dextran","0",0,"0","0","0","0",0,"0",3,"356.48","negative",NULL,3,1,"He",NULL
"Dextran","0",0,"0","0","0","0",0,"0",6,"374.28","negative",NULL,6,1,"He",NULL
"Dextran","406.1355",1,"2","1","0","0",1,NULL,2,"111.64","negative","y",2,1,"He",NULL
"Dextran","526.1777",1,"2","1","0","0",1,NULL,2,"124.57","negative","y",2,1,"He",NULL
"Dextran","602.1938",1,"3","1","0","0",1,NULL,2,"137.78","negative","y",2,1,"He",NULL
"Dextran","673.2309",1,"2","1","0","1",1,NULL,2,"173.76","negative","y",2,1,"He",NULL
"Dextran","715.2415",1,"2","1","0","1",1,NULL,2,"167.86","negative","y",2,1,"He",NULL
"Dextran","845.2446",1,"2","2","0","0",1,NULL,4,"178.75","negative","y",4,1,"He",NULL
"Dextran","845.3045",1,"3","2","0","0",1,NULL,2,"183.6","negative","y",2,1,"He",NULL
"Dextran","917.2657",2,"5","4","0","0",2,NULL,2,"298.28","negative","y",2,1,"He",NULL
"Dextran","958.6629",3,"6","5","0","3",3,NULL,2,"430.42","negative","y",2,1,"He",NULL
"Dextran","1007.2974",1,"3","2","0","0",1,NULL,3,"200.89","negative","y",3,1,"He",NULL
"Dextran","1007.2974",1,"3","2","0","0",1,NULL,4,"201.92","negative","y",4,1,"He",NULL
"Dextran","1013.825",2,"5","4","0","1",2,NULL,2,"330.24","negative","y",2,1,"He",NULL
"Dextran","1038.3631",1,"2","2","0","1",1,NULL,2,"226.62","negative","y",2,1,"He",NULL
"Dextran","1099.8318",2,"6","5","0","0",2,NULL,2,"336.65","negative","y",2,1,"He",NULL
"Dextran","1110.3842",2,"5","4","0","2",2,NULL,2,"361.75","negative","y",2,1,"He",NULL
"Dextran","1169.3502",1,"4","2","0","0",1,NULL,3,"231.67","negative","y",3,1,"He",NULL
"Dextran","1169.3502",1,"4","2","0","0",1,NULL,4,"233.57","negative","y",4,1,"He",NULL
"Dextran","1169.3502",1,"4","2","0","0",1,NULL,6,"234.2","negative","y",6,1,"He",NULL
"Dextran","1196.3911",2,"6","5","0","1",2,NULL,2,"367.99","negative","y",2,1,"He",NULL
"Dextran","1210.3768",1,"3","3","0","0",1,NULL,3,"236.6","negative","y",3,1,"He",NULL
"Dextran","1292.9503",2,"6","5","0","2",2,NULL,2,"401.28","negative","y",2,1,"He",NULL
"Dextran","1331.403",1,"5","2","0","0",1,NULL,4,"263.19","negative","y",4,1,"He",NULL
"Dextran","1331.403",1,"5","2","0","0",1,NULL,3,"265.34","negative","y",3,1,"He",NULL
"Dextran","1331.403",1,"5","2","0","0",1,NULL,6,"265.95","negative","y",6,1,"He",NULL
"Dextran","1372.4296",1,"4","3","0","0",1,NULL,3,"259.19","negative","y",3,1,"He",NULL
"Dextran","1413.4561",1,"3","4","0","0",1,NULL,3,"273.95","negative","y",3,1,"He",NULL
"Dextran","1438.498",2,"6","5","0","3",2,NULL,2,"437.89","negative","y",2,1,"He",NULL
"Dextran","1493.4559",1,"6","2","0","0",1,NULL,6,"291.85","negative","y",6,1,"He",NULL
"Dextran","1493.4559",1,"6","2","0","0",1,NULL,4,"291.94","negative","y",4,1,"He",NULL
"Dextran","1493.4559",1,"6","2","0","0",1,NULL,3,"299.54","negative","y",3,1,"He",NULL
"Dextran","1518.4675",1,"4","3","1","0",1,NULL,6,"293.8","negative","y",6,1,"He",NULL
"Dextran","1534.4824",1,"5","3","0","0",1,NULL,3,"297.38","negative","y",3,1,"He",NULL
"Dextran","1575.509",1,"4","4","0","0",1,NULL,3,"293.67","negative","y",3,1,"He",NULL
"Dextran","1616.5355",1,"3","5","0","0",1,NULL,3,"309.25","negative","y",3,1,"He",NULL
"Dextran","1655.5087",1,"7","2","0","0",1,NULL,6,"312.34","negative","y",6,1,"He",NULL
"Dextran","1655.5087",1,"7","2","0","0",1,NULL,3,"316.61","negative","y",3,1,"He",NULL
"Dextran","1655.509",1,"7","2","0","0",1,NULL,4,"313.28","negative","y",4,1,"He",NULL
"Dextran","1711.606",1,"4","3","0","1",1,NULL,6,"320.49","negative","y",6,1,"He",NULL
"Dextran","1721.5669",1,"4","4","1","0",1,NULL,6,"321.78","negative","y",6,1,"He",NULL
"Dextran","1737.5618",1,"5","4","0","0",1,NULL,2,"302.62","negative","y",2,1,"He",NULL
"Dextran","1737.5618",1,"6","3","0","0",1,NULL,3,"320.13","negative","y",3,1,"He",NULL
"Dextran","1778.5883",1,"4","5","0","0",1,NULL,3,"327.93","negative","y",3,1,"He",NULL
"Dextran","1817.5615",1,"8","2","0","0",1,NULL,6,"332.71","negative","y",6,1,"He",NULL
"Dextran","1817.5615",1,"8","2","0","0",1,NULL,4,"338.74","negative","y",4,1,"He",NULL
"Dextran","1819.6149",1,"3","6","0","0",1,NULL,3,"337.04","negative","y",3,1,"He",NULL
"Dextran","1883.6197",1,"5","4","1","0",1,NULL,6,"338.31","negative","y",6,1,"He",NULL
"Dextran","1914.6854",1,"4","4","1","1",1,NULL,6,"352.59","negative","y",6,1,"He",NULL
"Dextran","1930.6803",1,"6","5","0","1",1,NULL,2,"337.78","negative","y",2,1,"He",NULL
"Dextran","1940.6412",1,"5","5","0","0",1,NULL,3,"344.03","negative","y",3,1,"He",NULL
"Dextran","1979.6143",1,"9","2","0","0",1,NULL,6,"352.4","negative","y",6,1,"He",NULL
"Dextran","1979.6143",1,"9","2","0","0",1,NULL,4,"356.13","negative","y",4,1,"He",NULL
"Dextran","1981.6677",1,"4","6","0","0",1,NULL,3,"353.59","negative","y",3,1,"He",NULL
"Dextran","2022.6943",1,"3","7","0","0",1,NULL,3,"359.98","negative","y",3,1,"He",NULL
"Dextran","2045.6725",1,"6","4","1","0",1,NULL,6,"356.9","negative","y",6,1,"He",NULL
"Dextran","2076.7382",1,"5","4","1","1",1,NULL,6,"372.37","negative","y",6,1,"He",NULL
"Dextran","2102.694",1,"6","5","0","0",1,NULL,2,"343.21","negative","y",2,1,"He",NULL
"Dextran","2102.694",1,"6","5","0","0",1,NULL,3,"365.23","negative","y",3,1,"He",NULL
"Dextran","2174.7862",1,"4","6","0","1",1,NULL,3,"380.63","negative","y",3,1,"He",NULL
"Dextran","2225.7736",1,"3","8","0","0",1,NULL,3,"385.38","negative","y",3,1,"He",NULL
"Dextran","2295.8125",1,"6","5","0","1",1,NULL,2,"371.84","negative","y",2,1,"He",NULL
"Dextran","2387.8265",1,"5","7","0","0",1,NULL,3,"400.2","negative","y",3,1,"He",NULL
"Dextran","0",0,"0","0","0","0",0,"0",6,"169.62","negative",NULL,6,2,"N",NULL
"Dextran","0",0,"0","0","0","0",0,"0",6,"170.63","negative",NULL,6,2,"N",NULL
"Dextran","0",0,"0","0","0","0",0,"0",6,"172.22","negative",NULL,6,2,"N",NULL
"Dextran","0",0,"0","0","0","0",0,"0",6,"172.52","negative",NULL,6,2,"N",NULL
"Dextran","0",0,"0","0","0","0",0,"0",6,"183.45","negative",NULL,6,2,"N",NULL
"Dextran","0",0,"0","0","0","0",0,"0",6,"186.43","negative",NULL,6,2,"N",NULL
"Dextran","0",0,"0","0","0","0",0,"0",3,"188.74","negative",NULL,3,2,"N",NULL
"Dextran","0",0,"0","0","0","0",0,"0",6,"192.56","negative",NULL,6,2,"N",NULL
"Dextran","0",0,"0","0","0","0",0,"0",4,"194.1","negative",NULL,4,2,"N",NULL
"Dextran","0",0,"0","0","0","0",0,"0",6,"195.49","negative",NULL,6,2,"N",NULL
"Dextran","0",0,"0","0","0","0",0,"0",3,"196.67","negative",NULL,3,2,"N",NULL
"Dextran","0",0,"0","0","0","0",0,"0",3,"204.82","negative",NULL,3,2,"N",NULL
"Dextran","0",0,"0","0","0","0",0,"0",3,"206.46","negative",NULL,3,2,"N",NULL
"Dextran","0",0,"0","0","0","0",0,"0",4,"207.65","negative",NULL,4,2,"N",NULL
"Dextran","0",0,"0","0","0","0",0,"0",3,"207.85","negative",NULL,3,2,"N",NULL
"Dextran","0",0,"0","0","0","0",0,"0",4,"211.43","negative",NULL,4,2,"N",NULL
"Dextran","0",0,"0","0","0","0",0,"0",6,"213.27","negative",NULL,6,2,"N",NULL
"Dextran","0",0,"0","0","0","0",0,"0",4,"213.37","negative",NULL,4,2,"N",NULL
"Dextran","0",0,"0","0","0","0",0,"0",3,"213.47","negative",NULL,3,2,"N",NULL
"Dextran","0",0,"0","0","0","0",0,"0",4,"213.87","negative",NULL,4,2,"N",NULL
"Dextran","0",0,"0","0","0","0",0,"0",4,"215.91","negative",NULL,4,2,"N",NULL
"Dextran","0",0,"0","0","0","0",0,"0",4,"215.96","negative",NULL,4,2,"N",NULL
"Dextran","0",0,"0","0","0","0",0,"0",3,"216.09","negative",NULL,3,2,"N",NULL
"Dextran","0",0,"0","0","0","0",0,"0",3,"219.24","negative",NULL,3,2,"N",NULL
"Dextran","0",0,"0","0","0","0",0,"0",4,"219.41","negative",NULL,4,2,"N",NULL
"Dextran","0",0,"0","0","0","0",0,"0",6,"220.13","negative",NULL,6,2,"N",NULL
"Dextran","0",0,"0","0","0","0",0,"0",6,"222.06","negative",NULL,6,2,"N",NULL
"Dextran","0",0,"0","0","0","0",0,"0",3,"226.69","negative",NULL,3,2,"N",NULL
"Dextran","0",0,"0","0","0","0",0,"0",3,"230.36","negative",NULL,3,2,"N",NULL
"Dextran","0",0,"0","0","0","0",0,"0",3,"232.73","negative",NULL,3,2,"N",NULL
"Dextran","0",0,"0","0","0","0",0,"0",4,"237.49","negative",NULL,4,2,"N",NULL
"Dextran","0",0,"0","0","0","0",0,"0",3,"239.08","negative",NULL,3,2,"N",NULL
"Dextran","0",0,"0","0","0","0",0,"0",3,"241.95","negative",NULL,3,2,"N",NULL
"Dextran","0",0,"0","0","0","0",0,"0",3,"243.59","negative",NULL,3,2,"N",NULL
"Dextran","0",0,"0","0","0","0",0,"0",6,"245.11","negative",NULL,6,2,"N",NULL
"Dextran","0",0,"0","0","0","0",0,"0",4,"247.42","negative",NULL,4,2,"N",NULL
"Dextran","0",0,"0","0","0","0",0,"0",3,"251.69","negative",NULL,3,2,"N",NULL
"Dextran","0",0,"0","0","0","0",0,"0",3,"252.08","negative",NULL,3,2,"N",NULL
"Dextran","0",0,"0","0","0","0",0,"0",3,"252.9","negative",NULL,3,2,"N",NULL
"Dextran","0",0,"0","0","0","0",0,"0",3,"254.25","negative",NULL,3,2,"N",NULL
"Dextran","0",0,"0","0","0","0",0,"0",3,"257.34","negative",NULL,3,2,"N",NULL
"Dextran","0",0,"0","0","0","0",0,"0",3,"261.62","negative",NULL,3,2,"N",NULL
"Dextran","0",0,"0","0","0","0",0,"0",6,"262.2","negative",NULL,6,2,"N",NULL
"Dextran","0",0,"0","0","0","0",0,"0",3,"267.09","negative",NULL,3,2,"N",NULL
"Dextran","0",0,"0","0","0","0",0,"0",3,"268.93","negative",NULL,3,2,"N",NULL
"Dextran","0",0,"0","0","0","0",0,"0",3,"269.53","negative",NULL,3,2,"N",NULL
"Dextran","0",0,"0","0","0","0",0,"0",4,"271.45","negative",NULL,4,2,"N",NULL
"Dextran","0",0,"0","0","0","0",0,"0",6,"271.63","negative",NULL,6,2,"N",NULL
"Dextran","0",0,"0","0","0","0",0,"0",3,"273.47","negative",NULL,3,2,"N",NULL
"Dextran","0",0,"0","0","0","0",0,"0",3,"275.85","negative",NULL,3,2,"N",NULL
"Dextran","0",0,"0","0","0","0",0,"0",3,"276.24","negative",NULL,3,2,"N",NULL
"Dextran","0",0,"0","0","0","0",0,"0",3,"284.09","negative",NULL,3,2,"N",NULL
"Dextran","0",0,"0","0","0","0",0,"0",3,"285.64","negative",NULL,3,2,"N",NULL
"Dextran","0",0,"0","0","0","0",0,"0",4,"290.76","negative",NULL,4,2,"N",NULL
"Dextran","0",0,"0","0","0","0",0,"0",3,"291.94","negative",NULL,3,2,"N",NULL
"Dextran","0",0,"0","0","0","0",0,"0",3,"292.38","negative",NULL,3,2,"N",NULL
"Dextran","0",0,"0","0","0","0",0,"0",3,"292.7","negative",NULL,3,2,"N",NULL
"Dextran","0",0,"0","0","0","0",0,"0",3,"292.79","negative",NULL,3,2,"N",NULL
"Dextran","0",0,"0","0","0","0",0,"0",3,"294.42","negative",NULL,3,2,"N",NULL
"Dextran","0",0,"0","0","0","0",0,"0",3,"294.85","negative",NULL,3,2,"N",NULL
"Dextran","0",0,"0","0","0","0",0,"0",3,"295.42","negative",NULL,3,2,"N",NULL
"Dextran","0",0,"0","0","0","0",0,"0",6,"295.81","negative",NULL,6,2,"N",NULL
"Dextran","0",0,"0","0","0","0",0,"0",3,"299.38","negative",NULL,3,2,"N",NULL
"Dextran","0",0,"0","0","0","0",0,"0",3,"299.46","negative",NULL,3,2,"N",NULL
"Dextran","0",0,"0","0","0","0",0,"0",4,"302.2","negative",NULL,4,2,"N",NULL
"Dextran","0",0,"0","0","0","0",0,"0",3,"302.32","negative",NULL,3,2,"N",NULL
"Dextran","0",0,"0","0","0","0",0,"0",4,"306.31","negative",NULL,4,2,"N",NULL
"Dextran","0",0,"0","0","0","0",0,"0",3,"306.37","negative",NULL,3,2,"N",NULL
"Dextran","0",0,"0","0","0","0",0,"0",3,"308.57","negative",NULL,3,2,"N",NULL
"Dextran","0",0,"0","0","0","0",0,"0",4,"311.36","negative",NULL,4,2,"N",NULL
"Dextran","0",0,"0","0","0","0",0,"0",4,"313.29","negative",NULL,4,2,"N",NULL
"Dextran","0",0,"0","0","0","0",0,"0",3,"314","negative",NULL,3,2,"N",NULL
"Dextran","0",0,"0","0","0","0",0,"0",3,"315.12","negative",NULL,3,2,"N",NULL
"Dextran","0",0,"0","0","0","0",0,"0",4,"315.33","negative",NULL,4,2,"N",NULL
"Dextran","0",0,"0","0","0","0",0,"0",3,"315.49","negative",NULL,3,2,"N",NULL
"Dextran","0",0,"0","0","0","0",0,"0",3,"316.88","negative",NULL,3,2,"N",NULL
"Dextran","0",0,"0","0","0","0",0,"0",3,"323.2","negative",NULL,3,2,"N",NULL
"Dextran","0",0,"0","0","0","0",0,"0",3,"324.47","negative",NULL,3,2,"N",NULL
"Dextran","0",0,"0","0","0","0",0,"0",3,"329.02","negative",NULL,3,2,"N",NULL
"Dextran","0",0,"0","0","0","0",0,"0",4,"333.37","negative",NULL,4,2,"N",NULL
"Dextran","0",0,"0","0","0","0",0,"0",3,"335.74","negative",NULL,3,2,"N",NULL
"Dextran","0",0,"0","0","0","0",0,"0",4,"338.59","negative",NULL,4,2,"N",NULL
"Dextran","0",0,"0","0","0","0",0,"0",4,"338.64","negative",NULL,4,2,"N",NULL
"Dextran","0",0,"0","0","0","0",0,"0",3,"340.25","negative",NULL,3,2,"N",NULL
"Dextran","0",0,"0","0","0","0",0,"0",3,"340.3","negative",NULL,3,2,"N",NULL
"Dextran","0",0,"0","0","0","0",0,"0",4,"341.13","negative",NULL,4,2,"N",NULL
"Dextran","0",0,"0","0","0","0",0,"0",3,"341.59","negative",NULL,3,2,"N",NULL
"Dextran","0",0,"0","0","0","0",0,"0",4,"341.64","negative",NULL,4,2,"N",NULL
"Dextran","0",0,"0","0","0","0",0,"0",3,"345.3","negative",NULL,3,2,"N",NULL
"Dextran","0",0,"0","0","0","0",0,"0",4,"349.02","negative",NULL,4,2,"N",NULL
"Dextran","0",0,"0","0","0","0",0,"0",3,"349.83","negative",NULL,3,2,"N",NULL
"Dextran","0",0,"0","0","0","0",0,"0",3,"351.94","negative",NULL,3,2,"N",NULL
"Dextran","0",0,"0","0","0","0",0,"0",3,"352.79","negative",NULL,3,2,"N",NULL
"Dextran","0",0,"0","0","0","0",0,"0",3,"356.04","negative",NULL,3,2,"N",NULL
"Dextran","0",0,"0","0","0","0",0,"0",4,"356.06","negative",NULL,4,2,"N",NULL
"Dextran","0",0,"0","0","0","0",0,"0",3,"359.92","negative",NULL,3,2,"N",NULL
"Dextran","0",0,"0","0","0","0",0,"0",3,"360.18","negative",NULL,3,2,"N",NULL
"Dextran","0",0,"0","0","0","0",0,"0",3,"360.27","negative",NULL,3,2,"N",NULL
"Dextran","0",0,"0","0","0","0",0,"0",3,"362.23","negative",NULL,3,2,"N",NULL
"Dextran","0",0,"0","0","0","0",0,"0",3,"362.43","negative",NULL,3,2,"N",NULL
"Dextran","0",0,"0","0","0","0",0,"0",3,"363.1","negative",NULL,3,2,"N",NULL
"Dextran","0",0,"0","0","0","0",0,"0",3,"363.62","negative",NULL,3,2,"N",NULL
"Dextran","0",0,"0","0","0","0",0,"0",3,"364.28","negative",NULL,3,2,"N",NULL
"Dextran","0",0,"0","0","0","0",0,"0",4,"365.58","negative",NULL,4,2,"N",NULL
"Dextran","0",0,"0","0","0","0",0,"0",4,"365.65","negative",NULL,4,2,"N",NULL
"Dextran","0",0,"0","0","0","0",0,"0",6,"366.83","negative",NULL,6,2,"N",NULL
"Dextran","0",0,"0","0","0","0",0,"0",3,"367.84","negative",NULL,3,2,"N",NULL
"Dextran","0",0,"0","0","0","0",0,"0",3,"368.25","negative",NULL,3,2,"N",NULL
"Dextran","0",0,"0","0","0","0",0,"0",4,"368.99","negative",NULL,4,2,"N",NULL
"Dextran","0",0,"0","0","0","0",0,"0",6,"369.68","negative",NULL,6,2,"N",NULL
"Dextran","0",0,"0","0","0","0",0,"0",4,"370.76","negative",NULL,4,2,"N",NULL
"Dextran","0",0,"0","0","0","0",0,"0",4,"371.19","negative",NULL,4,2,"N",NULL
"Dextran","0",0,"0","0","0","0",0,"0",6,"372.89","negative",NULL,6,2,"N",NULL
"Dextran","0",0,"0","0","0","0",0,"0",3,"373.07","negative",NULL,3,2,"N",NULL
"Dextran","0",0,"0","0","0","0",0,"0",4,"374.87","negative",NULL,4,2,"N",NULL
"Dextran","0",0,"0","0","0","0",0,"0",6,"378.03","negative",NULL,6,2,"N",NULL
"Dextran","0",0,"0","0","0","0",0,"0",4,"378.99","negative",NULL,4,2,"N",NULL
"Dextran","0",0,"0","0","0","0",0,"0",3,"379.21","negative",NULL,3,2,"N",NULL
"Dextran","0",0,"0","0","0","0",0,"0",6,"379.88","negative",NULL,6,2,"N",NULL
"Dextran","0",0,"0","0","0","0",0,"0",6,"380.4","negative",NULL,6,2,"N",NULL
"Dextran","0",0,"0","0","0","0",0,"0",6,"383.72","negative",NULL,6,2,"N",NULL
"Dextran","0",0,"0","0","0","0",0,"0",3,"385.42","negative",NULL,3,2,"N",NULL
"Dextran","0",0,"0","0","0","0",0,"0",3,"385.74","negative",NULL,3,2,"N",NULL
"Dextran","0",0,"0","0","0","0",0,"0",6,"387.1","negative",NULL,6,2,"N",NULL
"Dextran","0",0,"0","0","0","0",0,"0",3,"387.19","negative",NULL,3,2,"N",NULL
"Dextran","0",0,"0","0","0","0",0,"0",6,"387.36","negative",NULL,6,2,"N",NULL
"Dextran","0",0,"0","0","0","0",0,"0",6,"388.32","negative",NULL,6,2,"N",NULL
"Dextran","0",0,"0","0","0","0",0,"0",6,"388.7","negative",NULL,6,2,"N",NULL
"Dextran","0",0,"0","0","0","0",0,"0",4,"388.77","negative",NULL,4,2,"N",NULL
"Dextran","0",0,"0","0","0","0",0,"0",3,"391.28","negative",NULL,3,2,"N",NULL
"Dextran","0",0,"0","0","0","0",0,"0",6,"392.24","negative",NULL,6,2,"N",NULL
"Dextran","0",0,"0","0","0","0",0,"0",3,"393.42","negative",NULL,3,2,"N",NULL
"Dextran","0",0,"0","0","0","0",0,"0",3,"393.46","negative",NULL,3,2,"N",NULL
"Dextran","0",0,"0","0","0","0",0,"0",6,"394.88","negative",NULL,6,2,"N",NULL
"Dextran","0",0,"0","0","0","0",0,"0",4,"396.25","negative",NULL,4,2,"N",NULL
"Dextran","0",0,"0","0","0","0",0,"0",3,"397.73","negative",NULL,3,2,"N",NULL
"Dextran","0",0,"0","0","0","0",0,"0",3,"400.86","negative",NULL,3,2,"N",NULL
"Dextran","0",0,"0","0","0","0",0,"0",3,"404.15","negative",NULL,3,2,"N",NULL
"Dextran","0",0,"0","0","0","0",0,"0",6,"406.26","negative",NULL,6,2,"N",NULL
"Dextran","0",0,"0","0","0","0",0,"0",6,"408.09","negative",NULL,6,2,"N",NULL
"Dextran","0",0,"0","0","0","0",0,"0",3,"408.21","negative",NULL,3,2,"N",NULL
"Dextran","0",0,"0","0","0","0",0,"0",6,"409.46","negative",NULL,6,2,"N",NULL
"Dextran","0",0,"0","0","0","0",0,"0",4,"411.89","negative",NULL,4,2,"N",NULL
"Dextran","0",0,"0","0","0","0",0,"0",6,"414.15","negative",NULL,6,2,"N",NULL
"Dextran","0",0,"0","0","0","0",0,"0",6,"414.97","negative",NULL,6,2,"N",NULL
"Dextran","0",0,"0","0","0","0",0,"0",6,"416.09","negative",NULL,6,2,"N",NULL
"Dextran","0",0,"0","0","0","0",0,"0",3,"416.51","negative",NULL,3,2,"N",NULL
"Dextran","0",0,"0","0","0","0",0,"0",6,"416.62","negative",NULL,6,2,"N",NULL
"Dextran","0",0,"0","0","0","0",0,"0",3,"418.68","negative",NULL,3,2,"N",NULL
"Dextran","0",0,"0","0","0","0",0,"0",6,"423.13","negative",NULL,6,2,"N",NULL
"Dextran","0",0,"0","0","0","0",0,"0",3,"425.79","negative",NULL,3,2,"N",NULL
"Dextran","0",0,"0","0","0","0",0,"0",6,"427.01","negative",NULL,6,2,"N",NULL
"Dextran","0",0,"0","0","0","0",0,"0",6,"429.32","negative",NULL,6,2,"N",NULL
"Dextran","0",0,"0","0","0","0",0,"0",3,"429.35","negative",NULL,3,2,"N",NULL
"Dextran","0",0,"0","0","0","0",0,"0",6,"430.58","negative",NULL,6,2,"N",NULL
"Dextran","0",0,"0","0","0","0",0,"0",3,"434.41","negative",NULL,3,2,"N",NULL
"Dextran","0",0,"0","0","0","0",0,"0",6,"435.98","negative",NULL,6,2,"N",NULL
"Dextran","0",0,"0","0","0","0",0,"0",3,"436.53","negative",NULL,3,2,"N",NULL
"Dextran","0",0,"0","0","0","0",0,"0",3,"443.07","negative",NULL,3,2,"N",NULL
"Dextran","0",0,"0","0","0","0",0,"0",6,"482.71","negative",NULL,6,2,"N",NULL
"Dextran","406.1355",1,"2","1","0","0",1,NULL,2,"174.37","negative","y",2,2,"N",NULL
"Dextran","526.1777",1,"2","1","0","0",1,NULL,2,"188.18","negative","y",2,2,"N",NULL
"Dextran","602.1938",1,"3","1","0","0",1,NULL,2,"201.29","negative","y",2,2,"N",NULL
"Dextran","673.2309",1,"2","1","0","1",1,NULL,2,"247.58","negative","y",2,2,"N",NULL
"Dextran","715.2415",1,"2","1","0","1",1,NULL,2,"238.53","negative","y",2,2,"N",NULL
"Dextran","845.2446",1,"2","2","0","0",1,NULL,4,"253.89","negative","y",4,2,"N",NULL
"Dextran","845.3045",1,"3","2","0","0",1,NULL,2,"262.44","negative","y",2,2,"N",NULL
"Dextran","917.2657",2,"5","4","0","0",2,NULL,2,"401.55","negative","y",2,2,"N",NULL
"Dextran","958.6629",3,"6","5","0","3",3,NULL,2,"558.53","negative","y",2,2,"N",NULL
"Dextran","1007.2974",1,"3","2","0","0",1,NULL,4,"281.11","negative","y",4,2,"N",NULL
"Dextran","1007.2974",1,"3","2","0","0",1,NULL,3,"283.67","negative","y",3,2,"N",NULL
"Dextran","1013.825",2,"5","4","0","1",2,NULL,2,"435.87","negative","y",2,2,"N",NULL
"Dextran","1038.3631",1,"2","2","0","1",1,NULL,2,"310.09","negative","y",2,2,"N",NULL
"Dextran","1099.8318",2,"6","5","0","0",2,NULL,2,"444.31","negative","y",2,2,"N",NULL
"Dextran","1110.3842",2,"5","4","0","2",2,NULL,2,"473.29","negative","y",2,2,"N",NULL
"Dextran","1169.3502",1,"4","2","0","0",1,NULL,4,"313.81","negative","y",4,2,"N",NULL
"Dextran","1169.3502",1,"4","2","0","0",1,NULL,3,"317.18","negative","y",3,2,"N",NULL
"Dextran","1169.3502",1,"4","2","0","0",1,NULL,6,"321.18","negative","y",6,2,"N",NULL
"Dextran","1196.3911",2,"6","5","0","1",2,NULL,2,"479.9","negative","y",2,2,"N",NULL
"Dextran","1210.3768",1,"3","3","0","0",1,NULL,3,"324.09","negative","y",3,2,"N",NULL
"Dextran","1292.9503",2,"6","5","0","2",2,NULL,2,"519.36","negative","y",2,2,"N",NULL
"Dextran","1331.403",1,"5","2","0","0",1,NULL,4,"343.86","negative","y",4,2,"N",NULL
"Dextran","1331.403",1,"5","2","0","0",1,NULL,3,"348.74","negative","y",3,2,"N",NULL
"Dextran","1331.403",1,"5","2","0","0",1,NULL,6,"350.63","negative","y",6,2,"N",NULL
"Dextran","1372.4296",1,"4","3","0","0",1,NULL,3,"347.54","negative","y",3,2,"N",NULL
"Dextran","1413.4561",1,"3","4","0","0",1,NULL,3,"357.93","negative","y",3,2,"N",NULL
"Dextran","1438.498",2,"6","5","0","3",2,NULL,2,"556.48","negative","y",2,2,"N",NULL
"Dextran","1493.4559",1,"6","2","0","0",1,NULL,4,"369.99","negative","y",4,2,"N",NULL
"Dextran","1493.4559",1,"6","2","0","0",1,NULL,6,"374.88","negative","y",6,2,"N",NULL
"Dextran","1493.4559",1,"6","2","0","0",1,NULL,3,"380.46","negative","y",3,2,"N",NULL
"Dextran","1518.4675",1,"4","3","1","0",1,NULL,6,"377.26","negative","y",6,2,"N",NULL
"Dextran","1534.4824",1,"5","3","0","0",1,NULL,3,"380.72","negative","y",3,2,"N",NULL
"Dextran","1575.509",1,"4","4","0","0",1,NULL,3,"378.23","negative","y",3,2,"N",NULL
"Dextran","1616.5355",1,"3","5","0","0",1,NULL,3,"392.05","negative","y",3,2,"N",NULL
"Dextran","1655.5087",1,"7","2","0","0",1,NULL,6,"396.23","negative","y",6,2,"N",NULL
"Dextran","1655.5087",1,"7","2","0","0",1,NULL,3,"402.3","negative","y",3,2,"N",NULL
"Dextran","1655.509",1,"7","2","0","0",1,NULL,4,"396.13","negative","y",4,2,"N",NULL
"Dextran","1711.606",1,"4","3","0","1",1,NULL,6,"408.35","negative","y",6,2,"N",NULL
"Dextran","1721.5669",1,"4","4","1","0",1,NULL,6,"405.75","negative","y",6,2,"N",NULL
"Dextran","1737.5618",1,"5","4","0","0",1,NULL,2,"396.59","negative","y",2,2,"N",NULL
"Dextran","1737.5618",1,"6","3","0","0",1,NULL,3,"405.62","negative","y",3,2,"N",NULL
"Dextran","1778.5883",1,"4","5","0","0",1,NULL,3,"414.03","negative","y",3,2,"N",NULL
"Dextran","1817.5615",1,"8","2","0","0",1,NULL,6,"421.46","negative","y",6,2,"N",NULL
"Dextran","1817.5615",1,"8","2","0","0",1,NULL,4,"423.22","negative","y",4,2,"N",NULL
"Dextran","1819.6149",1,"3","6","0","0",1,NULL,3,"422.96","negative","y",3,2,"N",NULL
"Dextran","1883.6197",1,"5","4","1","0",1,NULL,6,"426.18","negative","y",6,2,"N",NULL
"Dextran","1914.6854",1,"4","4","1","1",1,NULL,6,"441.11","negative","y",6,2,"N",NULL
"Dextran","1930.6803",1,"6","5","0","1",1,NULL,2,"429.95","negative","y",2,2,"N",NULL
"Dextran","1940.6412",1,"5","5","0","0",1,NULL,3,"432.02","negative","y",3,2,"N",NULL
"Dextran","1979.6143",1,"9","2","0","0",1,NULL,6,"441.72","negative","y",6,2,"N",NULL
"Dextran","1979.6143",1,"9","2","0","0",1,NULL,4,"443.14","negative","y",4,2,"N",NULL
"Dextran","1981.6677",1,"4","6","0","0",1,NULL,3,"441.39","negative","y",3,2,"N",NULL
"Dextran","2022.6943",1,"3","7","0","0",1,NULL,3,"447.68","negative","y",3,2,"N",NULL
"Dextran","2045.6725",1,"6","4","1","0",1,NULL,6,"446.61","negative","y",6,2,"N",NULL
"Dextran","2076.7382",1,"5","4","1","1",1,NULL,6,"462.23","negative","y",6,2,"N",NULL
"Dextran","2102.694",1,"6","5","0","0",1,NULL,2,"434.21","negative","y",2,2,"N",NULL
"Dextran","2102.694",1,"6","5","0","0",1,NULL,3,"455.2","negative","y",3,2,"N",NULL
"Dextran","2174.7862",1,"4","6","0","1",1,NULL,3,"471.23","negative","y",3,2,"N",NULL
"Dextran","2225.7736",1,"3","8","0","0",1,NULL,3,"472.16","negative","y",3,2,"N",NULL
"Dextran","2295.8125",1,"6","5","0","1",1,NULL,2,"466.54","negative","y",2,2,"N",NULL
"Dextran","2387.8265",1,"5","7","0","0",1,NULL,3,"486.24","negative","y",3,2,"N",NULL
