Protein,Position,Id,Toucan,AminoAcid,TypeAminoAcid,Notes,Pmid,AdditionalNotes,doi
P0DTC2,343,,,Asn,N-linked,Glycopeptide mass reported but permethylated glycan mass appears absent,32886791,Glycoproteomics by LC ES-MS (MSe) and collisionally activated CAD MS/MS (DDA)using an Acquity UPLC coupled with a Xevo G2-XS Q-TOF Mass Spectrometer. Glycomic analysis of the N331 and N343 glycopeptides derived from the RBD of the S1 spike SARS-CoV-2 glycoprotein. MALDI-TOF mass spectra of permethylated N-glycans derived from 329-FPNITNLCPFGE-340 glycopeptide (containing the N331 glycosylation site) and 341-VFNATR-346 glycopeptide (containing the N343 glycosylation site).,https://doi.org/10.1093/glycob/cwaa085
P0DTC2,343,,,Asn,N-linked,Glycopeptide mass reported but permethylated glycan mass appears absent,32886791,Glycoproteomics by LC ES-MS (MSe) and collisionally activated CAD MS/MS (DDA)using an Acquity UPLC coupled with a Xevo G2-XS Q-TOF Mass Spectrometer. Glycomic analysis of the N331 and N343 glycopeptides derived from the RBD of the S1 spike SARS-CoV-2 glycoprotein. MALDI-TOF mass spectra of permethylated N-glycans derived from 329-FPNITNLCPFGE-340 glycopeptide (containing the N331 glycosylation site) and 341-VFNATR-346 glycopeptide (containing the N343 glycosylation site).,https://doi.org/10.1093/glycob/cwaa085
P0DTC2,343,,,Asn,N-linked,Glycopeptide mass reported but permethylated glycan mass appears absent,32886791,Glycoproteomics by LC ES-MS (MSe) and collisionally activated CAD MS/MS (DDA)using an Acquity UPLC coupled with a Xevo G2-XS Q-TOF Mass Spectrometer. Glycomic analysis of the N331 and N343 glycopeptides derived from the RBD of the S1 spike SARS-CoV-2 glycoprotein. MALDI-TOF mass spectra of permethylated N-glycans derived from 329-FPNITNLCPFGE-340 glycopeptide (containing the N331 glycosylation site) and 341-VFNATR-346 glycopeptide (containing the N343 glycosylation site).,https://doi.org/10.1093/glycob/cwaa085
P0DTC2,343,,,Asn,N-linked,Glycopeptide mass reported but permethylated glycan mass appears absent,32886791,Glycoproteomics by LC ES-MS (MSe) and collisionally activated CAD MS/MS (DDA)using an Acquity UPLC coupled with a Xevo G2-XS Q-TOF Mass Spectrometer. Glycomic analysis of the N331 and N343 glycopeptides derived from the RBD of the S1 spike SARS-CoV-2 glycoprotein. MALDI-TOF mass spectra of permethylated N-glycans derived from 329-FPNITNLCPFGE-340 glycopeptide (containing the N331 glycosylation site) and 341-VFNATR-346 glycopeptide (containing the N343 glycosylation site).,https://doi.org/10.1093/glycob/cwaa085
P0DTC2,343,G69812OF,G69812OF,Asn,N-linked,,32886791,Glycoproteomics by LC ES-MS (MSe) and collisionally activated CAD MS/MS (DDA)using an Acquity UPLC coupled with a Xevo G2-XS Q-TOF Mass Spectrometer. Glycomic analysis of the N331 and N343 glycopeptides derived from the RBD of the S1 spike SARS-CoV-2 glycoprotein. MALDI-TOF mass spectra of permethylated N-glycans derived from 329-FPNITNLCPFGE-340 glycopeptide (containing the N331 glycosylation site) and 341-VFNATR-346 glycopeptide (containing the N343 glycosylation site).,https://doi.org/10.1093/glycob/cwaa085
P0DTC2,343,,,Asn,N-linked,Glycopeptide mass reported but permethylated glycan mass appears absent,32886791,Glycoproteomics by LC ES-MS (MSe) and collisionally activated CAD MS/MS (DDA)using an Acquity UPLC coupled with a Xevo G2-XS Q-TOF Mass Spectrometer. Glycomic analysis of the N331 and N343 glycopeptides derived from the RBD of the S1 spike SARS-CoV-2 glycoprotein. MALDI-TOF mass spectra of permethylated N-glycans derived from 329-FPNITNLCPFGE-340 glycopeptide (containing the N331 glycosylation site) and 341-VFNATR-346 glycopeptide (containing the N343 glycosylation site).,https://doi.org/10.1093/glycob/cwaa085
P0DTC2,343,,,Asn,N-linked,Glycopeptide mass reported but permethylated glycan mass appears absent,32886791,Glycoproteomics by LC ES-MS (MSe) and collisionally activated CAD MS/MS (DDA)using an Acquity UPLC coupled with a Xevo G2-XS Q-TOF Mass Spectrometer. Glycomic analysis of the N331 and N343 glycopeptides derived from the RBD of the S1 spike SARS-CoV-2 glycoprotein. MALDI-TOF mass spectra of permethylated N-glycans derived from 329-FPNITNLCPFGE-340 glycopeptide (containing the N331 glycosylation site) and 341-VFNATR-346 glycopeptide (containing the N343 glycosylation site).,https://doi.org/10.1093/glycob/cwaa085
P0DTC2,343,G58667NI,G58667NI,Asn,N-linked,,32886791,Glycoproteomics by LC ES-MS (MSe) and collisionally activated CAD MS/MS (DDA)using an Acquity UPLC coupled with a Xevo G2-XS Q-TOF Mass Spectrometer. Glycomic analysis of the N331 and N343 glycopeptides derived from the RBD of the S1 spike SARS-CoV-2 glycoprotein. MALDI-TOF mass spectra of permethylated N-glycans derived from 329-FPNITNLCPFGE-340 glycopeptide (containing the N331 glycosylation site) and 341-VFNATR-346 glycopeptide (containing the N343 glycosylation site).,https://doi.org/10.1093/glycob/cwaa085
P0DTC2,343,G55484MX,G55484MX,Asn,N-linked,,32886791,Glycoproteomics by LC ES-MS (MSe) and collisionally activated CAD MS/MS (DDA)using an Acquity UPLC coupled with a Xevo G2-XS Q-TOF Mass Spectrometer. Glycomic analysis of the N331 and N343 glycopeptides derived from the RBD of the S1 spike SARS-CoV-2 glycoprotein. MALDI-TOF mass spectra of permethylated N-glycans derived from 329-FPNITNLCPFGE-340 glycopeptide (containing the N331 glycosylation site) and 341-VFNATR-346 glycopeptide (containing the N343 glycosylation site).,https://doi.org/10.1093/glycob/cwaa085
P0DTC2,343,,,Asn,N-linked,Glycopeptide mass reported but permethylated glycan mass appears absent,32886791,Glycoproteomics by LC ES-MS (MSe) and collisionally activated CAD MS/MS (DDA)using an Acquity UPLC coupled with a Xevo G2-XS Q-TOF Mass Spectrometer. Glycomic analysis of the N331 and N343 glycopeptides derived from the RBD of the S1 spike SARS-CoV-2 glycoprotein. MALDI-TOF mass spectra of permethylated N-glycans derived from 329-FPNITNLCPFGE-340 glycopeptide (containing the N331 glycosylation site) and 341-VFNATR-346 glycopeptide (containing the N343 glycosylation site).,https://doi.org/10.1093/glycob/cwaa085
P0DTC2,343,,,Asn,N-linked,Glycopeptide mass reported but permethylated glycan mass appears absent,32886791,Glycoproteomics by LC ES-MS (MSe) and collisionally activated CAD MS/MS (DDA)using an Acquity UPLC coupled with a Xevo G2-XS Q-TOF Mass Spectrometer. Glycomic analysis of the N331 and N343 glycopeptides derived from the RBD of the S1 spike SARS-CoV-2 glycoprotein. MALDI-TOF mass spectra of permethylated N-glycans derived from 329-FPNITNLCPFGE-340 glycopeptide (containing the N331 glycosylation site) and 341-VFNATR-346 glycopeptide (containing the N343 glycosylation site).,https://doi.org/10.1093/glycob/cwaa085
P0DTC2,343,G90017UO,G90017UO,Asn,N-linked,,32886791,Glycoproteomics by LC ES-MS (MSe) and collisionally activated CAD MS/MS (DDA)using an Acquity UPLC coupled with a Xevo G2-XS Q-TOF Mass Spectrometer. Glycomic analysis of the N331 and N343 glycopeptides derived from the RBD of the S1 spike SARS-CoV-2 glycoprotein. MALDI-TOF mass spectra of permethylated N-glycans derived from 329-FPNITNLCPFGE-340 glycopeptide (containing the N331 glycosylation site) and 341-VFNATR-346 glycopeptide (containing the N343 glycosylation site).,https://doi.org/10.1093/glycob/cwaa085
P0DTC2,343,,,Asn,N-linked,Glycopeptide mass reported but permethylated glycan mass appears absent,32886791,Glycoproteomics by LC ES-MS (MSe) and collisionally activated CAD MS/MS (DDA)using an Acquity UPLC coupled with a Xevo G2-XS Q-TOF Mass Spectrometer. Glycomic analysis of the N331 and N343 glycopeptides derived from the RBD of the S1 spike SARS-CoV-2 glycoprotein. MALDI-TOF mass spectra of permethylated N-glycans derived from 329-FPNITNLCPFGE-340 glycopeptide (containing the N331 glycosylation site) and 341-VFNATR-346 glycopeptide (containing the N343 glycosylation site).,https://doi.org/10.1093/glycob/cwaa085
P0DTC2,343,G78059CC,G78059CC,Asn,N-linked,,32886791,Glycoproteomics by LC ES-MS (MSe) and collisionally activated CAD MS/MS (DDA)using an Acquity UPLC coupled with a Xevo G2-XS Q-TOF Mass Spectrometer. Glycomic analysis of the N331 and N343 glycopeptides derived from the RBD of the S1 spike SARS-CoV-2 glycoprotein. MALDI-TOF mass spectra of permethylated N-glycans derived from 329-FPNITNLCPFGE-340 glycopeptide (containing the N331 glycosylation site) and 341-VFNATR-346 glycopeptide (containing the N343 glycosylation site).,https://doi.org/10.1093/glycob/cwaa085
P0DTC2,343,G88417ED,G88417ED,Asn,N-linked,,32886791,Glycoproteomics by LC ES-MS (MSe) and collisionally activated CAD MS/MS (DDA)using an Acquity UPLC coupled with a Xevo G2-XS Q-TOF Mass Spectrometer. Glycomic analysis of the N331 and N343 glycopeptides derived from the RBD of the S1 spike SARS-CoV-2 glycoprotein. MALDI-TOF mass spectra of permethylated N-glycans derived from 329-FPNITNLCPFGE-340 glycopeptide (containing the N331 glycosylation site) and 341-VFNATR-346 glycopeptide (containing the N343 glycosylation site).,https://doi.org/10.1093/glycob/cwaa085
P0DTC2,343,G10421KO,G10421KO,Asn,N-linked,,32886791,Glycoproteomics by LC ES-MS (MSe) and collisionally activated CAD MS/MS (DDA)using an Acquity UPLC coupled with a Xevo G2-XS Q-TOF Mass Spectrometer. Glycomic analysis of the N331 and N343 glycopeptides derived from the RBD of the S1 spike SARS-CoV-2 glycoprotein. MALDI-TOF mass spectra of permethylated N-glycans derived from 329-FPNITNLCPFGE-340 glycopeptide (containing the N331 glycosylation site) and 341-VFNATR-346 glycopeptide (containing the N343 glycosylation site).,https://doi.org/10.1093/glycob/cwaa085
P0DTC2,343,G82252QI,G82252QI,Asn,N-linked,,32886791,Glycoproteomics by LC ES-MS (MSe) and collisionally activated CAD MS/MS (DDA)using an Acquity UPLC coupled with a Xevo G2-XS Q-TOF Mass Spectrometer. Glycomic analysis of the N331 and N343 glycopeptides derived from the RBD of the S1 spike SARS-CoV-2 glycoprotein. MALDI-TOF mass spectra of permethylated N-glycans derived from 329-FPNITNLCPFGE-340 glycopeptide (containing the N331 glycosylation site) and 341-VFNATR-346 glycopeptide (containing the N343 glycosylation site).,https://doi.org/10.1093/glycob/cwaa085
P0DTC2,343,G08979EC/G45640DX,G08979EC/G45640DX,Asn,N-linked,,32886791,Glycoproteomics by LC ES-MS (MSe) and collisionally activated CAD MS/MS (DDA)using an Acquity UPLC coupled with a Xevo G2-XS Q-TOF Mass Spectrometer. Glycomic analysis of the N331 and N343 glycopeptides derived from the RBD of the S1 spike SARS-CoV-2 glycoprotein. MALDI-TOF mass spectra of permethylated N-glycans derived from 329-FPNITNLCPFGE-340 glycopeptide (containing the N331 glycosylation site) and 341-VFNATR-346 glycopeptide (containing the N343 glycosylation site).,https://doi.org/10.1093/glycob/cwaa085
P0DTC2,343,G77939VD,G77939VD,Asn,N-linked,,32886791,Glycoproteomics by LC ES-MS (MSe) and collisionally activated CAD MS/MS (DDA)using an Acquity UPLC coupled with a Xevo G2-XS Q-TOF Mass Spectrometer. Glycomic analysis of the N331 and N343 glycopeptides derived from the RBD of the S1 spike SARS-CoV-2 glycoprotein. MALDI-TOF mass spectra of permethylated N-glycans derived from 329-FPNITNLCPFGE-340 glycopeptide (containing the N331 glycosylation site) and 341-VFNATR-346 glycopeptide (containing the N343 glycosylation site).,https://doi.org/10.1093/glycob/cwaa085
P0DTC2,343,G01510MQ,G01510MQ,Asn,N-linked,,32886791,Glycoproteomics by LC ES-MS (MSe) and collisionally activated CAD MS/MS (DDA)using an Acquity UPLC coupled with a Xevo G2-XS Q-TOF Mass Spectrometer. Glycomic analysis of the N331 and N343 glycopeptides derived from the RBD of the S1 spike SARS-CoV-2 glycoprotein. MALDI-TOF mass spectra of permethylated N-glycans derived from 329-FPNITNLCPFGE-340 glycopeptide (containing the N331 glycosylation site) and 341-VFNATR-346 glycopeptide (containing the N343 glycosylation site).,https://doi.org/10.1093/glycob/cwaa085
P0DTC2,343,G36221RT,G36221RT,Asn,N-linked,,32886791,Glycoproteomics by LC ES-MS (MSe) and collisionally activated CAD MS/MS (DDA)using an Acquity UPLC coupled with a Xevo G2-XS Q-TOF Mass Spectrometer. Glycomic analysis of the N331 and N343 glycopeptides derived from the RBD of the S1 spike SARS-CoV-2 glycoprotein. MALDI-TOF mass spectra of permethylated N-glycans derived from 329-FPNITNLCPFGE-340 glycopeptide (containing the N331 glycosylation site) and 341-VFNATR-346 glycopeptide (containing the N343 glycosylation site).,https://doi.org/10.1093/glycob/cwaa085
P0DTC2,343,G76136FD,G76136FD,Asn,N-linked,,32886791,Glycoproteomics by LC ES-MS (MSe) and collisionally activated CAD MS/MS (DDA)using an Acquity UPLC coupled with a Xevo G2-XS Q-TOF Mass Spectrometer. Glycomic analysis of the N331 and N343 glycopeptides derived from the RBD of the S1 spike SARS-CoV-2 glycoprotein. MALDI-TOF mass spectra of permethylated N-glycans derived from 329-FPNITNLCPFGE-340 glycopeptide (containing the N331 glycosylation site) and 341-VFNATR-346 glycopeptide (containing the N343 glycosylation site).,https://doi.org/10.1093/glycob/cwaa085
P0DTC2,343,G23634MW,G23634MW,Asn,N-linked,,32886791,Glycoproteomics by LC ES-MS (MSe) and collisionally activated CAD MS/MS (DDA)using an Acquity UPLC coupled with a Xevo G2-XS Q-TOF Mass Spectrometer. Glycomic analysis of the N331 and N343 glycopeptides derived from the RBD of the S1 spike SARS-CoV-2 glycoprotein. MALDI-TOF mass spectra of permethylated N-glycans derived from 329-FPNITNLCPFGE-340 glycopeptide (containing the N331 glycosylation site) and 341-VFNATR-346 glycopeptide (containing the N343 glycosylation site).,https://doi.org/10.1093/glycob/cwaa085
P0DTC2,343,G28974LC/G90764JW,G28974LC/G90764JW,Asn,N-linked,,32886791,Glycoproteomics by LC ES-MS (MSe) and collisionally activated CAD MS/MS (DDA)using an Acquity UPLC coupled with a Xevo G2-XS Q-TOF Mass Spectrometer. Glycomic analysis of the N331 and N343 glycopeptides derived from the RBD of the S1 spike SARS-CoV-2 glycoprotein. MALDI-TOF mass spectra of permethylated N-glycans derived from 329-FPNITNLCPFGE-340 glycopeptide (containing the N331 glycosylation site) and 341-VFNATR-346 glycopeptide (containing the N343 glycosylation site).,https://doi.org/10.1093/glycob/cwaa085
P0DTC2,343,G40306EB,G40306EB,Asn,N-linked,,32886791,Glycoproteomics by LC ES-MS (MSe) and collisionally activated CAD MS/MS (DDA)using an Acquity UPLC coupled with a Xevo G2-XS Q-TOF Mass Spectrometer. Glycomic analysis of the N331 and N343 glycopeptides derived from the RBD of the S1 spike SARS-CoV-2 glycoprotein. MALDI-TOF mass spectra of permethylated N-glycans derived from 329-FPNITNLCPFGE-340 glycopeptide (containing the N331 glycosylation site) and 341-VFNATR-346 glycopeptide (containing the N343 glycosylation site).,https://doi.org/10.1093/glycob/cwaa085
P0DTC2,343,G35242IF,G35242IF,Asn,N-linked,,32886791,Glycoproteomics by LC ES-MS (MSe) and collisionally activated CAD MS/MS (DDA)using an Acquity UPLC coupled with a Xevo G2-XS Q-TOF Mass Spectrometer. Glycomic analysis of the N331 and N343 glycopeptides derived from the RBD of the S1 spike SARS-CoV-2 glycoprotein. MALDI-TOF mass spectra of permethylated N-glycans derived from 329-FPNITNLCPFGE-340 glycopeptide (containing the N331 glycosylation site) and 341-VFNATR-346 glycopeptide (containing the N343 glycosylation site).,https://doi.org/10.1093/glycob/cwaa085
P0DTC2,343,G5404QW,G5404QW,Asn,N-linked,,32886791,Glycoproteomics by LC ES-MS (MSe) and collisionally activated CAD MS/MS (DDA)using an Acquity UPLC coupled with a Xevo G2-XS Q-TOF Mass Spectrometer. Glycomic analysis of the N331 and N343 glycopeptides derived from the RBD of the S1 spike SARS-CoV-2 glycoprotein. MALDI-TOF mass spectra of permethylated N-glycans derived from 329-FPNITNLCPFGE-340 glycopeptide (containing the N331 glycosylation site) and 341-VFNATR-346 glycopeptide (containing the N343 glycosylation site).,https://doi.org/10.1093/glycob/cwaa085
P0DTC2,343,G47679MT,G47679MT,Asn,N-linked,,32886791,Glycoproteomics by LC ES-MS (MSe) and collisionally activated CAD MS/MS (DDA)using an Acquity UPLC coupled with a Xevo G2-XS Q-TOF Mass Spectrometer. Glycomic analysis of the N331 and N343 glycopeptides derived from the RBD of the S1 spike SARS-CoV-2 glycoprotein. MALDI-TOF mass spectra of permethylated N-glycans derived from 329-FPNITNLCPFGE-340 glycopeptide (containing the N331 glycosylation site) and 341-VFNATR-346 glycopeptide (containing the N343 glycosylation site).,https://doi.org/10.1093/glycob/cwaa085
P0DTC2,343,G38802SW,G38802SW,Asn,N-linked,,32886791,Glycoproteomics by LC ES-MS (MSe) and collisionally activated CAD MS/MS (DDA)using an Acquity UPLC coupled with a Xevo G2-XS Q-TOF Mass Spectrometer. Glycomic analysis of the N331 and N343 glycopeptides derived from the RBD of the S1 spike SARS-CoV-2 glycoprotein. MALDI-TOF mass spectra of permethylated N-glycans derived from 329-FPNITNLCPFGE-340 glycopeptide (containing the N331 glycosylation site) and 341-VFNATR-346 glycopeptide (containing the N343 glycosylation site).,https://doi.org/10.1093/glycob/cwaa085
P0DTC2,343,G45922RX,G45922RX,Asn,N-linked,,32886791,Glycoproteomics by LC ES-MS (MSe) and collisionally activated CAD MS/MS (DDA)using an Acquity UPLC coupled with a Xevo G2-XS Q-TOF Mass Spectrometer. Glycomic analysis of the N331 and N343 glycopeptides derived from the RBD of the S1 spike SARS-CoV-2 glycoprotein. MALDI-TOF mass spectra of permethylated N-glycans derived from 329-FPNITNLCPFGE-340 glycopeptide (containing the N331 glycosylation site) and 341-VFNATR-346 glycopeptide (containing the N343 glycosylation site).,https://doi.org/10.1093/glycob/cwaa085
P0DTC2,343,G28082CI,G28082CI,Asn,N-linked,,32886791,Glycoproteomics by LC ES-MS (MSe) and collisionally activated CAD MS/MS (DDA)using an Acquity UPLC coupled with a Xevo G2-XS Q-TOF Mass Spectrometer. Glycomic analysis of the N331 and N343 glycopeptides derived from the RBD of the S1 spike SARS-CoV-2 glycoprotein. MALDI-TOF mass spectra of permethylated N-glycans derived from 329-FPNITNLCPFGE-340 glycopeptide (containing the N331 glycosylation site) and 341-VFNATR-346 glycopeptide (containing the N343 glycosylation site).,https://doi.org/10.1093/glycob/cwaa085
P0DTC2,343,G25520XG,G25520XG,Asn,N-linked,,32886791,Glycoproteomics by LC ES-MS (MSe) and collisionally activated CAD MS/MS (DDA)using an Acquity UPLC coupled with a Xevo G2-XS Q-TOF Mass Spectrometer. Glycomic analysis of the N331 and N343 glycopeptides derived from the RBD of the S1 spike SARS-CoV-2 glycoprotein. MALDI-TOF mass spectra of permethylated N-glycans derived from 329-FPNITNLCPFGE-340 glycopeptide (containing the N331 glycosylation site) and 341-VFNATR-346 glycopeptide (containing the N343 glycosylation site).,https://doi.org/10.1093/glycob/cwaa085
P0DTC2,343,G86102AA,G86102AA,Asn,N-linked,,32886791,Glycoproteomics by LC ES-MS (MSe) and collisionally activated CAD MS/MS (DDA)using an Acquity UPLC coupled with a Xevo G2-XS Q-TOF Mass Spectrometer. Glycomic analysis of the N331 and N343 glycopeptides derived from the RBD of the S1 spike SARS-CoV-2 glycoprotein. MALDI-TOF mass spectra of permethylated N-glycans derived from 329-FPNITNLCPFGE-340 glycopeptide (containing the N331 glycosylation site) and 341-VFNATR-346 glycopeptide (containing the N343 glycosylation site).,https://doi.org/10.1093/glycob/cwaa085
P0DTC2,343,G52880ZN,G52880ZN,Asn,N-linked,,32886791,Glycoproteomics by LC ES-MS (MSe) and collisionally activated CAD MS/MS (DDA)using an Acquity UPLC coupled with a Xevo G2-XS Q-TOF Mass Spectrometer. Glycomic analysis of the N331 and N343 glycopeptides derived from the RBD of the S1 spike SARS-CoV-2 glycoprotein. MALDI-TOF mass spectra of permethylated N-glycans derived from 329-FPNITNLCPFGE-340 glycopeptide (containing the N331 glycosylation site) and 341-VFNATR-346 glycopeptide (containing the N343 glycosylation site).,https://doi.org/10.1093/glycob/cwaa085
P0DTC2,343,G85288QT,G85288QT,Asn,N-linked,,32886791,Glycoproteomics by LC ES-MS (MSe) and collisionally activated CAD MS/MS (DDA)using an Acquity UPLC coupled with a Xevo G2-XS Q-TOF Mass Spectrometer. Glycomic analysis of the N331 and N343 glycopeptides derived from the RBD of the S1 spike SARS-CoV-2 glycoprotein. MALDI-TOF mass spectra of permethylated N-glycans derived from 329-FPNITNLCPFGE-340 glycopeptide (containing the N331 glycosylation site) and 341-VFNATR-346 glycopeptide (containing the N343 glycosylation site).,https://doi.org/10.1093/glycob/cwaa085
P0DTC2,343,G84122EI,G84122EI,Asn,N-linked,,32886791,Glycoproteomics by LC ES-MS (MSe) and collisionally activated CAD MS/MS (DDA)using an Acquity UPLC coupled with a Xevo G2-XS Q-TOF Mass Spectrometer. Glycomic analysis of the N331 and N343 glycopeptides derived from the RBD of the S1 spike SARS-CoV-2 glycoprotein. MALDI-TOF mass spectra of permethylated N-glycans derived from 329-FPNITNLCPFGE-340 glycopeptide (containing the N331 glycosylation site) and 341-VFNATR-346 glycopeptide (containing the N343 glycosylation site).,https://doi.org/10.1093/glycob/cwaa085
P0DTC2,343,G62654HS,G62654HS,Asn,N-linked,,32886791,Glycoproteomics by LC ES-MS (MSe) and collisionally activated CAD MS/MS (DDA)using an Acquity UPLC coupled with a Xevo G2-XS Q-TOF Mass Spectrometer. Glycomic analysis of the N331 and N343 glycopeptides derived from the RBD of the S1 spike SARS-CoV-2 glycoprotein. MALDI-TOF mass spectra of permethylated N-glycans derived from 329-FPNITNLCPFGE-340 glycopeptide (containing the N331 glycosylation site) and 341-VFNATR-346 glycopeptide (containing the N343 glycosylation site).,https://doi.org/10.1093/glycob/cwaa085
P0DTC2,343,G98716RB,G98716RB,Asn,N-linked,,32886791,Glycoproteomics by LC ES-MS (MSe) and collisionally activated CAD MS/MS (DDA)using an Acquity UPLC coupled with a Xevo G2-XS Q-TOF Mass Spectrometer. Glycomic analysis of the N331 and N343 glycopeptides derived from the RBD of the S1 spike SARS-CoV-2 glycoprotein. MALDI-TOF mass spectra of permethylated N-glycans derived from 329-FPNITNLCPFGE-340 glycopeptide (containing the N331 glycosylation site) and 341-VFNATR-346 glycopeptide (containing the N343 glycosylation site).,https://doi.org/10.1093/glycob/cwaa085
P0DTC2,343,G94937SR,G94937SR,Asn,N-linked,,32886791,Glycoproteomics by LC ES-MS (MSe) and collisionally activated CAD MS/MS (DDA)using an Acquity UPLC coupled with a Xevo G2-XS Q-TOF Mass Spectrometer. Glycomic analysis of the N331 and N343 glycopeptides derived from the RBD of the S1 spike SARS-CoV-2 glycoprotein. MALDI-TOF mass spectra of permethylated N-glycans derived from 329-FPNITNLCPFGE-340 glycopeptide (containing the N331 glycosylation site) and 341-VFNATR-346 glycopeptide (containing the N343 glycosylation site).,https://doi.org/10.1093/glycob/cwaa085
P0DTC2,343,G48789OQ,G48789OQ,Asn,N-linked,,32886791,Glycoproteomics by LC ES-MS (MSe) and collisionally activated CAD MS/MS (DDA)using an Acquity UPLC coupled with a Xevo G2-XS Q-TOF Mass Spectrometer. Glycomic analysis of the N331 and N343 glycopeptides derived from the RBD of the S1 spike SARS-CoV-2 glycoprotein. MALDI-TOF mass spectra of permethylated N-glycans derived from 329-FPNITNLCPFGE-340 glycopeptide (containing the N331 glycosylation site) and 341-VFNATR-346 glycopeptide (containing the N343 glycosylation site).,https://doi.org/10.1093/glycob/cwaa085
P0DTC2,343,G54096IJ,G54096IJ,Asn,N-linked,,32886791,Glycoproteomics by LC ES-MS (MSe) and collisionally activated CAD MS/MS (DDA)using an Acquity UPLC coupled with a Xevo G2-XS Q-TOF Mass Spectrometer. Glycomic analysis of the N331 and N343 glycopeptides derived from the RBD of the S1 spike SARS-CoV-2 glycoprotein. MALDI-TOF mass spectra of permethylated N-glycans derived from 329-FPNITNLCPFGE-340 glycopeptide (containing the N331 glycosylation site) and 341-VFNATR-346 glycopeptide (containing the N343 glycosylation site).,https://doi.org/10.1093/glycob/cwaa085
P0DTC2,331,G69812OF,G69812OF,Asn,N-linked,,32886791,Glycoproteomics by LC ES-MS (MSe) and collisionally activated CAD MS/MS (DDA)using an Acquity UPLC coupled with a Xevo G2-XS Q-TOF Mass Spectrometer. Glycomic analysis of the N331 and N343 glycopeptides derived from the RBD of the S1 spike SARS-CoV-2 glycoprotein. MALDI-TOF mass spectra of permethylated N-glycans derived from 329-FPNITNLCPFGE-340 glycopeptide (containing the N331 glycosylation site) and 341-VFNATR-346 glycopeptide (containing the N343 glycosylation site).,https://doi.org/10.1093/glycob/cwaa085
P0DTC2,331,G58667NI,G58667NI,Asn,N-linked,,32886791,Glycoproteomics by LC ES-MS (MSe) and collisionally activated CAD MS/MS (DDA)using an Acquity UPLC coupled with a Xevo G2-XS Q-TOF Mass Spectrometer. Glycomic analysis of the N331 and N343 glycopeptides derived from the RBD of the S1 spike SARS-CoV-2 glycoprotein. MALDI-TOF mass spectra of permethylated N-glycans derived from 329-FPNITNLCPFGE-340 glycopeptide (containing the N331 glycosylation site) and 341-VFNATR-346 glycopeptide (containing the N343 glycosylation site).,https://doi.org/10.1093/glycob/cwaa085
P0DTC2,331,G55484MX,G55484MX,Asn,N-linked,,32886791,Glycoproteomics by LC ES-MS (MSe) and collisionally activated CAD MS/MS (DDA)using an Acquity UPLC coupled with a Xevo G2-XS Q-TOF Mass Spectrometer. Glycomic analysis of the N331 and N343 glycopeptides derived from the RBD of the S1 spike SARS-CoV-2 glycoprotein. MALDI-TOF mass spectra of permethylated N-glycans derived from 329-FPNITNLCPFGE-340 glycopeptide (containing the N331 glycosylation site) and 341-VFNATR-346 glycopeptide (containing the N343 glycosylation site).,https://doi.org/10.1093/glycob/cwaa085
P0DTC2,331,G90017UO,G90017UO,Asn,N-linked,,32886791,Glycoproteomics by LC ES-MS (MSe) and collisionally activated CAD MS/MS (DDA)using an Acquity UPLC coupled with a Xevo G2-XS Q-TOF Mass Spectrometer. Glycomic analysis of the N331 and N343 glycopeptides derived from the RBD of the S1 spike SARS-CoV-2 glycoprotein. MALDI-TOF mass spectra of permethylated N-glycans derived from 329-FPNITNLCPFGE-340 glycopeptide (containing the N331 glycosylation site) and 341-VFNATR-346 glycopeptide (containing the N343 glycosylation site).,https://doi.org/10.1093/glycob/cwaa085
P0DTC2,331,G78059CC,G78059CC,Asn,N-linked,,32886791,Glycoproteomics by LC ES-MS (MSe) and collisionally activated CAD MS/MS (DDA)using an Acquity UPLC coupled with a Xevo G2-XS Q-TOF Mass Spectrometer. Glycomic analysis of the N331 and N343 glycopeptides derived from the RBD of the S1 spike SARS-CoV-2 glycoprotein. MALDI-TOF mass spectra of permethylated N-glycans derived from 329-FPNITNLCPFGE-340 glycopeptide (containing the N331 glycosylation site) and 341-VFNATR-346 glycopeptide (containing the N343 glycosylation site).,https://doi.org/10.1093/glycob/cwaa085
P0DTC2,331,G45922RX,G45922RX,Asn,N-linked,,32886791,Glycoproteomics by LC ES-MS (MSe) and collisionally activated CAD MS/MS (DDA)using an Acquity UPLC coupled with a Xevo G2-XS Q-TOF Mass Spectrometer. Glycomic analysis of the N331 and N343 glycopeptides derived from the RBD of the S1 spike SARS-CoV-2 glycoprotein. MALDI-TOF mass spectra of permethylated N-glycans derived from 329-FPNITNLCPFGE-340 glycopeptide (containing the N331 glycosylation site) and 341-VFNATR-346 glycopeptide (containing the N343 glycosylation site).,https://doi.org/10.1093/glycob/cwaa085
P0DTC2,331,G88417ED,G88417ED,Asn,N-linked,,32886791,Glycoproteomics by LC ES-MS (MSe) and collisionally activated CAD MS/MS (DDA)using an Acquity UPLC coupled with a Xevo G2-XS Q-TOF Mass Spectrometer. Glycomic analysis of the N331 and N343 glycopeptides derived from the RBD of the S1 spike SARS-CoV-2 glycoprotein. MALDI-TOF mass spectra of permethylated N-glycans derived from 329-FPNITNLCPFGE-340 glycopeptide (containing the N331 glycosylation site) and 341-VFNATR-346 glycopeptide (containing the N343 glycosylation site).,https://doi.org/10.1093/glycob/cwaa085
P0DTC2,331,G82252QI,G82252QI,Asn,N-linked,,32886791,Glycoproteomics by LC ES-MS (MSe) and collisionally activated CAD MS/MS (DDA)using an Acquity UPLC coupled with a Xevo G2-XS Q-TOF Mass Spectrometer. Glycomic analysis of the N331 and N343 glycopeptides derived from the RBD of the S1 spike SARS-CoV-2 glycoprotein. MALDI-TOF mass spectra of permethylated N-glycans derived from 329-FPNITNLCPFGE-340 glycopeptide (containing the N331 glycosylation site) and 341-VFNATR-346 glycopeptide (containing the N343 glycosylation site).,https://doi.org/10.1093/glycob/cwaa085
P0DTC2,331,G08979EC/G45640DX,G08979EC/G45640DX,Asn,N-linked,,32886791,Glycoproteomics by LC ES-MS (MSe) and collisionally activated CAD MS/MS (DDA)using an Acquity UPLC coupled with a Xevo G2-XS Q-TOF Mass Spectrometer. Glycomic analysis of the N331 and N343 glycopeptides derived from the RBD of the S1 spike SARS-CoV-2 glycoprotein. MALDI-TOF mass spectra of permethylated N-glycans derived from 329-FPNITNLCPFGE-340 glycopeptide (containing the N331 glycosylation site) and 341-VFNATR-346 glycopeptide (containing the N343 glycosylation site).,https://doi.org/10.1093/glycob/cwaa085
P0DTC2,331,G86102AA,G86102AA,Asn,N-linked,,32886791,Glycoproteomics by LC ES-MS (MSe) and collisionally activated CAD MS/MS (DDA)using an Acquity UPLC coupled with a Xevo G2-XS Q-TOF Mass Spectrometer. Glycomic analysis of the N331 and N343 glycopeptides derived from the RBD of the S1 spike SARS-CoV-2 glycoprotein. MALDI-TOF mass spectra of permethylated N-glycans derived from 329-FPNITNLCPFGE-340 glycopeptide (containing the N331 glycosylation site) and 341-VFNATR-346 glycopeptide (containing the N343 glycosylation site).,https://doi.org/10.1093/glycob/cwaa085
P0DTC2,331,G77939VD,G77939VD,Asn,N-linked,,32886791,Glycoproteomics by LC ES-MS (MSe) and collisionally activated CAD MS/MS (DDA)using an Acquity UPLC coupled with a Xevo G2-XS Q-TOF Mass Spectrometer. Glycomic analysis of the N331 and N343 glycopeptides derived from the RBD of the S1 spike SARS-CoV-2 glycoprotein. MALDI-TOF mass spectra of permethylated N-glycans derived from 329-FPNITNLCPFGE-340 glycopeptide (containing the N331 glycosylation site) and 341-VFNATR-346 glycopeptide (containing the N343 glycosylation site).,https://doi.org/10.1093/glycob/cwaa085
P0DTC2,331,G01510MQ,G01510MQ,Asn,N-linked,,32886791,Glycoproteomics by LC ES-MS (MSe) and collisionally activated CAD MS/MS (DDA)using an Acquity UPLC coupled with a Xevo G2-XS Q-TOF Mass Spectrometer. Glycomic analysis of the N331 and N343 glycopeptides derived from the RBD of the S1 spike SARS-CoV-2 glycoprotein. MALDI-TOF mass spectra of permethylated N-glycans derived from 329-FPNITNLCPFGE-340 glycopeptide (containing the N331 glycosylation site) and 341-VFNATR-346 glycopeptide (containing the N343 glycosylation site).,https://doi.org/10.1093/glycob/cwaa085
P0DTC2,331,G36221RT,G36221RT,Asn,N-linked,,32886791,Glycoproteomics by LC ES-MS (MSe) and collisionally activated CAD MS/MS (DDA)using an Acquity UPLC coupled with a Xevo G2-XS Q-TOF Mass Spectrometer. Glycomic analysis of the N331 and N343 glycopeptides derived from the RBD of the S1 spike SARS-CoV-2 glycoprotein. MALDI-TOF mass spectra of permethylated N-glycans derived from 329-FPNITNLCPFGE-340 glycopeptide (containing the N331 glycosylation site) and 341-VFNATR-346 glycopeptide (containing the N343 glycosylation site).,https://doi.org/10.1093/glycob/cwaa085
P0DTC2,331,G76136FD,G76136FD,Asn,N-linked,,32886791,Glycoproteomics by LC ES-MS (MSe) and collisionally activated CAD MS/MS (DDA)using an Acquity UPLC coupled with a Xevo G2-XS Q-TOF Mass Spectrometer. Glycomic analysis of the N331 and N343 glycopeptides derived from the RBD of the S1 spike SARS-CoV-2 glycoprotein. MALDI-TOF mass spectra of permethylated N-glycans derived from 329-FPNITNLCPFGE-340 glycopeptide (containing the N331 glycosylation site) and 341-VFNATR-346 glycopeptide (containing the N343 glycosylation site).,https://doi.org/10.1093/glycob/cwaa085
P0DTC2,331,G23634MW,G23634MW,Asn,N-linked,,32886791,Glycoproteomics by LC ES-MS (MSe) and collisionally activated CAD MS/MS (DDA)using an Acquity UPLC coupled with a Xevo G2-XS Q-TOF Mass Spectrometer. Glycomic analysis of the N331 and N343 glycopeptides derived from the RBD of the S1 spike SARS-CoV-2 glycoprotein. MALDI-TOF mass spectra of permethylated N-glycans derived from 329-FPNITNLCPFGE-340 glycopeptide (containing the N331 glycosylation site) and 341-VFNATR-346 glycopeptide (containing the N343 glycosylation site).,https://doi.org/10.1093/glycob/cwaa085
P0DTC2,331,G28974LC/G90764JW,G28974LC/G90764JW,Asn,N-linked,,32886791,Glycoproteomics by LC ES-MS (MSe) and collisionally activated CAD MS/MS (DDA)using an Acquity UPLC coupled with a Xevo G2-XS Q-TOF Mass Spectrometer. Glycomic analysis of the N331 and N343 glycopeptides derived from the RBD of the S1 spike SARS-CoV-2 glycoprotein. MALDI-TOF mass spectra of permethylated N-glycans derived from 329-FPNITNLCPFGE-340 glycopeptide (containing the N331 glycosylation site) and 341-VFNATR-346 glycopeptide (containing the N343 glycosylation site).,https://doi.org/10.1093/glycob/cwaa085
P0DTC2,331,G35242IF,G35242IF,Asn,N-linked,,32886791,Glycoproteomics by LC ES-MS (MSe) and collisionally activated CAD MS/MS (DDA)using an Acquity UPLC coupled with a Xevo G2-XS Q-TOF Mass Spectrometer. Glycomic analysis of the N331 and N343 glycopeptides derived from the RBD of the S1 spike SARS-CoV-2 glycoprotein. MALDI-TOF mass spectra of permethylated N-glycans derived from 329-FPNITNLCPFGE-340 glycopeptide (containing the N331 glycosylation site) and 341-VFNATR-346 glycopeptide (containing the N343 glycosylation site).,https://doi.org/10.1093/glycob/cwaa085
P0DTC2,331,G5404QW,G5404QW,Asn,N-linked,,32886791,Glycoproteomics by LC ES-MS (MSe) and collisionally activated CAD MS/MS (DDA)using an Acquity UPLC coupled with a Xevo G2-XS Q-TOF Mass Spectrometer. Glycomic analysis of the N331 and N343 glycopeptides derived from the RBD of the S1 spike SARS-CoV-2 glycoprotein. MALDI-TOF mass spectra of permethylated N-glycans derived from 329-FPNITNLCPFGE-340 glycopeptide (containing the N331 glycosylation site) and 341-VFNATR-346 glycopeptide (containing the N343 glycosylation site).,https://doi.org/10.1093/glycob/cwaa085
P0DTC2,331,G38802SW,G38802SW,Asn,N-linked,,32886791,Glycoproteomics by LC ES-MS (MSe) and collisionally activated CAD MS/MS (DDA)using an Acquity UPLC coupled with a Xevo G2-XS Q-TOF Mass Spectrometer. Glycomic analysis of the N331 and N343 glycopeptides derived from the RBD of the S1 spike SARS-CoV-2 glycoprotein. MALDI-TOF mass spectra of permethylated N-glycans derived from 329-FPNITNLCPFGE-340 glycopeptide (containing the N331 glycosylation site) and 341-VFNATR-346 glycopeptide (containing the N343 glycosylation site).,https://doi.org/10.1093/glycob/cwaa085
P0DTC2,331,G48789OQ,G48789OQ,Asn,N-linked,,32886791,Glycoproteomics by LC ES-MS (MSe) and collisionally activated CAD MS/MS (DDA)using an Acquity UPLC coupled with a Xevo G2-XS Q-TOF Mass Spectrometer. Glycomic analysis of the N331 and N343 glycopeptides derived from the RBD of the S1 spike SARS-CoV-2 glycoprotein. MALDI-TOF mass spectra of permethylated N-glycans derived from 329-FPNITNLCPFGE-340 glycopeptide (containing the N331 glycosylation site) and 341-VFNATR-346 glycopeptide (containing the N343 glycosylation site).,https://doi.org/10.1093/glycob/cwaa085
P0DTC2,331,G20830HU,G20830HU,Asn,N-linked,,32886791,Glycoproteomics by LC ES-MS (MSe) and collisionally activated CAD MS/MS (DDA)using an Acquity UPLC coupled with a Xevo G2-XS Q-TOF Mass Spectrometer. Glycomic analysis of the N331 and N343 glycopeptides derived from the RBD of the S1 spike SARS-CoV-2 glycoprotein. MALDI-TOF mass spectra of permethylated N-glycans derived from 329-FPNITNLCPFGE-340 glycopeptide (containing the N331 glycosylation site) and 341-VFNATR-346 glycopeptide (containing the N343 glycosylation site).,https://doi.org/10.1093/glycob/cwaa085
P0DTC2,331,G94937SR,G94937SR,Asn,N-linked,,32886791,Glycoproteomics by LC ES-MS (MSe) and collisionally activated CAD MS/MS (DDA)using an Acquity UPLC coupled with a Xevo G2-XS Q-TOF Mass Spectrometer. Glycomic analysis of the N331 and N343 glycopeptides derived from the RBD of the S1 spike SARS-CoV-2 glycoprotein. MALDI-TOF mass spectra of permethylated N-glycans derived from 329-FPNITNLCPFGE-340 glycopeptide (containing the N331 glycosylation site) and 341-VFNATR-346 glycopeptide (containing the N343 glycosylation site).,https://doi.org/10.1093/glycob/cwaa085
P0DTC2,331,G98716RB,G98716RB,Asn,N-linked,,32886791,Glycoproteomics by LC ES-MS (MSe) and collisionally activated CAD MS/MS (DDA)using an Acquity UPLC coupled with a Xevo G2-XS Q-TOF Mass Spectrometer. Glycomic analysis of the N331 and N343 glycopeptides derived from the RBD of the S1 spike SARS-CoV-2 glycoprotein. MALDI-TOF mass spectra of permethylated N-glycans derived from 329-FPNITNLCPFGE-340 glycopeptide (containing the N331 glycosylation site) and 341-VFNATR-346 glycopeptide (containing the N343 glycosylation site).,https://doi.org/10.1093/glycob/cwaa085
P0DTC2,331,G62654HS,G62654HS,Asn,N-linked,,32886791,Glycoproteomics by LC ES-MS (MSe) and collisionally activated CAD MS/MS (DDA)using an Acquity UPLC coupled with a Xevo G2-XS Q-TOF Mass Spectrometer. Glycomic analysis of the N331 and N343 glycopeptides derived from the RBD of the S1 spike SARS-CoV-2 glycoprotein. MALDI-TOF mass spectra of permethylated N-glycans derived from 329-FPNITNLCPFGE-340 glycopeptide (containing the N331 glycosylation site) and 341-VFNATR-346 glycopeptide (containing the N343 glycosylation site).,https://doi.org/10.1093/glycob/cwaa085
P0DTC2,331,G84122EI,G84122EI,Asn,N-linked,,32886791,Glycoproteomics by LC ES-MS (MSe) and collisionally activated CAD MS/MS (DDA)using an Acquity UPLC coupled with a Xevo G2-XS Q-TOF Mass Spectrometer. Glycomic analysis of the N331 and N343 glycopeptides derived from the RBD of the S1 spike SARS-CoV-2 glycoprotein. MALDI-TOF mass spectra of permethylated N-glycans derived from 329-FPNITNLCPFGE-340 glycopeptide (containing the N331 glycosylation site) and 341-VFNATR-346 glycopeptide (containing the N343 glycosylation site).,https://doi.org/10.1093/glycob/cwaa085
P0DTC2,331,G03944IG,G03944IG,Asn,N-linked,,32886791,Glycoproteomics by LC ES-MS (MSe) and collisionally activated CAD MS/MS (DDA)using an Acquity UPLC coupled with a Xevo G2-XS Q-TOF Mass Spectrometer. Glycomic analysis of the N331 and N343 glycopeptides derived from the RBD of the S1 spike SARS-CoV-2 glycoprotein. MALDI-TOF mass spectra of permethylated N-glycans derived from 329-FPNITNLCPFGE-340 glycopeptide (containing the N331 glycosylation site) and 341-VFNATR-346 glycopeptide (containing the N343 glycosylation site).,https://doi.org/10.1093/glycob/cwaa085
P0DTC2,331,G40306EB,G40306EB,Asn,N-linked,,32886791,Glycoproteomics by LC ES-MS (MSe) and collisionally activated CAD MS/MS (DDA)using an Acquity UPLC coupled with a Xevo G2-XS Q-TOF Mass Spectrometer. Glycomic analysis of the N331 and N343 glycopeptides derived from the RBD of the S1 spike SARS-CoV-2 glycoprotein. MALDI-TOF mass spectra of permethylated N-glycans derived from 329-FPNITNLCPFGE-340 glycopeptide (containing the N331 glycosylation site) and 341-VFNATR-346 glycopeptide (containing the N343 glycosylation site).,https://doi.org/10.1093/glycob/cwaa085
P0DTC2,331,G85288QT,G85288QT,Asn,N-linked,,32886791,Glycoproteomics by LC ES-MS (MSe) and collisionally activated CAD MS/MS (DDA)using an Acquity UPLC coupled with a Xevo G2-XS Q-TOF Mass Spectrometer. Glycomic analysis of the N331 and N343 glycopeptides derived from the RBD of the S1 spike SARS-CoV-2 glycoprotein. MALDI-TOF mass spectra of permethylated N-glycans derived from 329-FPNITNLCPFGE-340 glycopeptide (containing the N331 glycosylation site) and 341-VFNATR-346 glycopeptide (containing the N343 glycosylation site).,https://doi.org/10.1093/glycob/cwaa085
P0DTC2,331,G52880ZN,G52880ZN,Asn,N-linked,,32886791,Glycoproteomics by LC ES-MS (MSe) and collisionally activated CAD MS/MS (DDA)using an Acquity UPLC coupled with a Xevo G2-XS Q-TOF Mass Spectrometer. Glycomic analysis of the N331 and N343 glycopeptides derived from the RBD of the S1 spike SARS-CoV-2 glycoprotein. MALDI-TOF mass spectra of permethylated N-glycans derived from 329-FPNITNLCPFGE-340 glycopeptide (containing the N331 glycosylation site) and 341-VFNATR-346 glycopeptide (containing the N343 glycosylation site).,https://doi.org/10.1093/glycob/cwaa085
P0DTC2,331,G82252QI,G82252QI,Asn,N-linked,,32886791,Glycoproteomics by LC ES-MS (MSe) and collisionally activated CAD MS/MS (DDA)using an Acquity UPLC coupled with a Xevo G2-XS Q-TOF Mass Spectrometer. Glycomic analysis of the N331 and N343 glycopeptides derived from the RBD of the S1 spike SARS-CoV-2 glycoprotein. MALDI-TOF mass spectra of permethylated N-glycans derived from 329-FPNITNLCPFGE-340 glycopeptide (containing the N331 glycosylation site) and 341-VFNATR-346 glycopeptide (containing the N343 glycosylation site).,https://doi.org/10.1093/glycob/cwaa085
P0DTC2,331,G28082CI,G28082CI,Asn,N-linked,,32886791,Glycoproteomics by LC ES-MS (MSe) and collisionally activated CAD MS/MS (DDA)using an Acquity UPLC coupled with a Xevo G2-XS Q-TOF Mass Spectrometer. Glycomic analysis of the N331 and N343 glycopeptides derived from the RBD of the S1 spike SARS-CoV-2 glycoprotein. MALDI-TOF mass spectra of permethylated N-glycans derived from 329-FPNITNLCPFGE-340 glycopeptide (containing the N331 glycosylation site) and 341-VFNATR-346 glycopeptide (containing the N343 glycosylation site).,https://doi.org/10.1093/glycob/cwaa085
P0DTC2,323|325,G57321FI,G57321FI,Thr|Ser,O-linked,Inferred curated structure,32886791,Glycoproteomics by LC ES-MS (MSe) and collisionally activated CAD MS/MS (DDA)using an Acquity UPLC coupled with a Xevo G2-XS Q-TOF Mass Spectrometer. Glycomic analysis of the N331 and N343 glycopeptides derived from the RBD of the S1 spike SARS-CoV-2 glycoprotein. MALDI-TOF mass spectra of permethylated N-glycans derived from 329-FPNITNLCPFGE-340 glycopeptide (containing the N331 glycosylation site) and 341-VFNATR-346 glycopeptide (containing the N343 glycosylation site).,https://doi.org/10.1093/glycob/cwaa085
P0DTC2,323|325,G00031MO,G00031MO,Thr|Ser,O-linked,Inferred curated structure,32886791,Glycoproteomics by LC ES-MS (MSe) and collisionally activated CAD MS/MS (DDA)using an Acquity UPLC coupled with a Xevo G2-XS Q-TOF Mass Spectrometer. Glycomic analysis of the N331 and N343 glycopeptides derived from the RBD of the S1 spike SARS-CoV-2 glycoprotein. MALDI-TOF mass spectra of permethylated N-glycans derived from 329-FPNITNLCPFGE-340 glycopeptide (containing the N331 glycosylation site) and 341-VFNATR-346 glycopeptide (containing the N343 glycosylation site).,https://doi.org/10.1093/glycob/cwaa085
P0DTC2,323|325,G85811SG,G85811SG,Thr|Ser,O-linked,,32886791,Glycoproteomics by LC ES-MS (MSe) and collisionally activated CAD MS/MS (DDA)using an Acquity UPLC coupled with a Xevo G2-XS Q-TOF Mass Spectrometer. Glycomic analysis of the N331 and N343 glycopeptides derived from the RBD of the S1 spike SARS-CoV-2 glycoprotein. MALDI-TOF mass spectra of permethylated N-glycans derived from 329-FPNITNLCPFGE-340 glycopeptide (containing the N331 glycosylation site) and 341-VFNATR-346 glycopeptide (containing the N343 glycosylation site).,https://doi.org/10.1093/glycob/cwaa085
P0DTC2,323|325,G49139YY,G49139YY,Thr|Ser,O-linked,,32886791,Glycoproteomics by LC ES-MS (MSe) and collisionally activated CAD MS/MS (DDA)using an Acquity UPLC coupled with a Xevo G2-XS Q-TOF Mass Spectrometer. Glycomic analysis of the N331 and N343 glycopeptides derived from the RBD of the S1 spike SARS-CoV-2 glycoprotein. MALDI-TOF mass spectra of permethylated N-glycans derived from 329-FPNITNLCPFGE-340 glycopeptide (containing the N331 glycosylation site) and 341-VFNATR-346 glycopeptide (containing the N343 glycosylation site).,https://doi.org/10.1093/glycob/cwaa085
P0DTC2,323|325,G00390GQ,G00390GQ,Thr|Ser,O-linked,,32886791,Glycoproteomics by LC ES-MS (MSe) and collisionally activated CAD MS/MS (DDA)using an Acquity UPLC coupled with a Xevo G2-XS Q-TOF Mass Spectrometer. Glycomic analysis of the N331 and N343 glycopeptides derived from the RBD of the S1 spike SARS-CoV-2 glycoprotein. MALDI-TOF mass spectra of permethylated N-glycans derived from 329-FPNITNLCPFGE-340 glycopeptide (containing the N331 glycosylation site) and 341-VFNATR-346 glycopeptide (containing the N343 glycosylation site).,
,,,,,,,,Glycoproteomics by LC ES-MS (MSe) and collisionally activated CAD MS/MS (DDA)using an Acquity UPLC coupled with a Xevo G2-XS Q-TOF Mass Spectrometer. Glycomic analysis of the N331 and N343 glycopeptides derived from the RBD of the S1 spike SARS-CoV-2 glycoprotein. MALDI-TOF mass spectra of permethylated N-glycans derived from 329-FPNITNLCPFGE-340 glycopeptide (containing the N331 glycosylation site) and 341-VFNATR-346 glycopeptide (containing the N343 glycosylation site).,
,,,,,,,,Glycoproteomics by LC ES-MS (MSe) and collisionally activated CAD MS/MS (DDA)using an Acquity UPLC coupled with a Xevo G2-XS Q-TOF Mass Spectrometer. Glycomic analysis of the N331 and N343 glycopeptides derived from the RBD of the S1 spike SARS-CoV-2 glycoprotein. MALDI-TOF mass spectra of permethylated N-glycans derived from 329-FPNITNLCPFGE-340 glycopeptide (containing the N331 glycosylation site) and 341-VFNATR-346 glycopeptide (containing the N343 glycosylation site).,
,,,,,,,,Glycoproteomics by LC ES-MS (MSe) and collisionally activated CAD MS/MS (DDA)using an Acquity UPLC coupled with a Xevo G2-XS Q-TOF Mass Spectrometer. Glycomic analysis of the N331 and N343 glycopeptides derived from the RBD of the S1 spike SARS-CoV-2 glycoprotein. MALDI-TOF mass spectra of permethylated N-glycans derived from 329-FPNITNLCPFGE-340 glycopeptide (containing the N331 glycosylation site) and 341-VFNATR-346 glycopeptide (containing the N343 glycosylation site).,