Protein,Position,comp,Id,Toucan,AminoAcid,TypeAminoAcid,Notes,Pmid,AdditionalNotes,doi,SWISS_MODEL,Tissue,Species,Uoxf,HexNAc,Hex,dHex,NeuAc,Abundance,pdb,Related,Preprint,Cellosaurus,Peptide,Composition1
P0DTC2,22,HexNAc2Hex2dHex1NeuAc2NeuGc0Pent0S0P0KDN0HexA0,G88333KU,G88333KU,Thr,O-linked,"ThermoFisher Lumos Tribrid stepped-HCD. pGlyco 2.2.2 and Byonic software. Expressed and purified a stabilized, soluble trimer Spike glycoprotein mimetic immunogen (S) and a soluble version of the ACE2 glycoprotein from a human cell line. To determine occupancy of N-linked glycans at each site a sequential deglycoslyation approach using Endoglycosidase H and PNGase F in the presence of 18O-H2O following tryptic digestion of S was used",32841605,The abundance of each composition based on assigned spectral counts.,10.1016/j.chom.2020.08.004 ,,,,,HexNAc2,Hex2,dHex1,NeuAc0,0.08%,,,https://www.biorxiv.org/content/10.1101/2020.06.25.172403v1,CVCL_0045,,G88333KU
P0DTC2,22,Unoccupied,,,Thr,O-linked,"ThermoFisher Lumos Tribrid stepped-HCD. pGlyco 2.2.2 and Byonic software. Expressed and purified a stabilized, soluble trimer Spike glycoprotein mimetic immunogen (S) and a soluble version of the ACE2 glycoprotein from a human cell line. To determine occupancy of N-linked glycans at each site a sequential deglycoslyation approach using Endoglycosidase H and PNGase F in the presence of 18O-H2O following tryptic digestion of S was used",32841605,The abundance of each composition based on assigned spectral counts.,10.1016/j.chom.2020.08.004 ,,,,,,,,,99.92%,,,https://www.biorxiv.org/content/10.1101/2020.06.25.172403v1,CVCL_0045,,
P0DTC2,29,HexNAc2Hex1dHex0NeuAc2NeuGc0Pent0S0P0KDN0HexA0,G10057RC,G10057RC,Thr,O-linked,"ThermoFisher Lumos Tribrid stepped-HCD. pGlyco 2.2.2 and Byonic software. Expressed and purified a stabilized, soluble trimer Spike glycoprotein mimetic immunogen (S) and a soluble version of the ACE2 glycoprotein from a human cell line. To determine occupancy of N-linked glycans at each site a sequential deglycoslyation approach using Endoglycosidase H and PNGase F in the presence of 18O-H2O following tryptic digestion of S was used",32841605,The abundance of each composition based on assigned spectral counts.,10.1016/j.chom.2020.08.004 ,,,,,HexNAc2,Hex1,dHex0,NeuAc2,0.07%,,,https://www.biorxiv.org/content/10.1101/2020.06.25.172403v1,CVCL_0045,,G10057RC
P0DTC2,29,Unoccupied,,,Thr,O-linked,"ThermoFisher Lumos Tribrid stepped-HCD. pGlyco 2.2.2 and Byonic software. Expressed and purified a stabilized, soluble trimer Spike glycoprotein mimetic immunogen (S) and a soluble version of the ACE2 glycoprotein from a human cell line. To determine occupancy of N-linked glycans at each site a sequential deglycoslyation approach using Endoglycosidase H and PNGase F in the presence of 18O-H2O following tryptic digestion of S was used",32841605,The abundance of each composition based on assigned spectral counts.,10.1016/j.chom.2020.08.004 ,,,,,,,,,99.93%,,,https://www.biorxiv.org/content/10.1101/2020.06.25.172403v1,CVCL_0045,,
P0DTC2,31,HexNAc2Hex0dHex0NeuAc0NeuGc0Pent0S0P0KDN0HexA0,G27391WQ,G27391WQ,Ser,O-linked,"ThermoFisher Lumos Tribrid stepped-HCD. pGlyco 2.2.2 and Byonic software. Expressed and purified a stabilized, soluble trimer Spike glycoprotein mimetic immunogen (S) and a soluble version of the ACE2 glycoprotein from a human cell line. To determine occupancy of N-linked glycans at each site a sequential deglycoslyation approach using Endoglycosidase H and PNGase F in the presence of 18O-H2O following tryptic digestion of S was used",32841605,The abundance of each composition based on assigned spectral counts.,10.1016/j.chom.2020.08.004 ,,,,,HexNAc2,Hex0,dHex0,NeuAc0,0.15%,,,https://www.biorxiv.org/content/10.1101/2020.06.25.172403v1,CVCL_0045,,G27391WQ
P0DTC2,31,Unoccupied,,,Ser,O-linked,"ThermoFisher Lumos Tribrid stepped-HCD. pGlyco 2.2.2 and Byonic software. Expressed and purified a stabilized, soluble trimer Spike glycoprotein mimetic immunogen (S) and a soluble version of the ACE2 glycoprotein from a human cell line. To determine occupancy of N-linked glycans at each site a sequential deglycoslyation approach using Endoglycosidase H and PNGase F in the presence of 18O-H2O following tryptic digestion of S was used",32841605,The abundance of each composition based on assigned spectral counts.,10.1016/j.chom.2020.08.004 ,,,,,,,,,99.85%,,,https://www.biorxiv.org/content/10.1101/2020.06.25.172403v1,CVCL_0045,,
P0DTC2,33,HexNAc2Hex1dHex1NeuAc0NeuGc0Pent0S0P0KDN0HexA0,G94583DZ,G94583DZ,Thr,O-linked,"ThermoFisher Lumos Tribrid stepped-HCD. pGlyco 2.2.2 and Byonic software. Expressed and purified a stabilized, soluble trimer Spike glycoprotein mimetic immunogen (S) and a soluble version of the ACE2 glycoprotein from a human cell line. To determine occupancy of N-linked glycans at each site a sequential deglycoslyation approach using Endoglycosidase H and PNGase F in the presence of 18O-H2O following tryptic digestion of S was used",32841605,The abundance of each composition based on assigned spectral counts.,10.1016/j.chom.2020.08.004 ,,,,,HexNAc2,Hex1,dHex1,NeuAc0,0.16%,,,https://www.biorxiv.org/content/10.1101/2020.06.25.172403v1,CVCL_0045,,G94583DZ
P0DTC2,33,Unoccupied,,,Thr,O-linked,"ThermoFisher Lumos Tribrid stepped-HCD. pGlyco 2.2.2 and Byonic software. Expressed and purified a stabilized, soluble trimer Spike glycoprotein mimetic immunogen (S) and a soluble version of the ACE2 glycoprotein from a human cell line. To determine occupancy of N-linked glycans at each site a sequential deglycoslyation approach using Endoglycosidase H and PNGase F in the presence of 18O-H2O following tryptic digestion of S was used",32841605,The abundance of each composition based on assigned spectral counts.,10.1016/j.chom.2020.08.004 ,,,,,,,,,99.84%,,,https://www.biorxiv.org/content/10.1101/2020.06.25.172403v1,CVCL_0045,,
P0DTC2,274,HexNAc1Hex0dHex0NeuAc0NeuGc0Pent0S0P0KDN0HexA0,G29068FM,G29068FM,Thr,O-linked,"ThermoFisher Lumos Tribrid stepped-HCD. pGlyco 2.2.2 and Byonic software. Expressed and purified a stabilized, soluble trimer Spike glycoprotein mimetic immunogen (S) and a soluble version of the ACE2 glycoprotein from a human cell line. To determine occupancy of N-linked glycans at each site a sequential deglycoslyation approach using Endoglycosidase H and PNGase F in the presence of 18O-H2O following tryptic digestion of S was used",32841605,The abundance of each composition based on assigned spectral counts.,10.1016/j.chom.2020.08.004 ,,,,,HexNAc1,Hex0,dHex0,NeuAc0,0.18%,,,https://www.biorxiv.org/content/10.1101/2020.06.25.172403v1,CVCL_0045,,G29068FM
P0DTC2,274,Unoccupied,,,Thr,O-linked,"ThermoFisher Lumos Tribrid stepped-HCD. pGlyco 2.2.2 and Byonic software. Expressed and purified a stabilized, soluble trimer Spike glycoprotein mimetic immunogen (S) and a soluble version of the ACE2 glycoprotein from a human cell line. To determine occupancy of N-linked glycans at each site a sequential deglycoslyation approach using Endoglycosidase H and PNGase F in the presence of 18O-H2O following tryptic digestion of S was used",32841605,The abundance of each composition based on assigned spectral counts.,10.1016/j.chom.2020.08.004 ,,,,,,,,,99.82%,,,https://www.biorxiv.org/content/10.1101/2020.06.25.172403v1,CVCL_0045,,
P0DTC2,315,HexNAc1Hex0dHex0NeuAc0NeuGc0Pent0S0P0KDN0HexA0,G29068FM,G29068FM,Thr,O-linked,"ThermoFisher Lumos Tribrid stepped-HCD. pGlyco 2.2.2 and Byonic software. Expressed and purified a stabilized, soluble trimer Spike glycoprotein mimetic immunogen (S) and a soluble version of the ACE2 glycoprotein from a human cell line. To determine occupancy of N-linked glycans at each site a sequential deglycoslyation approach using Endoglycosidase H and PNGase F in the presence of 18O-H2O following tryptic digestion of S was used",32841605,The abundance of each composition based on assigned spectral counts.,10.1016/j.chom.2020.08.004 ,,,,,HexNAc1,Hex0,dHex0,NeuAc0,0.38%,,,https://www.biorxiv.org/content/10.1101/2020.06.25.172403v1,CVCL_0045,,G29068FM
P0DTC2,315,HexNAc1Hex1dHex0NeuAc0NeuGc0Pent0S0P0KDN0HexA0,G43417UB,G43417UB,Thr,O-linked,"ThermoFisher Lumos Tribrid stepped-HCD. pGlyco 2.2.2 and Byonic software. Expressed and purified a stabilized, soluble trimer Spike glycoprotein mimetic immunogen (S) and a soluble version of the ACE2 glycoprotein from a human cell line. To determine occupancy of N-linked glycans at each site a sequential deglycoslyation approach using Endoglycosidase H and PNGase F in the presence of 18O-H2O following tryptic digestion of S was used",32841605,The abundance of each composition based on assigned spectral counts.,10.1016/j.chom.2020.08.004 ,,,,,HexNAc1,Hex1,dHex0,NeuAc0,0.38%,,,https://www.biorxiv.org/content/10.1101/2020.06.25.172403v1,CVCL_0045,,G43417UB
P0DTC2,315,Unoccupied,,,Thr,O-linked,"ThermoFisher Lumos Tribrid stepped-HCD. pGlyco 2.2.2 and Byonic software. Expressed and purified a stabilized, soluble trimer Spike glycoprotein mimetic immunogen (S) and a soluble version of the ACE2 glycoprotein from a human cell line. To determine occupancy of N-linked glycans at each site a sequential deglycoslyation approach using Endoglycosidase H and PNGase F in the presence of 18O-H2O following tryptic digestion of S was used",32841605,The abundance of each composition based on assigned spectral counts.,10.1016/j.chom.2020.08.004 ,,,,,,,,,99.62%,,,https://www.biorxiv.org/content/10.1101/2020.06.25.172403v1,CVCL_0045,,
P0DTC2,323,HexNAc1Hex0dHex0NeuAc0NeuGc0Pent0S0P0KDN0HexA0,G29068FM,G29068FM,Thr,O-linked,"ThermoFisher Lumos Tribrid stepped-HCD. pGlyco 2.2.2 and Byonic software. Expressed and purified a stabilized, soluble trimer Spike glycoprotein mimetic immunogen (S) and a soluble version of the ACE2 glycoprotein from a human cell line. To determine occupancy of N-linked glycans at each site a sequential deglycoslyation approach using Endoglycosidase H and PNGase F in the presence of 18O-H2O following tryptic digestion of S was used",32841605,The abundance of each composition based on assigned spectral counts.,10.1016/j.chom.2020.08.004 ,,,,,HexNAc1,Hex0,dHex0,NeuAc0,10.97%,,,https://www.biorxiv.org/content/10.1101/2020.06.25.172403v1,CVCL_0045,,G29068FM
P0DTC2,323,HexNAc1Hex1dHex0NeuAc0NeuGc0Pent0S0P0KDN0HexA0,G43417UB,G43417UB,Thr,O-linked,"ThermoFisher Lumos Tribrid stepped-HCD. pGlyco 2.2.2 and Byonic software. Expressed and purified a stabilized, soluble trimer Spike glycoprotein mimetic immunogen (S) and a soluble version of the ACE2 glycoprotein from a human cell line. To determine occupancy of N-linked glycans at each site a sequential deglycoslyation approach using Endoglycosidase H and PNGase F in the presence of 18O-H2O following tryptic digestion of S was used",32841605,The abundance of each composition based on assigned spectral counts.,10.1016/j.chom.2020.08.004 ,,,,,HexNAc1,Hex1,dHex0,NeuAc0,10.97%,,,https://www.biorxiv.org/content/10.1101/2020.06.25.172403v1,CVCL_0045,,G43417UB
P0DTC2,323,HexNAc1Hex1dHex0NeuAc1NeuGc0Pent0S0P0KDN0HexA0,G17015OC,G17015OC,Thr,O-linked,"ThermoFisher Lumos Tribrid stepped-HCD. pGlyco 2.2.2 and Byonic software. Expressed and purified a stabilized, soluble trimer Spike glycoprotein mimetic immunogen (S) and a soluble version of the ACE2 glycoprotein from a human cell line. To determine occupancy of N-linked glycans at each site a sequential deglycoslyation approach using Endoglycosidase H and PNGase F in the presence of 18O-H2O following tryptic digestion of S was used",32841605,The abundance of each composition based on assigned spectral counts.,10.1016/j.chom.2020.08.004 ,,,,,HexNAc1,Hex1,dHex0,NeuAc1,0.24%,,,https://www.biorxiv.org/content/10.1101/2020.06.25.172403v1,CVCL_0045,,G17015OC
P0DTC2,323,HexNAc1Hex1dHex0NeuAc2NeuGc0Pent0S0P0KDN0HexA0,G23729WG,G23729WG,Thr,O-linked,"ThermoFisher Lumos Tribrid stepped-HCD. pGlyco 2.2.2 and Byonic software. Expressed and purified a stabilized, soluble trimer Spike glycoprotein mimetic immunogen (S) and a soluble version of the ACE2 glycoprotein from a human cell line. To determine occupancy of N-linked glycans at each site a sequential deglycoslyation approach using Endoglycosidase H and PNGase F in the presence of 18O-H2O following tryptic digestion of S was used",32841605,The abundance of each composition based on assigned spectral counts.,10.1016/j.chom.2020.08.004 ,,,,,HexNAc1,Hex1,dHex0,NeuAc2,10.97%,,,https://www.biorxiv.org/content/10.1101/2020.06.25.172403v1,CVCL_0045,,G23729WG
P0DTC2,323,HexNAc2Hex1dHex0NeuAc0NeuGc0Pent0S0P0KDN0HexA0,G58001LT,G58001LT,Thr,O-linked,"ThermoFisher Lumos Tribrid stepped-HCD. pGlyco 2.2.2 and Byonic software. Expressed and purified a stabilized, soluble trimer Spike glycoprotein mimetic immunogen (S) and a soluble version of the ACE2 glycoprotein from a human cell line. To determine occupancy of N-linked glycans at each site a sequential deglycoslyation approach using Endoglycosidase H and PNGase F in the presence of 18O-H2O following tryptic digestion of S was used",32841605,The abundance of each composition based on assigned spectral counts.,10.1016/j.chom.2020.08.004 ,,,,,HexNAc2,Hex1,dHex0,NeuAc0,10.97%,,,https://www.biorxiv.org/content/10.1101/2020.06.25.172403v1,CVCL_0045,,G58001LT
P0DTC2,323,HexNAc2Hex2dHex0NeuAc0NeuGc0Pent0S0P0KDN0HexA0,G53434XO,G53434XO,Thr,O-linked,"ThermoFisher Lumos Tribrid stepped-HCD. pGlyco 2.2.2 and Byonic software. Expressed and purified a stabilized, soluble trimer Spike glycoprotein mimetic immunogen (S) and a soluble version of the ACE2 glycoprotein from a human cell line. To determine occupancy of N-linked glycans at each site a sequential deglycoslyation approach using Endoglycosidase H and PNGase F in the presence of 18O-H2O following tryptic digestion of S was used",32841605,The abundance of each composition based on assigned spectral counts.,10.1016/j.chom.2020.08.004 ,,,,,HexNAc2,Hex2,dHex0,NeuAc0,10.97%,,,https://www.biorxiv.org/content/10.1101/2020.06.25.172403v1,CVCL_0045,,G53434XO
P0DTC2,323,Unoccupied,,,Thr,O-linked,"ThermoFisher Lumos Tribrid stepped-HCD. pGlyco 2.2.2 and Byonic software. Expressed and purified a stabilized, soluble trimer Spike glycoprotein mimetic immunogen (S) and a soluble version of the ACE2 glycoprotein from a human cell line. To determine occupancy of N-linked glycans at each site a sequential deglycoslyation approach using Endoglycosidase H and PNGase F in the presence of 18O-H2O following tryptic digestion of S was used",32841605,The abundance of each composition based on assigned spectral counts.,10.1016/j.chom.2020.08.004 ,,,,,,,,,89.03%,,,https://www.biorxiv.org/content/10.1101/2020.06.25.172403v1,CVCL_0045,,
P0DTC2,325,HexNAc1Hex0dHex0NeuAc0NeuGc0Pent0S0P0KDN0HexA0,G29068FM,G29068FM,Ser,O-linked,"ThermoFisher Lumos Tribrid stepped-HCD. pGlyco 2.2.2 and Byonic software. Expressed and purified a stabilized, soluble trimer Spike glycoprotein mimetic immunogen (S) and a soluble version of the ACE2 glycoprotein from a human cell line. To determine occupancy of N-linked glycans at each site a sequential deglycoslyation approach using Endoglycosidase H and PNGase F in the presence of 18O-H2O following tryptic digestion of S was used",32841605,The abundance of each composition based on assigned spectral counts.,10.1016/j.chom.2020.08.004 ,,,,,HexNAc1,Hex0,dHex0,NeuAc0,2.00%,,,https://www.biorxiv.org/content/10.1101/2020.06.25.172403v1,CVCL_0045,,G29068FM
P0DTC2,325,Unoccupied,,,Ser,O-linked,"ThermoFisher Lumos Tribrid stepped-HCD. pGlyco 2.2.2 and Byonic software. Expressed and purified a stabilized, soluble trimer Spike glycoprotein mimetic immunogen (S) and a soluble version of the ACE2 glycoprotein from a human cell line. To determine occupancy of N-linked glycans at each site a sequential deglycoslyation approach using Endoglycosidase H and PNGase F in the presence of 18O-H2O following tryptic digestion of S was used",32841605,The abundance of each composition based on assigned spectral counts.,10.1016/j.chom.2020.08.004 ,,,,,,,,,98.00%,,,https://www.biorxiv.org/content/10.1101/2020.06.25.172403v1,CVCL_0045,,
P0DTC2,359,HexNAc1Hex1dHex1NeuAc0NeuGc0Pent0S0P0KDN0HexA0,G54129SE,G54129SE,Ser,O-linked,"ThermoFisher Lumos Tribrid stepped-HCD. pGlyco 2.2.2 and Byonic software. Expressed and purified a stabilized, soluble trimer Spike glycoprotein mimetic immunogen (S) and a soluble version of the ACE2 glycoprotein from a human cell line. To determine occupancy of N-linked glycans at each site a sequential deglycoslyation approach using Endoglycosidase H and PNGase F in the presence of 18O-H2O following tryptic digestion of S was used",32841605,The abundance of each composition based on assigned spectral counts.,10.1016/j.chom.2020.08.004 ,,,,,HexNAc1,Hex1,dHex1,NeuAc0,0.45%,,,https://www.biorxiv.org/content/10.1101/2020.06.25.172403v1,CVCL_0045,,G54129SE
P0DTC2,359,HexNAc1Hex2dHex0NeuAc0NeuGc0Pent0S0P0KDN0HexA0,G05394UY,G05394UY,Ser,O-linked,"ThermoFisher Lumos Tribrid stepped-HCD. pGlyco 2.2.2 and Byonic software. Expressed and purified a stabilized, soluble trimer Spike glycoprotein mimetic immunogen (S) and a soluble version of the ACE2 glycoprotein from a human cell line. To determine occupancy of N-linked glycans at each site a sequential deglycoslyation approach using Endoglycosidase H and PNGase F in the presence of 18O-H2O following tryptic digestion of S was used",32841605,The abundance of each composition based on assigned spectral counts.,10.1016/j.chom.2020.08.004 ,,,,,HexNAc1,Hex2,dHex0,NeuAc0,1.05%,,,https://www.biorxiv.org/content/10.1101/2020.06.25.172403v1,CVCL_0045,,G05394UY
P0DTC2,359,HexNAc1Hex2dHex1NeuAc0NeuGc0Pent0S0P0KDN0HexA0,G11235SR,G11235SR,Ser,O-linked,"ThermoFisher Lumos Tribrid stepped-HCD. pGlyco 2.2.2 and Byonic software. Expressed and purified a stabilized, soluble trimer Spike glycoprotein mimetic immunogen (S) and a soluble version of the ACE2 glycoprotein from a human cell line. To determine occupancy of N-linked glycans at each site a sequential deglycoslyation approach using Endoglycosidase H and PNGase F in the presence of 18O-H2O following tryptic digestion of S was used",32841605,The abundance of each composition based on assigned spectral counts.,10.1016/j.chom.2020.08.004 ,,,,,HexNAc1,Hex2,dHex1,NeuAc0,0.30%,,,https://www.biorxiv.org/content/10.1101/2020.06.25.172403v1,CVCL_0045,,G11235SR
P0DTC2,359,Unoccupied,,,Ser,O-linked,"ThermoFisher Lumos Tribrid stepped-HCD. pGlyco 2.2.2 and Byonic software. Expressed and purified a stabilized, soluble trimer Spike glycoprotein mimetic immunogen (S) and a soluble version of the ACE2 glycoprotein from a human cell line. To determine occupancy of N-linked glycans at each site a sequential deglycoslyation approach using Endoglycosidase H and PNGase F in the presence of 18O-H2O following tryptic digestion of S was used",32841605,The abundance of each composition based on assigned spectral counts.,10.1016/j.chom.2020.08.004 ,,,,,,,,,98.95%,,,https://www.biorxiv.org/content/10.1101/2020.06.25.172403v1,CVCL_0045,,
P0DTC2,366,HexNAc1Hex1dHex1NeuAc0NeuGc0Pent0S0P0KDN0HexA0,G54129SE,G54129SE,Ser,O-linked,"ThermoFisher Lumos Tribrid stepped-HCD. pGlyco 2.2.2 and Byonic software. Expressed and purified a stabilized, soluble trimer Spike glycoprotein mimetic immunogen (S) and a soluble version of the ACE2 glycoprotein from a human cell line. To determine occupancy of N-linked glycans at each site a sequential deglycoslyation approach using Endoglycosidase H and PNGase F in the presence of 18O-H2O following tryptic digestion of S was used",32841605,The abundance of each composition based on assigned spectral counts.,10.1016/j.chom.2020.08.004 ,,,,,HexNAc1,Hex1,dHex1,NeuAc0,0.18%,,,https://www.biorxiv.org/content/10.1101/2020.06.25.172403v1,CVCL_0045,,G54129SE
P0DTC2,366,HexNAc1Hex2dHex0NeuAc0NeuGc0Pent0S0P0KDN0HexA0,G05394UY,G05394UY,Ser,O-linked,"ThermoFisher Lumos Tribrid stepped-HCD. pGlyco 2.2.2 and Byonic software. Expressed and purified a stabilized, soluble trimer Spike glycoprotein mimetic immunogen (S) and a soluble version of the ACE2 glycoprotein from a human cell line. To determine occupancy of N-linked glycans at each site a sequential deglycoslyation approach using Endoglycosidase H and PNGase F in the presence of 18O-H2O following tryptic digestion of S was used",32841605,The abundance of each composition based on assigned spectral counts.,10.1016/j.chom.2020.08.004 ,,,,,HexNAc1,Hex2,dHex0,NeuAc0,0.64%,,,https://www.biorxiv.org/content/10.1101/2020.06.25.172403v1,CVCL_0045,,G05394UY
P0DTC2,366,HexNAc1Hex2dHex1NeuAc0NeuGc0Pent0S0P0KDN0HexA0,G11235SR,G11235SR,Ser,O-linked,"ThermoFisher Lumos Tribrid stepped-HCD. pGlyco 2.2.2 and Byonic software. Expressed and purified a stabilized, soluble trimer Spike glycoprotein mimetic immunogen (S) and a soluble version of the ACE2 glycoprotein from a human cell line. To determine occupancy of N-linked glycans at each site a sequential deglycoslyation approach using Endoglycosidase H and PNGase F in the presence of 18O-H2O following tryptic digestion of S was used",32841605,The abundance of each composition based on assigned spectral counts.,10.1016/j.chom.2020.08.004 ,,,,,HexNAc1,Hex2,dHex1,NeuAc0,0.27%,,,https://www.biorxiv.org/content/10.1101/2020.06.25.172403v1,CVCL_0045,,G11235SR
P0DTC2,366,Unoccupied,,,Ser,O-linked,"ThermoFisher Lumos Tribrid stepped-HCD. pGlyco 2.2.2 and Byonic software. Expressed and purified a stabilized, soluble trimer Spike glycoprotein mimetic immunogen (S) and a soluble version of the ACE2 glycoprotein from a human cell line. To determine occupancy of N-linked glycans at each site a sequential deglycoslyation approach using Endoglycosidase H and PNGase F in the presence of 18O-H2O following tryptic digestion of S was used",32841605,The abundance of each composition based on assigned spectral counts.,10.1016/j.chom.2020.08.004 ,,,,,,,,,99.36%,,,https://www.biorxiv.org/content/10.1101/2020.06.25.172403v1,CVCL_0045,,
P0DTC2,371,N1A1,,,Ser,O-linked,"ThermoFisher Lumos Tribrid stepped-HCD. pGlyco 2.2.2 and Byonic software. Expressed and purified a stabilized, soluble trimer Spike glycoprotein mimetic immunogen (S) and a soluble version of the ACE2 glycoprotein from a human cell line. To determine occupancy of N-linked glycans at each site a sequential deglycoslyation approach using Endoglycosidase H and PNGase F in the presence of 18O-H2O following tryptic digestion of S was used",32841605,The abundance of each composition based on assigned spectral counts.,10.1016/j.chom.2020.08.004 ,,,,,,,,,0.15%,,,https://www.biorxiv.org/content/10.1101/2020.06.25.172403v1,CVCL_0045,,
P0DTC2,371,HexNAc1Hex1dHex1NeuAc0NeuGc0Pent0S0P0KDN0HexA0,G54129SE,G54129SE,Ser,O-linked,"ThermoFisher Lumos Tribrid stepped-HCD. pGlyco 2.2.2 and Byonic software. Expressed and purified a stabilized, soluble trimer Spike glycoprotein mimetic immunogen (S) and a soluble version of the ACE2 glycoprotein from a human cell line. To determine occupancy of N-linked glycans at each site a sequential deglycoslyation approach using Endoglycosidase H and PNGase F in the presence of 18O-H2O following tryptic digestion of S was used",32841605,The abundance of each composition based on assigned spectral counts.,10.1016/j.chom.2020.08.004 ,,,,,HexNAc1,Hex1,dHex1,NeuAc0,0.30%,,,https://www.biorxiv.org/content/10.1101/2020.06.25.172403v1,CVCL_0045,,G54129SE
P0DTC2,371,HexNAc1Hex2dHex1NeuAc0NeuGc0Pent0S0P0KDN0HexA0,G11235SR,G11235SR,Ser,O-linked,"ThermoFisher Lumos Tribrid stepped-HCD. pGlyco 2.2.2 and Byonic software. Expressed and purified a stabilized, soluble trimer Spike glycoprotein mimetic immunogen (S) and a soluble version of the ACE2 glycoprotein from a human cell line. To determine occupancy of N-linked glycans at each site a sequential deglycoslyation approach using Endoglycosidase H and PNGase F in the presence of 18O-H2O following tryptic digestion of S was used",32841605,The abundance of each composition based on assigned spectral counts.,10.1016/j.chom.2020.08.004 ,,,,,HexNAc1,Hex2,dHex1,NeuAc0,0.38%,,,https://www.biorxiv.org/content/10.1101/2020.06.25.172403v1,CVCL_0045,,G11235SR
P0DTC2,371,Unoccupied,,,Ser,O-linked,"ThermoFisher Lumos Tribrid stepped-HCD. pGlyco 2.2.2 and Byonic software. Expressed and purified a stabilized, soluble trimer Spike glycoprotein mimetic immunogen (S) and a soluble version of the ACE2 glycoprotein from a human cell line. To determine occupancy of N-linked glycans at each site a sequential deglycoslyation approach using Endoglycosidase H and PNGase F in the presence of 18O-H2O following tryptic digestion of S was used",32841605,The abundance of each composition based on assigned spectral counts.,10.1016/j.chom.2020.08.004 ,,,,,,,,,99.17%,,,https://www.biorxiv.org/content/10.1101/2020.06.25.172403v1,CVCL_0045,,
P0DTC2,373,HexNAc1Hex1dHex1NeuAc0NeuGc0Pent0S0P0KDN0HexA0,G54129SE,G54129SE,Ser,O-linked,"ThermoFisher Lumos Tribrid stepped-HCD. pGlyco 2.2.2 and Byonic software. Expressed and purified a stabilized, soluble trimer Spike glycoprotein mimetic immunogen (S) and a soluble version of the ACE2 glycoprotein from a human cell line. To determine occupancy of N-linked glycans at each site a sequential deglycoslyation approach using Endoglycosidase H and PNGase F in the presence of 18O-H2O following tryptic digestion of S was used",32841605,The abundance of each composition based on assigned spectral counts.,10.1016/j.chom.2020.08.004 ,,,,,HexNAc1,Hex1,dHex1,NeuAc0,0.39%,,,https://www.biorxiv.org/content/10.1101/2020.06.25.172403v1,CVCL_0045,,G54129SE
P0DTC2,373,HexNAc1Hex2dHex1NeuAc0NeuGc0Pent0S0P0KDN0HexA0,G11235SR,G11235SR,Ser,O-linked,"ThermoFisher Lumos Tribrid stepped-HCD. pGlyco 2.2.2 and Byonic software. Expressed and purified a stabilized, soluble trimer Spike glycoprotein mimetic immunogen (S) and a soluble version of the ACE2 glycoprotein from a human cell line. To determine occupancy of N-linked glycans at each site a sequential deglycoslyation approach using Endoglycosidase H and PNGase F in the presence of 18O-H2O following tryptic digestion of S was used",32841605,The abundance of each composition based on assigned spectral counts.,10.1016/j.chom.2020.08.004 ,,,,,HexNAc1,Hex2,dHex1,NeuAc0,0.31%,,,https://www.biorxiv.org/content/10.1101/2020.06.25.172403v1,CVCL_0045,,G11235SR
P0DTC2,373,HexNAc2Hex2dHex1NeuAc1NeuGc0Pent0S0P0KDN0HexA0,G97887RK,G97887RK,Ser,O-linked,"ThermoFisher Lumos Tribrid stepped-HCD. pGlyco 2.2.2 and Byonic software. Expressed and purified a stabilized, soluble trimer Spike glycoprotein mimetic immunogen (S) and a soluble version of the ACE2 glycoprotein from a human cell line. To determine occupancy of N-linked glycans at each site a sequential deglycoslyation approach using Endoglycosidase H and PNGase F in the presence of 18O-H2O following tryptic digestion of S was used",32841605,The abundance of each composition based on assigned spectral counts.,10.1016/j.chom.2020.08.004 ,,,,,HexNAc2,Hex2,dHex1,NeuAc0,0.15%,,,https://www.biorxiv.org/content/10.1101/2020.06.25.172403v1,CVCL_0045,,G97887RK
P0DTC2,373,Unoccupied,,,Ser,O-linked,"ThermoFisher Lumos Tribrid stepped-HCD. pGlyco 2.2.2 and Byonic software. Expressed and purified a stabilized, soluble trimer Spike glycoprotein mimetic immunogen (S) and a soluble version of the ACE2 glycoprotein from a human cell line. To determine occupancy of N-linked glycans at each site a sequential deglycoslyation approach using Endoglycosidase H and PNGase F in the presence of 18O-H2O following tryptic digestion of S was used",32841605,The abundance of each composition based on assigned spectral counts.,10.1016/j.chom.2020.08.004 ,,,,,,,,,99.15%,,,https://www.biorxiv.org/content/10.1101/2020.06.25.172403v1,CVCL_0045,,
P0DTC2,393,HexNAc2Hex2dHex2NeuAc0NeuGc0Pent0S0P0KDN0HexA0,G51210WZ,G51210WZ,Thr,O-linked,"ThermoFisher Lumos Tribrid stepped-HCD. pGlyco 2.2.2 and Byonic software. Expressed and purified a stabilized, soluble trimer Spike glycoprotein mimetic immunogen (S) and a soluble version of the ACE2 glycoprotein from a human cell line. To determine occupancy of N-linked glycans at each site a sequential deglycoslyation approach using Endoglycosidase H and PNGase F in the presence of 18O-H2O following tryptic digestion of S was used",32841605,The abundance of each composition based on assigned spectral counts.,10.1016/j.chom.2020.08.004 ,,,,,HexNAc2,Hex2,dHex2,NeuAc0,0.24%,,,https://www.biorxiv.org/content/10.1101/2020.06.25.172403v1,CVCL_0045,,G51210WZ
P0DTC2,393,Unoccupied,,,Thr,O-linked,"ThermoFisher Lumos Tribrid stepped-HCD. pGlyco 2.2.2 and Byonic software. Expressed and purified a stabilized, soluble trimer Spike glycoprotein mimetic immunogen (S) and a soluble version of the ACE2 glycoprotein from a human cell line. To determine occupancy of N-linked glycans at each site a sequential deglycoslyation approach using Endoglycosidase H and PNGase F in the presence of 18O-H2O following tryptic digestion of S was used",32841605,The abundance of each composition based on assigned spectral counts.,10.1016/j.chom.2020.08.004 ,,,,,,,,,99.76%,,,https://www.biorxiv.org/content/10.1101/2020.06.25.172403v1,CVCL_0045,,
P0DTC2,399,HexNAc1Hex1dHex1NeuAc1NeuGc0Pent0S0P0KDN0HexA0,G42932DS,G42932DS,Ser,O-linked,"ThermoFisher Lumos Tribrid stepped-HCD. pGlyco 2.2.2 and Byonic software. Expressed and purified a stabilized, soluble trimer Spike glycoprotein mimetic immunogen (S) and a soluble version of the ACE2 glycoprotein from a human cell line. To determine occupancy of N-linked glycans at each site a sequential deglycoslyation approach using Endoglycosidase H and PNGase F in the presence of 18O-H2O following tryptic digestion of S was used",32841605,The abundance of each composition based on assigned spectral counts.,10.1016/j.chom.2020.08.004 ,,,,,HexNAc1,Hex1,dHex1,NeuAc0,0.11%,,,https://www.biorxiv.org/content/10.1101/2020.06.25.172403v1,CVCL_0045,,G42932DS
P0DTC2,399,HexNAc2Hex2dHex0NeuAc1NeuGc0Pent0S0P0KDN0HexA0,G49139YY,G49139YY,Ser,O-linked,"ThermoFisher Lumos Tribrid stepped-HCD. pGlyco 2.2.2 and Byonic software. Expressed and purified a stabilized, soluble trimer Spike glycoprotein mimetic immunogen (S) and a soluble version of the ACE2 glycoprotein from a human cell line. To determine occupancy of N-linked glycans at each site a sequential deglycoslyation approach using Endoglycosidase H and PNGase F in the presence of 18O-H2O following tryptic digestion of S was used",32841605,The abundance of each composition based on assigned spectral counts.,10.1016/j.chom.2020.08.004 ,,,,,HexNAc2,Hex2,dHex0,NeuAc1,0.11%,,,https://www.biorxiv.org/content/10.1101/2020.06.25.172403v1,CVCL_0045,,G49139YY
P0DTC2,399,Unoccupied,,,Ser,O-linked,"ThermoFisher Lumos Tribrid stepped-HCD. pGlyco 2.2.2 and Byonic software. Expressed and purified a stabilized, soluble trimer Spike glycoprotein mimetic immunogen (S) and a soluble version of the ACE2 glycoprotein from a human cell line. To determine occupancy of N-linked glycans at each site a sequential deglycoslyation approach using Endoglycosidase H and PNGase F in the presence of 18O-H2O following tryptic digestion of S was used",32841605,The abundance of each composition based on assigned spectral counts.,10.1016/j.chom.2020.08.004 ,,,,,,,,,99.78%,,,https://www.biorxiv.org/content/10.1101/2020.06.25.172403v1,CVCL_0045,,
P0DTC2,494,HexNAc2Hex2dHex0NeuAc2NeuGc0Pent0S0P0KDN0HexA0,G00390GQ,G00390GQ,Ser,O-linked,"ThermoFisher Lumos Tribrid stepped-HCD. pGlyco 2.2.2 and Byonic software. Expressed and purified a stabilized, soluble trimer Spike glycoprotein mimetic immunogen (S) and a soluble version of the ACE2 glycoprotein from a human cell line. To determine occupancy of N-linked glycans at each site a sequential deglycoslyation approach using Endoglycosidase H and PNGase F in the presence of 18O-H2O following tryptic digestion of S was used",32841605,The abundance of each composition based on assigned spectral counts.,10.1016/j.chom.2020.08.004 ,,,,,HexNAc2,Hex2,dHex0,NeuAc2,2.70%,,,https://www.biorxiv.org/content/10.1101/2020.06.25.172403v1,CVCL_0045,,G00390GQ
P0DTC2,494,HexNAc2Hex2dHex2NeuAc1NeuGc0Pent0S0P0KDN0HexA0,G88333KU,G88333KU,Ser,O-linked,"ThermoFisher Lumos Tribrid stepped-HCD. pGlyco 2.2.2 and Byonic software. Expressed and purified a stabilized, soluble trimer Spike glycoprotein mimetic immunogen (S) and a soluble version of the ACE2 glycoprotein from a human cell line. To determine occupancy of N-linked glycans at each site a sequential deglycoslyation approach using Endoglycosidase H and PNGase F in the presence of 18O-H2O following tryptic digestion of S was used",32841605,The abundance of each composition based on assigned spectral counts.,10.1016/j.chom.2020.08.004 ,,,,,HexNAc2,Hex2,dHex2,NeuAc0,1.35%,,,https://www.biorxiv.org/content/10.1101/2020.06.25.172403v1,CVCL_0045,,G88333KU
P0DTC2,494,Unoccupied,,,Ser,O-linked,"ThermoFisher Lumos Tribrid stepped-HCD. pGlyco 2.2.2 and Byonic software. Expressed and purified a stabilized, soluble trimer Spike glycoprotein mimetic immunogen (S) and a soluble version of the ACE2 glycoprotein from a human cell line. To determine occupancy of N-linked glycans at each site a sequential deglycoslyation approach using Endoglycosidase H and PNGase F in the presence of 18O-H2O following tryptic digestion of S was used",32841605,The abundance of each composition based on assigned spectral counts.,10.1016/j.chom.2020.08.004 ,,,,,,,,,97.30%,,,https://www.biorxiv.org/content/10.1101/2020.06.25.172403v1,CVCL_0045,,
P0DTC2,547,HexNAc1Hex1dHex1NeuAc0NeuGc0Pent0S0P0KDN0HexA0,G54129SE,G54129SE,Thr,O-linked,"ThermoFisher Lumos Tribrid stepped-HCD. pGlyco 2.2.2 and Byonic software. Expressed and purified a stabilized, soluble trimer Spike glycoprotein mimetic immunogen (S) and a soluble version of the ACE2 glycoprotein from a human cell line. To determine occupancy of N-linked glycans at each site a sequential deglycoslyation approach using Endoglycosidase H and PNGase F in the presence of 18O-H2O following tryptic digestion of S was used",32841605,The abundance of each composition based on assigned spectral counts.,10.1016/j.chom.2020.08.004 ,,,,,HexNAc1,Hex1,dHex1,NeuAc0,0.19%,,,https://www.biorxiv.org/content/10.1101/2020.06.25.172403v1,CVCL_0045,,G54129SE
P0DTC2,547,Unoccupied,,,Thr,O-linked,"ThermoFisher Lumos Tribrid stepped-HCD. pGlyco 2.2.2 and Byonic software. Expressed and purified a stabilized, soluble trimer Spike glycoprotein mimetic immunogen (S) and a soluble version of the ACE2 glycoprotein from a human cell line. To determine occupancy of N-linked glycans at each site a sequential deglycoslyation approach using Endoglycosidase H and PNGase F in the presence of 18O-H2O following tryptic digestion of S was used",32841605,The abundance of each composition based on assigned spectral counts.,10.1016/j.chom.2020.08.004 ,,,,,,,,,99.81%,,,https://www.biorxiv.org/content/10.1101/2020.06.25.172403v1,CVCL_0045,,
P0DTC2,553,HexNAc1Hex2dHex0NeuAc1NeuGc0Pent0S0P0KDN0HexA0,G63053UD,G63053UD,Thr,O-linked,"ThermoFisher Lumos Tribrid stepped-HCD. pGlyco 2.2.2 and Byonic software. Expressed and purified a stabilized, soluble trimer Spike glycoprotein mimetic immunogen (S) and a soluble version of the ACE2 glycoprotein from a human cell line. To determine occupancy of N-linked glycans at each site a sequential deglycoslyation approach using Endoglycosidase H and PNGase F in the presence of 18O-H2O following tryptic digestion of S was used",32841605,The abundance of each composition based on assigned spectral counts.,10.1016/j.chom.2020.08.004 ,,,,,HexNAc1,Hex2,dHex0,NeuAc1,0.08%,,,https://www.biorxiv.org/content/10.1101/2020.06.25.172403v1,CVCL_0045,,G63053UD
P0DTC2,553,Unoccupied,,,Thr,O-linked,"ThermoFisher Lumos Tribrid stepped-HCD. pGlyco 2.2.2 and Byonic software. Expressed and purified a stabilized, soluble trimer Spike glycoprotein mimetic immunogen (S) and a soluble version of the ACE2 glycoprotein from a human cell line. To determine occupancy of N-linked glycans at each site a sequential deglycoslyation approach using Endoglycosidase H and PNGase F in the presence of 18O-H2O following tryptic digestion of S was used",32841605,The abundance of each composition based on assigned spectral counts.,10.1016/j.chom.2020.08.004 ,,,,,,,,,99.92%,,,https://www.biorxiv.org/content/10.1101/2020.06.25.172403v1,CVCL_0045,,
P0DTC2,555,HexNAc1Hex2dHex1NeuAc0NeuGc0Pent0S0P0KDN0HexA0,G11235SR,G11235SR,Ser,O-linked,"ThermoFisher Lumos Tribrid stepped-HCD. pGlyco 2.2.2 and Byonic software. Expressed and purified a stabilized, soluble trimer Spike glycoprotein mimetic immunogen (S) and a soluble version of the ACE2 glycoprotein from a human cell line. To determine occupancy of N-linked glycans at each site a sequential deglycoslyation approach using Endoglycosidase H and PNGase F in the presence of 18O-H2O following tryptic digestion of S was used",32841605,The abundance of each composition based on assigned spectral counts.,10.1016/j.chom.2020.08.004 ,,,,,HexNAc1,Hex2,dHex1,NeuAc0,0.09%,,,https://www.biorxiv.org/content/10.1101/2020.06.25.172403v1,CVCL_0045,,G11235SR
P0DTC2,555,Unoccupied,,,Ser,O-linked,"ThermoFisher Lumos Tribrid stepped-HCD. pGlyco 2.2.2 and Byonic software. Expressed and purified a stabilized, soluble trimer Spike glycoprotein mimetic immunogen (S) and a soluble version of the ACE2 glycoprotein from a human cell line. To determine occupancy of N-linked glycans at each site a sequential deglycoslyation approach using Endoglycosidase H and PNGase F in the presence of 18O-H2O following tryptic digestion of S was used",32841605,The abundance of each composition based on assigned spectral counts.,10.1016/j.chom.2020.08.004 ,,,,,,,,,99.91%,,,https://www.biorxiv.org/content/10.1101/2020.06.25.172403v1,CVCL_0045,,
P0DTC2,637,HexNAc1Hex0dHex0NeuAc0NeuGc0Pent0S0P0KDN0HexA0,G29068FM,G29068FM,Ser,O-linked,"ThermoFisher Lumos Tribrid stepped-HCD. pGlyco 2.2.2 and Byonic software. Expressed and purified a stabilized, soluble trimer Spike glycoprotein mimetic immunogen (S) and a soluble version of the ACE2 glycoprotein from a human cell line. To determine occupancy of N-linked glycans at each site a sequential deglycoslyation approach using Endoglycosidase H and PNGase F in the presence of 18O-H2O following tryptic digestion of S was used",32841605,The abundance of each composition based on assigned spectral counts.,10.1016/j.chom.2020.08.004 ,,,,,HexNAc1,Hex0,dHex0,NeuAc0,0.79%,,,https://www.biorxiv.org/content/10.1101/2020.06.25.172403v1,CVCL_0045,,G29068FM
P0DTC2,637,HexNAc1Hex1dHex0NeuAc0NeuGc0Pent0S0P0KDN0HexA0,G43417UB,G43417UB,Ser,O-linked,"ThermoFisher Lumos Tribrid stepped-HCD. pGlyco 2.2.2 and Byonic software. Expressed and purified a stabilized, soluble trimer Spike glycoprotein mimetic immunogen (S) and a soluble version of the ACE2 glycoprotein from a human cell line. To determine occupancy of N-linked glycans at each site a sequential deglycoslyation approach using Endoglycosidase H and PNGase F in the presence of 18O-H2O following tryptic digestion of S was used",32841605,The abundance of each composition based on assigned spectral counts.,10.1016/j.chom.2020.08.004 ,,,,,HexNAc1,Hex1,dHex0,NeuAc0,0.79%,,,https://www.biorxiv.org/content/10.1101/2020.06.25.172403v1,CVCL_0045,,G43417UB
P0DTC2,637,Unoccupied,,,Ser,O-linked,"ThermoFisher Lumos Tribrid stepped-HCD. pGlyco 2.2.2 and Byonic software. Expressed and purified a stabilized, soluble trimer Spike glycoprotein mimetic immunogen (S) and a soluble version of the ACE2 glycoprotein from a human cell line. To determine occupancy of N-linked glycans at each site a sequential deglycoslyation approach using Endoglycosidase H and PNGase F in the presence of 18O-H2O following tryptic digestion of S was used",32841605,The abundance of each composition based on assigned spectral counts.,10.1016/j.chom.2020.08.004 ,,,,,,,,,99.21%,,,https://www.biorxiv.org/content/10.1101/2020.06.25.172403v1,CVCL_0045,,
P0DTC2,750,HexNAc1Hex1dHex0NeuAc2NeuGc0Pent0S0P0KDN0HexA0,G23729WG,G23729WG,Ser,O-linked,"ThermoFisher Lumos Tribrid stepped-HCD. pGlyco 2.2.2 and Byonic software. Expressed and purified a stabilized, soluble trimer Spike glycoprotein mimetic immunogen (S) and a soluble version of the ACE2 glycoprotein from a human cell line. To determine occupancy of N-linked glycans at each site a sequential deglycoslyation approach using Endoglycosidase H and PNGase F in the presence of 18O-H2O following tryptic digestion of S was used",32841605,The abundance of each composition based on assigned spectral counts.,10.1016/j.chom.2020.08.004 ,,,,,HexNAc1,Hex1,dHex0,NeuAc2,1.15%,,,https://www.biorxiv.org/content/10.1101/2020.06.25.172403v1,CVCL_0045,,G23729WG
P0DTC2,750,HexNAc2Hex2dHex1NeuAc0NeuGc0Pent0S0P0KDN0HexA0,G93579XB,G93579XB,Ser,O-linked,"ThermoFisher Lumos Tribrid stepped-HCD. pGlyco 2.2.2 and Byonic software. Expressed and purified a stabilized, soluble trimer Spike glycoprotein mimetic immunogen (S) and a soluble version of the ACE2 glycoprotein from a human cell line. To determine occupancy of N-linked glycans at each site a sequential deglycoslyation approach using Endoglycosidase H and PNGase F in the presence of 18O-H2O following tryptic digestion of S was used",32841605,The abundance of each composition based on assigned spectral counts.,10.1016/j.chom.2020.08.004 ,,,,,HexNAc2,Hex2,dHex1,NeuAc0,0.43%,,,https://www.biorxiv.org/content/10.1101/2020.06.25.172403v1,CVCL_0045,,G93579XB
P0DTC2,750,HexNAc2Hex2dHex1NeuAc1NeuGc0Pent0S0P0KDN0HexA0,G97887RK,G97887RK,Ser,O-linked,"ThermoFisher Lumos Tribrid stepped-HCD. pGlyco 2.2.2 and Byonic software. Expressed and purified a stabilized, soluble trimer Spike glycoprotein mimetic immunogen (S) and a soluble version of the ACE2 glycoprotein from a human cell line. To determine occupancy of N-linked glycans at each site a sequential deglycoslyation approach using Endoglycosidase H and PNGase F in the presence of 18O-H2O following tryptic digestion of S was used",32841605,The abundance of each composition based on assigned spectral counts.,10.1016/j.chom.2020.08.004 ,,,,,HexNAc2,Hex2,dHex1,NeuAc0,0.43%,,,https://www.biorxiv.org/content/10.1101/2020.06.25.172403v1,CVCL_0045,,G97887RK
P0DTC2,750,Unoccupied,,,Ser,O-linked,"ThermoFisher Lumos Tribrid stepped-HCD. pGlyco 2.2.2 and Byonic software. Expressed and purified a stabilized, soluble trimer Spike glycoprotein mimetic immunogen (S) and a soluble version of the ACE2 glycoprotein from a human cell line. To determine occupancy of N-linked glycans at each site a sequential deglycoslyation approach using Endoglycosidase H and PNGase F in the presence of 18O-H2O following tryptic digestion of S was used",32841605,The abundance of each composition based on assigned spectral counts.,10.1016/j.chom.2020.08.004 ,,,,,,,,,98.85%,,,https://www.biorxiv.org/content/10.1101/2020.06.25.172403v1,CVCL_0045,,
P0DTC2,758,HexNAc1Hex1dHex0NeuAc2NeuGc0Pent0S0P0KDN0HexA0,G23729WG,G23729WG,Ser,O-linked,"ThermoFisher Lumos Tribrid stepped-HCD. pGlyco 2.2.2 and Byonic software. Expressed and purified a stabilized, soluble trimer Spike glycoprotein mimetic immunogen (S) and a soluble version of the ACE2 glycoprotein from a human cell line. To determine occupancy of N-linked glycans at each site a sequential deglycoslyation approach using Endoglycosidase H and PNGase F in the presence of 18O-H2O following tryptic digestion of S was used",32841605,The abundance of each composition based on assigned spectral counts.,10.1016/j.chom.2020.08.004 ,,,,,HexNAc1,Hex1,dHex0,NeuAc2,1.69%,,,https://www.biorxiv.org/content/10.1101/2020.06.25.172403v1,CVCL_0045,,G23729WG
P0DTC2,758,HexNAc1Hex2dHex0NeuAc1NeuGc0Pent0S0P0KDN0HexA0,G63053UD,G63053UD,Ser,O-linked,"ThermoFisher Lumos Tribrid stepped-HCD. pGlyco 2.2.2 and Byonic software. Expressed and purified a stabilized, soluble trimer Spike glycoprotein mimetic immunogen (S) and a soluble version of the ACE2 glycoprotein from a human cell line. To determine occupancy of N-linked glycans at each site a sequential deglycoslyation approach using Endoglycosidase H and PNGase F in the presence of 18O-H2O following tryptic digestion of S was used",32841605,The abundance of each composition based on assigned spectral counts.,10.1016/j.chom.2020.08.004 ,,,,,HexNAc1,Hex2,dHex0,NeuAc1,0.46%,,,https://www.biorxiv.org/content/10.1101/2020.06.25.172403v1,CVCL_0045,,G63053UD
P0DTC2,758,HexNAc2Hex1dHex1NeuAc0NeuGc0Pent0S0P0KDN0HexA0,G94583DZ,G94583DZ,Ser,O-linked,"ThermoFisher Lumos Tribrid stepped-HCD. pGlyco 2.2.2 and Byonic software. Expressed and purified a stabilized, soluble trimer Spike glycoprotein mimetic immunogen (S) and a soluble version of the ACE2 glycoprotein from a human cell line. To determine occupancy of N-linked glycans at each site a sequential deglycoslyation approach using Endoglycosidase H and PNGase F in the presence of 18O-H2O following tryptic digestion of S was used",32841605,The abundance of each composition based on assigned spectral counts.,10.1016/j.chom.2020.08.004 ,,,,,HexNAc2,Hex1,dHex1,NeuAc0,0.31%,,,https://www.biorxiv.org/content/10.1101/2020.06.25.172403v1,CVCL_0045,,G94583DZ
P0DTC2,758,HexNAc2Hex2dHex2NeuAc1NeuGc0Pent0S0P0KDN0HexA0,G88333KU,G88333KU,Ser,O-linked,"ThermoFisher Lumos Tribrid stepped-HCD. pGlyco 2.2.2 and Byonic software. Expressed and purified a stabilized, soluble trimer Spike glycoprotein mimetic immunogen (S) and a soluble version of the ACE2 glycoprotein from a human cell line. To determine occupancy of N-linked glycans at each site a sequential deglycoslyation approach using Endoglycosidase H and PNGase F in the presence of 18O-H2O following tryptic digestion of S was used",32841605,The abundance of each composition based on assigned spectral counts.,10.1016/j.chom.2020.08.004 ,,,,,HexNAc2,Hex2,dHex2,NeuAc0,0.62%,,,https://www.biorxiv.org/content/10.1101/2020.06.25.172403v1,CVCL_0045,,G88333KU
P0DTC2,758,Unoccupied,,,Ser,O-linked,"ThermoFisher Lumos Tribrid stepped-HCD. pGlyco 2.2.2 and Byonic software. Expressed and purified a stabilized, soluble trimer Spike glycoprotein mimetic immunogen (S) and a soluble version of the ACE2 glycoprotein from a human cell line. To determine occupancy of N-linked glycans at each site a sequential deglycoslyation approach using Endoglycosidase H and PNGase F in the presence of 18O-H2O following tryptic digestion of S was used",32841605,The abundance of each composition based on assigned spectral counts.,10.1016/j.chom.2020.08.004 ,,,,,,,,,98.31%,,,https://www.biorxiv.org/content/10.1101/2020.06.25.172403v1,CVCL_0045,,
P0DTC2,761,HexNAc1Hex1dHex0NeuAc0NeuGc0Pent0S0P0KDN0HexA0,G43417UB,G43417UB,Thr,O-linked,"ThermoFisher Lumos Tribrid stepped-HCD. pGlyco 2.2.2 and Byonic software. Expressed and purified a stabilized, soluble trimer Spike glycoprotein mimetic immunogen (S) and a soluble version of the ACE2 glycoprotein from a human cell line. To determine occupancy of N-linked glycans at each site a sequential deglycoslyation approach using Endoglycosidase H and PNGase F in the presence of 18O-H2O following tryptic digestion of S was used",32841605,The abundance of each composition based on assigned spectral counts.,10.1016/j.chom.2020.08.004 ,,,,,HexNAc1,Hex1,dHex0,NeuAc0,1.04%,,,https://www.biorxiv.org/content/10.1101/2020.06.25.172403v1,CVCL_0045,,G43417UB
P0DTC2,761,HexNAc2Hex2dHex0NeuAc1NeuGc0Pent0S0P0KDN0HexA0,G49139YY,G49139YY,Thr,O-linked,"ThermoFisher Lumos Tribrid stepped-HCD. pGlyco 2.2.2 and Byonic software. Expressed and purified a stabilized, soluble trimer Spike glycoprotein mimetic immunogen (S) and a soluble version of the ACE2 glycoprotein from a human cell line. To determine occupancy of N-linked glycans at each site a sequential deglycoslyation approach using Endoglycosidase H and PNGase F in the presence of 18O-H2O following tryptic digestion of S was used",32841605,The abundance of each composition based on assigned spectral counts.,10.1016/j.chom.2020.08.004 ,,,,,HexNAc2,Hex2,dHex0,NeuAc1,0.30%,,,https://www.biorxiv.org/content/10.1101/2020.06.25.172403v1,CVCL_0045,,G49139YY
P0DTC2,761,HexNAc2Hex2dHex2NeuAc1NeuGc0Pent0S0P0KDN0HexA0,G88333KU,G88333KU,Thr,O-linked,"ThermoFisher Lumos Tribrid stepped-HCD. pGlyco 2.2.2 and Byonic software. Expressed and purified a stabilized, soluble trimer Spike glycoprotein mimetic immunogen (S) and a soluble version of the ACE2 glycoprotein from a human cell line. To determine occupancy of N-linked glycans at each site a sequential deglycoslyation approach using Endoglycosidase H and PNGase F in the presence of 18O-H2O following tryptic digestion of S was used",32841605,The abundance of each composition based on assigned spectral counts.,10.1016/j.chom.2020.08.004 ,,,,,HexNAc2,Hex2,dHex2,NeuAc0,0.30%,,,https://www.biorxiv.org/content/10.1101/2020.06.25.172403v1,CVCL_0045,,G88333KU
P0DTC2,761,Unoccupied,,,Thr,O-linked,"ThermoFisher Lumos Tribrid stepped-HCD. pGlyco 2.2.2 and Byonic software. Expressed and purified a stabilized, soluble trimer Spike glycoprotein mimetic immunogen (S) and a soluble version of the ACE2 glycoprotein from a human cell line. To determine occupancy of N-linked glycans at each site a sequential deglycoslyation approach using Endoglycosidase H and PNGase F in the presence of 18O-H2O following tryptic digestion of S was used",32841605,The abundance of each composition based on assigned spectral counts.,10.1016/j.chom.2020.08.004 ,,,,,,,,,98.96%,,,https://www.biorxiv.org/content/10.1101/2020.06.25.172403v1,CVCL_0045,,
P0DTC2,768,HexNAc2Hex2dHex2NeuAc1NeuGc0Pent0S0P0KDN0HexA0,G88333KU,G88333KU,Thr,O-linked,"ThermoFisher Lumos Tribrid stepped-HCD. pGlyco 2.2.2 and Byonic software. Expressed and purified a stabilized, soluble trimer Spike glycoprotein mimetic immunogen (S) and a soluble version of the ACE2 glycoprotein from a human cell line. To determine occupancy of N-linked glycans at each site a sequential deglycoslyation approach using Endoglycosidase H and PNGase F in the presence of 18O-H2O following tryptic digestion of S was used",32841605,The abundance of each composition based on assigned spectral counts.,10.1016/j.chom.2020.08.004 ,,,,,HexNAc2,Hex2,dHex2,NeuAc0,0.10%,,,https://www.biorxiv.org/content/10.1101/2020.06.25.172403v1,CVCL_0045,,G88333KU
P0DTC2,768,Unoccupied,,,Thr,O-linked,"ThermoFisher Lumos Tribrid stepped-HCD. pGlyco 2.2.2 and Byonic software. Expressed and purified a stabilized, soluble trimer Spike glycoprotein mimetic immunogen (S) and a soluble version of the ACE2 glycoprotein from a human cell line. To determine occupancy of N-linked glycans at each site a sequential deglycoslyation approach using Endoglycosidase H and PNGase F in the presence of 18O-H2O following tryptic digestion of S was used",32841605,The abundance of each composition based on assigned spectral counts.,10.1016/j.chom.2020.08.004 ,,,,,,,,,99.90%,,,https://www.biorxiv.org/content/10.1101/2020.06.25.172403v1,CVCL_0045,,
P0DTC2,778,HexNAc1Hex2dHex0NeuAc1NeuGc0Pent0S0P0KDN0HexA0,G63053UD,G63053UD,Thr,O-linked,"ThermoFisher Lumos Tribrid stepped-HCD. pGlyco 2.2.2 and Byonic software. Expressed and purified a stabilized, soluble trimer Spike glycoprotein mimetic immunogen (S) and a soluble version of the ACE2 glycoprotein from a human cell line. To determine occupancy of N-linked glycans at each site a sequential deglycoslyation approach using Endoglycosidase H and PNGase F in the presence of 18O-H2O following tryptic digestion of S was used",32841605,The abundance of each composition based on assigned spectral counts.,10.1016/j.chom.2020.08.004 ,,,,,HexNAc1,Hex2,dHex0,NeuAc1,0.28%,,,https://www.biorxiv.org/content/10.1101/2020.06.25.172403v1,CVCL_0045,,G63053UD
P0DTC2,778,Unoccupied,,,Thr,O-linked,"ThermoFisher Lumos Tribrid stepped-HCD. pGlyco 2.2.2 and Byonic software. Expressed and purified a stabilized, soluble trimer Spike glycoprotein mimetic immunogen (S) and a soluble version of the ACE2 glycoprotein from a human cell line. To determine occupancy of N-linked glycans at each site a sequential deglycoslyation approach using Endoglycosidase H and PNGase F in the presence of 18O-H2O following tryptic digestion of S was used",32841605,The abundance of each composition based on assigned spectral counts.,10.1016/j.chom.2020.08.004 ,,,,,,,,,99.72%,,,https://www.biorxiv.org/content/10.1101/2020.06.25.172403v1,CVCL_0045,,
P0DTC2,1006,HexNAc2Hex1dHex0NeuAc2NeuGc0Pent0S0P0KDN0HexA0,G10057RC,G10057RC,Thr,O-linked,"ThermoFisher Lumos Tribrid stepped-HCD. pGlyco 2.2.2 and Byonic software. Expressed and purified a stabilized, soluble trimer Spike glycoprotein mimetic immunogen (S) and a soluble version of the ACE2 glycoprotein from a human cell line. To determine occupancy of N-linked glycans at each site a sequential deglycoslyation approach using Endoglycosidase H and PNGase F in the presence of 18O-H2O following tryptic digestion of S was used",32841605,The abundance of each composition based on assigned spectral counts.,10.1016/j.chom.2020.08.004 ,,,,,HexNAc2,Hex1,dHex0,NeuAc2,0.07%,,,https://www.biorxiv.org/content/10.1101/2020.06.25.172403v1,CVCL_0045,,G10057RC
P0DTC2,1006,Unoccupied,,,Thr,O-linked,"ThermoFisher Lumos Tribrid stepped-HCD. pGlyco 2.2.2 and Byonic software. Expressed and purified a stabilized, soluble trimer Spike glycoprotein mimetic immunogen (S) and a soluble version of the ACE2 glycoprotein from a human cell line. To determine occupancy of N-linked glycans at each site a sequential deglycoslyation approach using Endoglycosidase H and PNGase F in the presence of 18O-H2O following tryptic digestion of S was used",32841605,The abundance of each composition based on assigned spectral counts.,10.1016/j.chom.2020.08.004 ,,,,,,,,,99.93%,,,https://www.biorxiv.org/content/10.1101/2020.06.25.172403v1,CVCL_0045,,
P0DTC2,1009,HexNAc2Hex2dHex1NeuAc2NeuGc0Pent0S0P0KDN0HexA0,G88333KU,G88333KU,Thr,O-linked,"ThermoFisher Lumos Tribrid stepped-HCD. pGlyco 2.2.2 and Byonic software. Expressed and purified a stabilized, soluble trimer Spike glycoprotein mimetic immunogen (S) and a soluble version of the ACE2 glycoprotein from a human cell line. To determine occupancy of N-linked glycans at each site a sequential deglycoslyation approach using Endoglycosidase H and PNGase F in the presence of 18O-H2O following tryptic digestion of S was used",32841605,The abundance of each composition based on assigned spectral counts.,10.1016/j.chom.2020.08.004 ,,,,,HexNAc2,Hex2,dHex1,NeuAc0,0.07%,,,https://www.biorxiv.org/content/10.1101/2020.06.25.172403v1,CVCL_0045,,G88333KU
P0DTC2,1009,Unoccupied,,,Thr,O-linked,"ThermoFisher Lumos Tribrid stepped-HCD. pGlyco 2.2.2 and Byonic software. Expressed and purified a stabilized, soluble trimer Spike glycoprotein mimetic immunogen (S) and a soluble version of the ACE2 glycoprotein from a human cell line. To determine occupancy of N-linked glycans at each site a sequential deglycoslyation approach using Endoglycosidase H and PNGase F in the presence of 18O-H2O following tryptic digestion of S was used",32841605,The abundance of each composition based on assigned spectral counts.,10.1016/j.chom.2020.08.004 ,,,,,,,,,99.93%,,,https://www.biorxiv.org/content/10.1101/2020.06.25.172403v1,CVCL_0045,,
P0DTC2,1210,HexNAc2Hex0dHex0NeuAc0NeuGc0Pent0S0P0KDN0HexA0,G27391WQ,G27391WQ,Ser,O-linked,"ThermoFisher Lumos Tribrid stepped-HCD. pGlyco 2.2.2 and Byonic software. Expressed and purified a stabilized, soluble trimer Spike glycoprotein mimetic immunogen (S) and a soluble version of the ACE2 glycoprotein from a human cell line. To determine occupancy of N-linked glycans at each site a sequential deglycoslyation approach using Endoglycosidase H and PNGase F in the presence of 18O-H2O following tryptic digestion of S was used",32841605,The abundance of each composition based on assigned spectral counts.,10.1016/j.chom.2020.08.004 ,,,,,HexNAc2,Hex0,dHex0,NeuAc0,3.11%,,,https://www.biorxiv.org/content/10.1101/2020.06.25.172403v1,CVCL_0045,,G27391WQ
P0DTC2,1210,HexNAc2Hex1dHex0NeuAc0NeuGc0Pent0S0P0KDN0HexA0,G58001LT,G58001LT,Ser,O-linked,"ThermoFisher Lumos Tribrid stepped-HCD. pGlyco 2.2.2 and Byonic software. Expressed and purified a stabilized, soluble trimer Spike glycoprotein mimetic immunogen (S) and a soluble version of the ACE2 glycoprotein from a human cell line. To determine occupancy of N-linked glycans at each site a sequential deglycoslyation approach using Endoglycosidase H and PNGase F in the presence of 18O-H2O following tryptic digestion of S was used",32841605,The abundance of each composition based on assigned spectral counts.,10.1016/j.chom.2020.08.004 ,,,,,HexNAc2,Hex1,dHex0,NeuAc0,3.11%,,,https://www.biorxiv.org/content/10.1101/2020.06.25.172403v1,CVCL_0045,,G58001LT
P0DTC2,1210,HexNAc2Hex1dHex0NeuAc1NeuGc0Pent0S0P0KDN0HexA0,G85811SG,G85811SG,Ser,O-linked,"ThermoFisher Lumos Tribrid stepped-HCD. pGlyco 2.2.2 and Byonic software. Expressed and purified a stabilized, soluble trimer Spike glycoprotein mimetic immunogen (S) and a soluble version of the ACE2 glycoprotein from a human cell line. To determine occupancy of N-linked glycans at each site a sequential deglycoslyation approach using Endoglycosidase H and PNGase F in the presence of 18O-H2O following tryptic digestion of S was used",32841605,The abundance of each composition based on assigned spectral counts.,10.1016/j.chom.2020.08.004 ,,,,,HexNAc2,Hex1,dHex0,NeuAc1,0.08%,,,https://www.biorxiv.org/content/10.1101/2020.06.25.172403v1,CVCL_0045,,G85811SG
P0DTC2,1210,HexNAc2Hex2dHex0NeuAc0NeuGc0Pent0S0P0KDN0HexA0,G53434XO,G53434XO,Ser,O-linked,"ThermoFisher Lumos Tribrid stepped-HCD. pGlyco 2.2.2 and Byonic software. Expressed and purified a stabilized, soluble trimer Spike glycoprotein mimetic immunogen (S) and a soluble version of the ACE2 glycoprotein from a human cell line. To determine occupancy of N-linked glycans at each site a sequential deglycoslyation approach using Endoglycosidase H and PNGase F in the presence of 18O-H2O following tryptic digestion of S was used",32841605,The abundance of each composition based on assigned spectral counts.,10.1016/j.chom.2020.08.004 ,,,,,HexNAc2,Hex2,dHex0,NeuAc0,3.11%,,,https://www.biorxiv.org/content/10.1101/2020.06.25.172403v1,CVCL_0045,,G53434XO
P0DTC2,1210,Unoccupied,,,Ser,O-linked,"ThermoFisher Lumos Tribrid stepped-HCD. pGlyco 2.2.2 and Byonic software. Expressed and purified a stabilized, soluble trimer Spike glycoprotein mimetic immunogen (S) and a soluble version of the ACE2 glycoprotein from a human cell line. To determine occupancy of N-linked glycans at each site a sequential deglycoslyation approach using Endoglycosidase H and PNGase F in the presence of 18O-H2O following tryptic digestion of S was used",32841605,The abundance of each composition based on assigned spectral counts.,10.1016/j.chom.2020.08.004 ,,,,,,,,,96.89%,,,https://www.biorxiv.org/content/10.1101/2020.06.25.172403v1,CVCL_0045,,
Q9BYF1,43,HexNAc1Hex1dHex0NeuAc2NeuGc0Pent0S0P0KDN0HexA0,G23729WG,G23729WG,Ser,O-linked,"ThermoFisher Lumos Tribrid stepped-HCD. pGlyco 2.2.2 and Byonic software. Expressed and purified a stabilized, soluble trimer Spike glycoprotein mimetic immunogen (S) and a soluble version of the ACE2 glycoprotein from a human cell line. To determine occupancy of N-linked glycans at each site a sequential deglycoslyation approach using Endoglycosidase H and PNGase F in the presence of 18O-H2O following tryptic digestion of S was used",32841605,The abundance of each composition based on assigned spectral counts.,10.1016/j.chom.2020.08.004 ,,,,,HexNAc1,Hex1,dHex0,NeuAc2,0.50%,,,https://www.biorxiv.org/content/10.1101/2020.06.25.172403v1,CVCL_0045,,G23729WG
Q9BYF1,43,HexNAc2Hex1dHex1NeuAc1NeuGc0Pent0S0P0KDN0HexA0,G12344AO,G12344AO,Ser,O-linked,"ThermoFisher Lumos Tribrid stepped-HCD. pGlyco 2.2.2 and Byonic software. Expressed and purified a stabilized, soluble trimer Spike glycoprotein mimetic immunogen (S) and a soluble version of the ACE2 glycoprotein from a human cell line. To determine occupancy of N-linked glycans at each site a sequential deglycoslyation approach using Endoglycosidase H and PNGase F in the presence of 18O-H2O following tryptic digestion of S was used",32841605,The abundance of each composition based on assigned spectral counts.,10.1016/j.chom.2020.08.004 ,,,,,HexNAc2,Hex1,dHex1,NeuAc0,0.29%,,,https://www.biorxiv.org/content/10.1101/2020.06.25.172403v1,CVCL_0045,,G12344AO
Q9BYF1,43,Unoccupied,,,Ser,O-linked,"ThermoFisher Lumos Tribrid stepped-HCD. pGlyco 2.2.2 and Byonic software. Expressed and purified a stabilized, soluble trimer Spike glycoprotein mimetic immunogen (S) and a soluble version of the ACE2 glycoprotein from a human cell line. To determine occupancy of N-linked glycans at each site a sequential deglycoslyation approach using Endoglycosidase H and PNGase F in the presence of 18O-H2O following tryptic digestion of S was used",32841605,The abundance of each composition based on assigned spectral counts.,10.1016/j.chom.2020.08.004 ,,,,,,,,,99.50%,,,https://www.biorxiv.org/content/10.1101/2020.06.25.172403v1,CVCL_0045,,
Q9BYF1,44,N1A1,,,Ser,O-linked,"ThermoFisher Lumos Tribrid stepped-HCD. pGlyco 2.2.2 and Byonic software. Expressed and purified a stabilized, soluble trimer Spike glycoprotein mimetic immunogen (S) and a soluble version of the ACE2 glycoprotein from a human cell line. To determine occupancy of N-linked glycans at each site a sequential deglycoslyation approach using Endoglycosidase H and PNGase F in the presence of 18O-H2O following tryptic digestion of S was used",32841605,The abundance of each composition based on assigned spectral counts.,10.1016/j.chom.2020.08.004 ,,,,,,,,,1.53%,,,https://www.biorxiv.org/content/10.1101/2020.06.25.172403v1,CVCL_0045,,
Q9BYF1,44,Unoccupied,,,Ser,O-linked,"ThermoFisher Lumos Tribrid stepped-HCD. pGlyco 2.2.2 and Byonic software. Expressed and purified a stabilized, soluble trimer Spike glycoprotein mimetic immunogen (S) and a soluble version of the ACE2 glycoprotein from a human cell line. To determine occupancy of N-linked glycans at each site a sequential deglycoslyation approach using Endoglycosidase H and PNGase F in the presence of 18O-H2O following tryptic digestion of S was used",32841605,The abundance of each composition based on assigned spectral counts.,10.1016/j.chom.2020.08.004 ,,,,,,,,,98.47%,,,https://www.biorxiv.org/content/10.1101/2020.06.25.172403v1,CVCL_0045,,
Q9BYF1,129,HexNAc1Hex1dHex0NeuAc0NeuGc0Pent0S0P0KDN0HexA0,G43417UB,G43417UB,Thr,O-linked,"ThermoFisher Lumos Tribrid stepped-HCD. pGlyco 2.2.2 and Byonic software. Expressed and purified a stabilized, soluble trimer Spike glycoprotein mimetic immunogen (S) and a soluble version of the ACE2 glycoprotein from a human cell line. To determine occupancy of N-linked glycans at each site a sequential deglycoslyation approach using Endoglycosidase H and PNGase F in the presence of 18O-H2O following tryptic digestion of S was used",32841605,The abundance of each composition based on assigned spectral counts.,10.1016/j.chom.2020.08.004 ,,,,,HexNAc1,Hex1,dHex0,NeuAc0,0.10%,,,https://www.biorxiv.org/content/10.1101/2020.06.25.172403v1,CVCL_0045,,G43417UB
Q9BYF1,129,Unoccupied,,,Thr,O-linked,"ThermoFisher Lumos Tribrid stepped-HCD. pGlyco 2.2.2 and Byonic software. Expressed and purified a stabilized, soluble trimer Spike glycoprotein mimetic immunogen (S) and a soluble version of the ACE2 glycoprotein from a human cell line. To determine occupancy of N-linked glycans at each site a sequential deglycoslyation approach using Endoglycosidase H and PNGase F in the presence of 18O-H2O following tryptic digestion of S was used",32841605,The abundance of each composition based on assigned spectral counts.,10.1016/j.chom.2020.08.004 ,,,,,,,,,99.90%,,,https://www.biorxiv.org/content/10.1101/2020.06.25.172403v1,CVCL_0045,,
Q9BYF1,155,HexNAc2Hex1dHex1NeuAc0NeuGc0Pent0S0P0KDN0HexA0,G94583DZ,G94583DZ,Ser,O-linked,"ThermoFisher Lumos Tribrid stepped-HCD. pGlyco 2.2.2 and Byonic software. Expressed and purified a stabilized, soluble trimer Spike glycoprotein mimetic immunogen (S) and a soluble version of the ACE2 glycoprotein from a human cell line. To determine occupancy of N-linked glycans at each site a sequential deglycoslyation approach using Endoglycosidase H and PNGase F in the presence of 18O-H2O following tryptic digestion of S was used",32841605,The abundance of each composition based on assigned spectral counts.,10.1016/j.chom.2020.08.004 ,,,,,HexNAc2,Hex1,dHex1,NeuAc0,0.81%,,,https://www.biorxiv.org/content/10.1101/2020.06.25.172403v1,CVCL_0045,,G94583DZ
Q9BYF1,155,HexNAc2Hex2dHex1NeuAc1NeuGc0Pent0S0P0KDN0HexA0,G97887RK,G97887RK,Ser,O-linked,"ThermoFisher Lumos Tribrid stepped-HCD. pGlyco 2.2.2 and Byonic software. Expressed and purified a stabilized, soluble trimer Spike glycoprotein mimetic immunogen (S) and a soluble version of the ACE2 glycoprotein from a human cell line. To determine occupancy of N-linked glycans at each site a sequential deglycoslyation approach using Endoglycosidase H and PNGase F in the presence of 18O-H2O following tryptic digestion of S was used",32841605,The abundance of each composition based on assigned spectral counts.,10.1016/j.chom.2020.08.004 ,,,,,HexNAc2,Hex2,dHex1,NeuAc0,0.27%,,,https://www.biorxiv.org/content/10.1101/2020.06.25.172403v1,CVCL_0045,,G97887RK
Q9BYF1,155,Unoccupied,,,Ser,O-linked,"ThermoFisher Lumos Tribrid stepped-HCD. pGlyco 2.2.2 and Byonic software. Expressed and purified a stabilized, soluble trimer Spike glycoprotein mimetic immunogen (S) and a soluble version of the ACE2 glycoprotein from a human cell line. To determine occupancy of N-linked glycans at each site a sequential deglycoslyation approach using Endoglycosidase H and PNGase F in the presence of 18O-H2O following tryptic digestion of S was used",32841605,The abundance of each composition based on assigned spectral counts.,10.1016/j.chom.2020.08.004 ,,,,,,,,,98.92%,,,https://www.biorxiv.org/content/10.1101/2020.06.25.172403v1,CVCL_0045,,
Q9BYF1,257,HexNAc2Hex2dHex1NeuAc0NeuGc0Pent0S0P0KDN0HexA0,G93579XB,G93579XB,Ser,O-linked,"ThermoFisher Lumos Tribrid stepped-HCD. pGlyco 2.2.2 and Byonic software. Expressed and purified a stabilized, soluble trimer Spike glycoprotein mimetic immunogen (S) and a soluble version of the ACE2 glycoprotein from a human cell line. To determine occupancy of N-linked glycans at each site a sequential deglycoslyation approach using Endoglycosidase H and PNGase F in the presence of 18O-H2O following tryptic digestion of S was used",32841605,The abundance of each composition based on assigned spectral counts.,10.1016/j.chom.2020.08.004 ,,,,,HexNAc2,Hex2,dHex1,NeuAc0,0.33%,,,https://www.biorxiv.org/content/10.1101/2020.06.25.172403v1,CVCL_0045,,G93579XB
Q9BYF1,257,Unoccupied,,,Ser,O-linked,"ThermoFisher Lumos Tribrid stepped-HCD. pGlyco 2.2.2 and Byonic software. Expressed and purified a stabilized, soluble trimer Spike glycoprotein mimetic immunogen (S) and a soluble version of the ACE2 glycoprotein from a human cell line. To determine occupancy of N-linked glycans at each site a sequential deglycoslyation approach using Endoglycosidase H and PNGase F in the presence of 18O-H2O following tryptic digestion of S was used",32841605,The abundance of each composition based on assigned spectral counts.,10.1016/j.chom.2020.08.004 ,,,,,,,,,99.67%,,,https://www.biorxiv.org/content/10.1101/2020.06.25.172403v1,CVCL_0045,,
Q9BYF1,294,HexNAc1Hex1dHex1NeuAc1NeuGc0Pent0S0P0KDN0HexA0,G42932DS,G42932DS,Thr,O-linked,"ThermoFisher Lumos Tribrid stepped-HCD. pGlyco 2.2.2 and Byonic software. Expressed and purified a stabilized, soluble trimer Spike glycoprotein mimetic immunogen (S) and a soluble version of the ACE2 glycoprotein from a human cell line. To determine occupancy of N-linked glycans at each site a sequential deglycoslyation approach using Endoglycosidase H and PNGase F in the presence of 18O-H2O following tryptic digestion of S was used",32841605,The abundance of each composition based on assigned spectral counts.,10.1016/j.chom.2020.08.004 ,,,,,HexNAc1,Hex1,dHex1,NeuAc0,0.30%,,,https://www.biorxiv.org/content/10.1101/2020.06.25.172403v1,CVCL_0045,,G42932DS
Q9BYF1,294,Unoccupied,,,Thr,O-linked,"ThermoFisher Lumos Tribrid stepped-HCD. pGlyco 2.2.2 and Byonic software. Expressed and purified a stabilized, soluble trimer Spike glycoprotein mimetic immunogen (S) and a soluble version of the ACE2 glycoprotein from a human cell line. To determine occupancy of N-linked glycans at each site a sequential deglycoslyation approach using Endoglycosidase H and PNGase F in the presence of 18O-H2O following tryptic digestion of S was used",32841605,The abundance of each composition based on assigned spectral counts.,10.1016/j.chom.2020.08.004 ,,,,,,,,,99.70%,,,https://www.biorxiv.org/content/10.1101/2020.06.25.172403v1,CVCL_0045,,
Q9BYF1,334,HexNAc1Hex0dHex0NeuAc0NeuGc0Pent0S0P0KDN0HexA0,G29068FM,G29068FM,Thr,O-linked,"ThermoFisher Lumos Tribrid stepped-HCD. pGlyco 2.2.2 and Byonic software. Expressed and purified a stabilized, soluble trimer Spike glycoprotein mimetic immunogen (S) and a soluble version of the ACE2 glycoprotein from a human cell line. To determine occupancy of N-linked glycans at each site a sequential deglycoslyation approach using Endoglycosidase H and PNGase F in the presence of 18O-H2O following tryptic digestion of S was used",32841605,The abundance of each composition based on assigned spectral counts.,10.1016/j.chom.2020.08.004 ,,,,,HexNAc1,Hex0,dHex0,NeuAc0,0.16%,,,https://www.biorxiv.org/content/10.1101/2020.06.25.172403v1,CVCL_0045,,G29068FM
Q9BYF1,334,Unoccupied,,,Thr,O-linked,"ThermoFisher Lumos Tribrid stepped-HCD. pGlyco 2.2.2 and Byonic software. Expressed and purified a stabilized, soluble trimer Spike glycoprotein mimetic immunogen (S) and a soluble version of the ACE2 glycoprotein from a human cell line. To determine occupancy of N-linked glycans at each site a sequential deglycoslyation approach using Endoglycosidase H and PNGase F in the presence of 18O-H2O following tryptic digestion of S was used",32841605,The abundance of each composition based on assigned spectral counts.,10.1016/j.chom.2020.08.004 ,,,,,,,,,99.84%,,,https://www.biorxiv.org/content/10.1101/2020.06.25.172403v1,CVCL_0045,,
Q9BYF1,496,HexNAc2Hex0dHex0NeuAc0NeuGc0Pent0S0P0KDN0HexA0,G27391WQ,G27391WQ,Thr,O-linked,"ThermoFisher Lumos Tribrid stepped-HCD. pGlyco 2.2.2 and Byonic software. Expressed and purified a stabilized, soluble trimer Spike glycoprotein mimetic immunogen (S) and a soluble version of the ACE2 glycoprotein from a human cell line. To determine occupancy of N-linked glycans at each site a sequential deglycoslyation approach using Endoglycosidase H and PNGase F in the presence of 18O-H2O following tryptic digestion of S was used",32841605,The abundance of each composition based on assigned spectral counts.,10.1016/j.chom.2020.08.004 ,,,,,HexNAc2,Hex0,dHex0,NeuAc0,0.27%,,,https://www.biorxiv.org/content/10.1101/2020.06.25.172403v1,CVCL_0045,,G27391WQ
Q9BYF1,496,HexNAc2Hex1dHex0NeuAc0NeuGc0Pent0S0P0KDN0HexA0,G58001LT,G58001LT,Thr,O-linked,"ThermoFisher Lumos Tribrid stepped-HCD. pGlyco 2.2.2 and Byonic software. Expressed and purified a stabilized, soluble trimer Spike glycoprotein mimetic immunogen (S) and a soluble version of the ACE2 glycoprotein from a human cell line. To determine occupancy of N-linked glycans at each site a sequential deglycoslyation approach using Endoglycosidase H and PNGase F in the presence of 18O-H2O following tryptic digestion of S was used",32841605,The abundance of each composition based on assigned spectral counts.,10.1016/j.chom.2020.08.004 ,,,,,HexNAc2,Hex1,dHex0,NeuAc0,0.27%,,,https://www.biorxiv.org/content/10.1101/2020.06.25.172403v1,CVCL_0045,,G58001LT
Q9BYF1,496,Unoccupied,,,Thr,O-linked,"ThermoFisher Lumos Tribrid stepped-HCD. pGlyco 2.2.2 and Byonic software. Expressed and purified a stabilized, soluble trimer Spike glycoprotein mimetic immunogen (S) and a soluble version of the ACE2 glycoprotein from a human cell line. To determine occupancy of N-linked glycans at each site a sequential deglycoslyation approach using Endoglycosidase H and PNGase F in the presence of 18O-H2O following tryptic digestion of S was used",32841605,The abundance of each composition based on assigned spectral counts.,10.1016/j.chom.2020.08.004 ,,,,,,,,,99.73%,,,https://www.biorxiv.org/content/10.1101/2020.06.25.172403v1,CVCL_0045,,
Q9BYF1,602,HexNAc1Hex1dHex0NeuAc2NeuGc0Pent0S0P0KDN0HexA0,G23729WG,G23729WG,Ser,O-linked,"ThermoFisher Lumos Tribrid stepped-HCD. pGlyco 2.2.2 and Byonic software. Expressed and purified a stabilized, soluble trimer Spike glycoprotein mimetic immunogen (S) and a soluble version of the ACE2 glycoprotein from a human cell line. To determine occupancy of N-linked glycans at each site a sequential deglycoslyation approach using Endoglycosidase H and PNGase F in the presence of 18O-H2O following tryptic digestion of S was used",32841605,The abundance of each composition based on assigned spectral counts.,10.1016/j.chom.2020.08.004 ,,,,,HexNAc1,Hex1,dHex0,NeuAc2,0.27%,,,https://www.biorxiv.org/content/10.1101/2020.06.25.172403v1,CVCL_0045,,G23729WG
Q9BYF1,602,Unoccupied,,,Ser,O-linked,"ThermoFisher Lumos Tribrid stepped-HCD. pGlyco 2.2.2 and Byonic software. Expressed and purified a stabilized, soluble trimer Spike glycoprotein mimetic immunogen (S) and a soluble version of the ACE2 glycoprotein from a human cell line. To determine occupancy of N-linked glycans at each site a sequential deglycoslyation approach using Endoglycosidase H and PNGase F in the presence of 18O-H2O following tryptic digestion of S was used",32841605,The abundance of each composition based on assigned spectral counts.,10.1016/j.chom.2020.08.004 ,,,,,,,,,99.73%,,,https://www.biorxiv.org/content/10.1101/2020.06.25.172403v1,CVCL_0045,,
Q9BYF1,611,HexNAc2Hex0dHex0NeuAc0NeuGc0Pent0S0P0KDN0HexA0,G27391WQ,G27391WQ,Ser,O-linked,"ThermoFisher Lumos Tribrid stepped-HCD. pGlyco 2.2.2 and Byonic software. Expressed and purified a stabilized, soluble trimer Spike glycoprotein mimetic immunogen (S) and a soluble version of the ACE2 glycoprotein from a human cell line. To determine occupancy of N-linked glycans at each site a sequential deglycoslyation approach using Endoglycosidase H and PNGase F in the presence of 18O-H2O following tryptic digestion of S was used",32841605,The abundance of each composition based on assigned spectral counts.,10.1016/j.chom.2020.08.004 ,,,,,HexNAc2,Hex0,dHex0,NeuAc0,0.68%,,,https://www.biorxiv.org/content/10.1101/2020.06.25.172403v1,CVCL_0045,,G27391WQ
Q9BYF1,611,Unoccupied,,,Ser,O-linked,"ThermoFisher Lumos Tribrid stepped-HCD. pGlyco 2.2.2 and Byonic software. Expressed and purified a stabilized, soluble trimer Spike glycoprotein mimetic immunogen (S) and a soluble version of the ACE2 glycoprotein from a human cell line. To determine occupancy of N-linked glycans at each site a sequential deglycoslyation approach using Endoglycosidase H and PNGase F in the presence of 18O-H2O following tryptic digestion of S was used",32841605,The abundance of each composition based on assigned spectral counts.,10.1016/j.chom.2020.08.004 ,,,,,,,,,99.32%,,,https://www.biorxiv.org/content/10.1101/2020.06.25.172403v1,CVCL_0045,,
Q9BYF1,619,HexNAc2Hex0dHex0NeuAc0NeuGc0Pent0S0P0KDN0HexA0,G27391WQ,G27391WQ,Ser,O-linked,"ThermoFisher Lumos Tribrid stepped-HCD. pGlyco 2.2.2 and Byonic software. Expressed and purified a stabilized, soluble trimer Spike glycoprotein mimetic immunogen (S) and a soluble version of the ACE2 glycoprotein from a human cell line. To determine occupancy of N-linked glycans at each site a sequential deglycoslyation approach using Endoglycosidase H and PNGase F in the presence of 18O-H2O following tryptic digestion of S was used",32841605,The abundance of each composition based on assigned spectral counts.,10.1016/j.chom.2020.08.004 ,,,,,HexNAc2,Hex0,dHex0,NeuAc0,0.09%,,,https://www.biorxiv.org/content/10.1101/2020.06.25.172403v1,CVCL_0045,,G27391WQ
Q9BYF1,619,Unoccupied,,,Ser,O-linked,"ThermoFisher Lumos Tribrid stepped-HCD. pGlyco 2.2.2 and Byonic software. Expressed and purified a stabilized, soluble trimer Spike glycoprotein mimetic immunogen (S) and a soluble version of the ACE2 glycoprotein from a human cell line. To determine occupancy of N-linked glycans at each site a sequential deglycoslyation approach using Endoglycosidase H and PNGase F in the presence of 18O-H2O following tryptic digestion of S was used",32841605,The abundance of each composition based on assigned spectral counts.,10.1016/j.chom.2020.08.004 ,,,,,,,,,99.91%,,,https://www.biorxiv.org/content/10.1101/2020.06.25.172403v1,CVCL_0045,,