Protein,Position,Id,Toucan,AminoAcid,TypeAminoAcid,Notes,Pmid,AdditionalNotes,doi
Q9BYF1,53,G25987BV,G25987BV,Asn,N-linked,,33135055,,https://doi.org/10.1093/glycob/cwaa101
Q9BYF1,53,G59937CP,G59937CP,Asn,N-linked,,33135055,,https://doi.org/10.1093/glycob/cwaa101
Q9BYF1,53,G88725PI,G88725PI,Asn,N-linked,,33135055,,https://doi.org/10.1093/glycob/cwaa101
Q9BYF1,53,G68318VE,G68318VE,Asn,N-linked,,33135055,,https://doi.org/10.1093/glycob/cwaa101
Q9BYF1,53,G55382TU,G55382TU,Asn,N-linked,,33135055,,https://doi.org/10.1093/glycob/cwaa101
Q9BYF1,53,G56610MH,G56610MH,Asn,N-linked,,33135055,,https://doi.org/10.1093/glycob/cwaa101
Q9BYF1,53,G54600FO,G54600FO,Asn,N-linked,,33135055,,https://doi.org/10.1093/glycob/cwaa101
Q9BYF1,53,G08293MJ,G08293MJ,Asn,N-linked,,33135055,,https://doi.org/10.1093/glycob/cwaa101
Q9BYF1,53,G44953PJ,G44953PJ,Asn,N-linked,,33135055,,https://doi.org/10.1093/glycob/cwaa101
Q9BYF1,53,G12580WI,G12580WI,Asn,N-linked,,33135055,,https://doi.org/10.1093/glycob/cwaa101
Q9BYF1,53,G79941IJ,G79941IJ,Asn,N-linked,,33135055,,https://doi.org/10.1093/glycob/cwaa101
Q9BYF1,53,G43638QT,G43638QT,Asn,N-linked,,33135055,,https://doi.org/10.1093/glycob/cwaa101
Q9BYF1,53,G54417MJ,G54417MJ,Asn,N-linked,,33135055,,https://doi.org/10.1093/glycob/cwaa101
Q9BYF1,90,,,Asn,N-linked,,33135055,,https://doi.org/10.1093/glycob/cwaa101
Q9BYF1,90,G06850XD,G06850XD,Asn,N-linked,,33135055,,https://doi.org/10.1093/glycob/cwaa101
Q9BYF1,90,G35029YA,G35029YA,Asn,N-linked,,33135055,,https://doi.org/10.1093/glycob/cwaa101
Q9BYF1,90,G25987BV,G25987BV,Asn,N-linked,,33135055,,https://doi.org/10.1093/glycob/cwaa101
Q9BYF1,90,G72787SB,G72787SB,Asn,N-linked,,33135055,,https://doi.org/10.1093/glycob/cwaa101
Q9BYF1,90,G59937CP,G59937CP,Asn,N-linked,,33135055,,https://doi.org/10.1093/glycob/cwaa101
Q9BYF1,90,G45504EY,G45504EY,Asn,N-linked,,33135055,,https://doi.org/10.1093/glycob/cwaa101
Q9BYF1,90,G83555HU,G83555HU,Asn,N-linked,,33135055,,https://doi.org/10.1093/glycob/cwaa101
Q9BYF1,90,G54600FO,G54600FO,Asn,N-linked,,33135055,,https://doi.org/10.1093/glycob/cwaa101
Q9BYF1,90,G59626AS,G59626AS,Asn,N-linked,,33135055,,https://doi.org/10.1093/glycob/cwaa101
Q9BYF1,90,G08293MJ,G08293MJ,Asn,N-linked,,33135055,,https://doi.org/10.1093/glycob/cwaa101
Q9BYF1,103,,,Asn,N-linked,,33135055,,https://doi.org/10.1093/glycob/cwaa101
Q9BYF1,103,G80475RE,G80475RE,Asn,N-linked,,33135055,,https://doi.org/10.1093/glycob/cwaa101
Q9BYF1,103,G25987BV,G25987BV,Asn,N-linked,,33135055,,https://doi.org/10.1093/glycob/cwaa101
Q9BYF1,103,G59937CP,G59937CP,Asn,N-linked,,33135055,,https://doi.org/10.1093/glycob/cwaa101
Q9BYF1,103,G83555HU,G83555HU,Asn,N-linked,,33135055,,https://doi.org/10.1093/glycob/cwaa101
Q9BYF1,103,G08293MJ,G08293MJ,Asn,N-linked,,33135055,,https://doi.org/10.1093/glycob/cwaa101
Q9BYF1,322,,,Asn,N-linked,,33135055,,https://doi.org/10.1093/glycob/cwaa101
Q9BYF1,322,G25987BV,G25987BV,Asn,N-linked,,33135055,,https://doi.org/10.1093/glycob/cwaa101
Q9BYF1,322,G88725PI,G88725PI,Asn,N-linked,,33135055,,https://doi.org/10.1093/glycob/cwaa101
Q9BYF1,322,G68318VE,G68318VE,Asn,N-linked,,33135055,,https://doi.org/10.1093/glycob/cwaa101
Q9BYF1,322,G55382TU,G55382TU,Asn,N-linked,,33135055,,https://doi.org/10.1093/glycob/cwaa101
Q9BYF1,322,G85740DB,G85740DB,Asn,N-linked,,33135055,,https://doi.org/10.1093/glycob/cwaa101
Q9BYF1,322,G56610MH,G56610MH,Asn,N-linked,,33135055,,https://doi.org/10.1093/glycob/cwaa101
Q9BYF1,322,G44953PJ,G44953PJ,Asn,N-linked,,33135055,,https://doi.org/10.1093/glycob/cwaa101
Q9BYF1,322,G12580WI,G12580WI,Asn,N-linked,,33135055,,https://doi.org/10.1093/glycob/cwaa101
Q9BYF1,322,G86752LQ,G86752LQ,Asn,N-linked,,33135055,,https://doi.org/10.1093/glycob/cwaa101
Q9BYF1,322,G43638QT,G43638QT,Asn,N-linked,,33135055,,https://doi.org/10.1093/glycob/cwaa101
Q9BYF1,322,G54417MJ,G54417MJ,Asn,N-linked,,33135055,,https://doi.org/10.1093/glycob/cwaa101
Q9BYF1,322,G85144OK,G85144OK,Asn,N-linked,,33135055,,https://doi.org/10.1093/glycob/cwaa101
Q9BYF1,322,G19517GM,G19517GM,Asn,N-linked,,33135055,,https://doi.org/10.1093/glycob/cwaa101
Q9BYF1,322,G98596OT,G98596OT,Asn,N-linked,,33135055,,https://doi.org/10.1093/glycob/cwaa101
Q9BYF1,322,G32926LW,G32926LW,Asn,N-linked,,33135055,,https://doi.org/10.1093/glycob/cwaa101
Q9BYF1,432,,,Asn,N-linked,,33135055,,https://doi.org/10.1093/glycob/cwaa101
Q9BYF1,432,G25987BV,G25987BV,Asn,N-linked,,33135055,,https://doi.org/10.1093/glycob/cwaa101
Q9BYF1,432,G59937CP,G59937CP,Asn,N-linked,,33135055,,https://doi.org/10.1093/glycob/cwaa101
Q9BYF1,432,G88725PI,G88725PI,Asn,N-linked,,33135055,,https://doi.org/10.1093/glycob/cwaa101
Q9BYF1,432,G83555HU,G83555HU,Asn,N-linked,,33135055,,https://doi.org/10.1093/glycob/cwaa101
Q9BYF1,432,G68318VE,G68318VE,Asn,N-linked,,33135055,,https://doi.org/10.1093/glycob/cwaa101
Q9BYF1,432,G54600FO,G54600FO,Asn,N-linked,,33135055,,https://doi.org/10.1093/glycob/cwaa101
Q9BYF1,432,G85740DB,G85740DB,Asn,N-linked,,33135055,,https://doi.org/10.1093/glycob/cwaa101
Q9BYF1,432,G08293MJ,G08293MJ,Asn,N-linked,,33135055,,https://doi.org/10.1093/glycob/cwaa101
Q9BYF1,432,G44953PJ,G44953PJ,Asn,N-linked,,33135055,,https://doi.org/10.1093/glycob/cwaa101
Q9BYF1,432,G44211QA,G44211QA,Asn,N-linked,,33135055,,https://doi.org/10.1093/glycob/cwaa101
Q9BYF1,432,G12580WI,G12580WI,Asn,N-linked,,33135055,,https://doi.org/10.1093/glycob/cwaa101
Q9BYF1,432,G88374WZ,G88374WZ,Asn,N-linked,,33135055,,https://doi.org/10.1093/glycob/cwaa101
Q9BYF1,432,G86752LQ,G86752LQ,Asn,N-linked,,33135055,,https://doi.org/10.1093/glycob/cwaa101
Q9BYF1,432,G85144OK,G85144OK,Asn,N-linked,,33135055,,https://doi.org/10.1093/glycob/cwaa101
Q9BYF1,546,,,Asn,N-linked,,33135055,,https://doi.org/10.1093/glycob/cwaa101
Q9BYF1,546,G02815KT,G02815KT,Asn,N-linked,,33135055,,https://doi.org/10.1093/glycob/cwaa101
Q9BYF1,546,G80475RE,G80475RE,Asn,N-linked,,33135055,,https://doi.org/10.1093/glycob/cwaa101
Q9BYF1,546,G10339FR,G10339FR,Asn,N-linked,,33135055,,https://doi.org/10.1093/glycob/cwaa101
Q9BYF1,546,G25987BV,G25987BV,Asn,N-linked,,33135055,,https://doi.org/10.1093/glycob/cwaa101
Q9BYF1,546,G59937CP,G59937CP,Asn,N-linked,,33135055,,https://doi.org/10.1093/glycob/cwaa101
Q9BYF1,546,G88725PI,G88725PI,Asn,N-linked,,33135055,,https://doi.org/10.1093/glycob/cwaa101
Q9BYF1,546,G83555HU,G83555HU,Asn,N-linked,,33135055,,https://doi.org/10.1093/glycob/cwaa101
Q9BYF1,546,G68318VE,G68318VE,Asn,N-linked,,33135055,,https://doi.org/10.1093/glycob/cwaa101
Q9BYF1,546,G54600FO,G54600FO,Asn,N-linked,,33135055,,https://doi.org/10.1093/glycob/cwaa101
Q9BYF1,690,,,Asn,N-linked,,33135055,,https://doi.org/10.1093/glycob/cwaa101
Q9BYF1,690,G06850XD,G06850XD,Asn,N-linked,,33135055,,https://doi.org/10.1093/glycob/cwaa101
Q9BYF1,690,G02815KT,G02815KT,Asn,N-linked,,33135055,,https://doi.org/10.1093/glycob/cwaa101
Q9BYF1,690,G80475RE,G80475RE,Asn,N-linked,,33135055,,https://doi.org/10.1093/glycob/cwaa101
Q9BYF1,690,G05428EU,G05428EU,Asn,N-linked,,33135055,,https://doi.org/10.1093/glycob/cwaa101
Q9BYF1,690,G35029YA,G35029YA,Asn,N-linked,,33135055,,https://doi.org/10.1093/glycob/cwaa101
Q9BYF1,690,G41247ZX,G41247ZX,Asn,N-linked,,33135055,,https://doi.org/10.1093/glycob/cwaa101
Q9BYF1,690,G10339FR,G10339FR,Asn,N-linked,,33135055,,https://doi.org/10.1093/glycob/cwaa101
Q9BYF1,690,G25987BV,G25987BV,Asn,N-linked,,33135055,,https://doi.org/10.1093/glycob/cwaa101
Q9BYF1,690,G72787SB,G72787SB,Asn,N-linked,,33135055,,https://doi.org/10.1093/glycob/cwaa101
Q9BYF1,690,G59937CP,G59937CP,Asn,N-linked,,33135055,,https://doi.org/10.1093/glycob/cwaa101
Q9BYF1,690,G10486CT,G10486CT,Asn,N-linked,,33135055,,https://doi.org/10.1093/glycob/cwaa101
Q9BYF1,690,G88725PI,G88725PI,Asn,N-linked,,33135055,,https://doi.org/10.1093/glycob/cwaa101
Q9BYF1,690,G45504EY,G45504EY,Asn,N-linked,,33135055,,https://doi.org/10.1093/glycob/cwaa101
Q9BYF1,690,G83555HU,G83555HU,Asn,N-linked,,33135055,,https://doi.org/10.1093/glycob/cwaa101
Q9BYF1,690,G68318VE,G68318VE,Asn,N-linked,,33135055,,https://doi.org/10.1093/glycob/cwaa101
Q9BYF1,690,G54600FO,G54600FO,Asn,N-linked,,33135055,,https://doi.org/10.1093/glycob/cwaa101
Q9BYF1,690,G59626AS,G59626AS,Asn,N-linked,,33135055,,https://doi.org/10.1093/glycob/cwaa101
Q9BYF1,690,G85740DB,G85740DB,Asn,N-linked,,33135055,,https://doi.org/10.1093/glycob/cwaa101
Q9BYF1,690,G08293MJ,G08293MJ,Asn,N-linked,,33135055,,https://doi.org/10.1093/glycob/cwaa101
Q9BYF1,690,G44211QA,G44211QA,Asn,N-linked,,33135055,,https://doi.org/10.1093/glycob/cwaa101
Q9BYF1,690,G88374WZ,G88374WZ,Asn,N-linked,,33135055,,https://doi.org/10.1093/glycob/cwaa101
Q9BYF1,690,G86752LQ,G86752LQ,Asn,N-linked,,33135055,,https://doi.org/10.1093/glycob/cwaa101
Q9BYF1,730,,,Asn,N-linked,,33135055,,https://doi.org/10.1093/glycob/cwaa101
Q9BYF1,730,G17015OC,G17015OC,Asn,N-linked,,33135055,,https://doi.org/10.1093/glycob/cwaa101
Q9BYF1,730,G23729WG,G23729WG,Asn,N-linked,,33135055,,https://doi.org/10.1093/glycob/cwaa101
