Protein,Position,Id,Toucan,AminoAcid,TypeAminoAcid,Notes,pmid,AdditionalNotes,doi,Composition,peptide_start,peptide_end,cellline,cellosaurus
A1L4H1,190,G57321FI,G57321FI,"",O-linked,Data provided by GlycoDomainViewer, 25813380,"control sera, healthy",10.1074/mcp.M114.046862,HexNAc1Hex0dHex0NeuAc0NeuGc0Pent0S0P0KDN0HexA0,"","","",""
A1L4H1,189,G57321FI,G57321FI,"",O-linked,Data provided by GlycoDomainViewer, 25813380,"control sera, healthy",10.1074/mcp.M114.046862,HexNAc1Hex0dHex0NeuAc0NeuGc0Pent0S0P0KDN0HexA0,"","","",""
P01834,98,G57321FI,G57321FI,"",O-linked,Data provided by GlycoDomainViewer, 25813380,"control sera, healthy",10.1074/mcp.M114.046862,HexNAc1Hex0dHex0NeuAc0NeuGc0Pent0S0P0KDN0HexA0,"","","",""
P02656,94,G57321FI,G57321FI,"",O-linked,Data provided by GlycoDomainViewer, 25813380,"control sera, healthy",10.1074/mcp.M114.046862,HexNAc1Hex0dHex0NeuAc0NeuGc0Pent0S0P0KDN0HexA0,"","","",""
P05546,102,G57321FI,G57321FI,"",O-linked,Data provided by GlycoDomainViewer, 25813380,"control sera, healthy",10.1074/mcp.M114.046862,HexNAc1Hex0dHex0NeuAc0NeuGc0Pent0S0P0KDN0HexA0,"","","",""
P05546,100,G57321FI,G57321FI,"",O-linked,Data provided by GlycoDomainViewer, 25813380,"control sera, healthy",10.1074/mcp.M114.046862,HexNAc1Hex0dHex0NeuAc0NeuGc0Pent0S0P0KDN0HexA0,"","","",""
P06681,234,G57321FI,G57321FI,"",O-linked,Data provided by GlycoDomainViewer, 25813380,"control sera, healthy",10.1074/mcp.M114.046862,HexNAc1Hex0dHex0NeuAc0NeuGc0Pent0S0P0KDN0HexA0,"","","",""
Q92954,324,G57321FI,G57321FI,"",O-linked,Data provided by GlycoDomainViewer, 25813380,"control sera, healthy",10.1074/mcp.M114.046862,HexNAc1Hex0dHex0NeuAc0NeuGc0Pent0S0P0KDN0HexA0,"","","",""
Q9NSC7,245,G57321FI,G57321FI,"",O-linked,Data provided by GlycoDomainViewer, 25813380,"control sera, healthy",10.1074/mcp.M114.046862,HexNAc1Hex0dHex0NeuAc0NeuGc0Pent0S0P0KDN0HexA0,"","","",""
Q9NSC7,244,G57321FI,G57321FI,"",O-linked,Data provided by GlycoDomainViewer, 25813380,"control sera, healthy",10.1074/mcp.M114.046862,HexNAc1Hex0dHex0NeuAc0NeuGc0Pent0S0P0KDN0HexA0,"","","",""
Q9ULI3,336,G57321FI,G57321FI,"",O-linked,Data provided by GlycoDomainViewer, 25813380,"control sera, healthy",10.1074/mcp.M114.046862,HexNAc1Hex0dHex0NeuAc0NeuGc0Pent0S0P0KDN0HexA0,"","","",""
Q9ULI3,342,G57321FI,G57321FI,"",O-linked,Data provided by GlycoDomainViewer, 25813380,"control sera, healthy",10.1074/mcp.M114.046862,HexNAc1Hex0dHex0NeuAc0NeuGc0Pent0S0P0KDN0HexA0,"","","",""
Q9ULI3,562,G57321FI,G57321FI,"",O-linked,Data provided by GlycoDomainViewer, 25813380,"control sera, healthy",10.1074/mcp.M114.046862,HexNAc1Hex0dHex0NeuAc0NeuGc0Pent0S0P0KDN0HexA0,"","","",""
Q9ULI3,255,G57321FI,G57321FI,"",O-linked,Data provided by GlycoDomainViewer, 25813380,"control sera, healthy",10.1074/mcp.M114.046862,HexNAc1Hex0dHex0NeuAc0NeuGc0Pent0S0P0KDN0HexA0,"","","",""
Q9ULI3,254,G57321FI,G57321FI,"",O-linked,Data provided by GlycoDomainViewer, 25813380,"control sera, healthy",10.1074/mcp.M114.046862,HexNAc1Hex0dHex0NeuAc0NeuGc0Pent0S0P0KDN0HexA0,"","","",""
