"name","mass","mass_charge","hex","hexnac","dhex","neunac","charge","mi","glycoprotein_standard_id","css","mode","native_structure","glycoprotein_standard_id-2","ionmob_gas_id","name-2","adduct_id"
"Fetuin","365.1","388.1","1","1","0","0",1,"y",5,"111.5","positive",NULL,5,1,"He",1
"Fetuin","365.1","388.1","1","1","0","0",1,"y",3,"111.9","positive",NULL,3,1,"He",1
"Fetuin","365.1","388.1","1","1","0","0",1,"y",4,"112","positive",NULL,4,1,"He",1
"Fetuin","365.1","388.1","1","1","0","0",1,"y",6,"112.2","positive",NULL,6,1,"He",1
"Fetuin","365.1","388.1","1","1","0","0",1,"y",1,"112.7","positive",NULL,1,1,"He",1
"Fetuin","365.1","388.1","1","1","0","0",1,"y",2,"113.2","positive",NULL,2,1,"He",1
"Fetuin","383.1","406.1","1","1","0","0",1,"y",5,"116.4","positive",NULL,5,1,"He",1
"Fetuin","383.1","406.1","1","1","0","0",1,"y",3,"117.2","positive",NULL,3,1,"He",1
"Fetuin","383.1","406.1","1","1","0","0",1,"y",6,"117.6","positive",NULL,6,1,"He",1
"Fetuin","383.1","406.1","1","1","0","0",1,"y",2,"117.6","positive",NULL,2,1,"He",1
"Fetuin","406.1","429.1","0","2","0","0",1,"y",5,"122.5","positive",NULL,5,1,"He",1
"Fetuin","406.1","429.1","0","2","0","0",1,"y",6,"122.7","positive",NULL,6,1,"He",1
"Fetuin","406.1","429.1","0","2","0","0",1,"y",3,"124.3","positive",NULL,3,1,"He",1
"Fetuin","424.2","447.2","0","2","0","0",1,"y",5,"126.2","positive",NULL,5,1,"He",1
"Fetuin","424.2","447.2","0","2","0","0",1,"y",4,"126.5","positive",NULL,4,1,"He",1
"Fetuin","424.2","447.2","0","2","0","0",1,"y",6,"127.2","positive",NULL,6,1,"He",1
"Fetuin","424.2","447.2","0","2","0","0",1,"y",2,"128.1","positive",NULL,2,1,"He",1
"Fetuin","424.2","447.2","0","2","0","0",1,"y",3,"128.5","positive",NULL,3,1,"He",1
"Fetuin","486.1","509.1","3","0","0","0",1,"y",3,"126.4","positive",NULL,3,1,"He",1
"Fetuin","486.1","509.1","3","0","0","0",1,"y",5,"127.4","positive",NULL,5,1,"He",1
"Fetuin","486.1","509.1","3","0","0","0",1,"y",4,"127.6","positive",NULL,4,1,"He",1
"Fetuin","486.1","509.1","3","0","0","0",1,"y",6,"129.1","positive",NULL,6,1,"He",1
"Fetuin","504.2","527.2","3","0","0","0",1,"y",4,"133.2","positive",NULL,4,1,"He",1
"Fetuin","504.2","527.2","3","0","0","0",1,"y",6,"143.9","positive",NULL,6,1,"He",1
"Fetuin","504.2","527.2","3","0","0","0",1,"y",5,"146.5","positive",NULL,5,1,"He",1
"Fetuin","527.2","550.2","2","1","0","0",1,"y",5,"140.4","positive",NULL,5,1,"He",1
"Fetuin","527.2","550.2","2","1","0","0",1,"y",6,"141.1","positive",NULL,6,1,"He",1
"Fetuin","527.2","550.2","2","1","0","0",1,"y",1,"141.7","positive",NULL,1,1,"He",1
"Fetuin","527.2","550.2","2","1","0","0",1,"y",2,"142.3","positive",NULL,2,1,"He",1
"Fetuin","527.2","550.2","2","1","0","0",1,"y",3,"144.8","positive",NULL,3,1,"He",1
"Fetuin","527.2","550.2","2","1","0","0",1,"y",4,"145.1","positive",NULL,4,1,"He",1
"Fetuin","545.2","568.2","2","1","0","0",1,"y",5,"142.3","positive",NULL,5,1,"He",1
"Fetuin","545.2","568.2","2","1","0","0",1,"y",1,"142.3","positive",NULL,1,1,"He",1
"Fetuin","545.2","568.2","2","1","0","0",1,"y",6,"143.3","positive",NULL,6,1,"He",1
"Fetuin","545.2","568.2","2","1","0","0",1,"y",4,"144.9","positive",NULL,4,1,"He",1
"Fetuin","545.2","568.2","2","1","0","0",1,"y",3,"150.1","positive",NULL,3,1,"He",1
"Fetuin","568.2","591.2","1","2","0","0",1,"y",1,"145.5","positive",NULL,1,1,"He",1
"Fetuin","568.2","591.2","1","2","0","0",1,"y",3,"149.4","positive",NULL,3,1,"He",1
"Fetuin","570.2","593.2","0","2","1","0",1,"y",6,"153.3","positive",NULL,6,1,"He",1
"Fetuin","570.2","593.2","0","2","1","0",1,"y",5,"154.4","positive",NULL,5,1,"He",1
"Fetuin","586.2","609.2","1","2","0","0",1,"y",1,"150.6","positive",NULL,1,1,"He",1
"Fetuin","648.2","671.2","4","0","0","0",1,"y",6,"158.5","positive",NULL,6,1,"He",1
"Fetuin","648.2","671.2","4","0","0","0",1,"y",4,"158.9","positive",NULL,4,1,"He",1
"Fetuin","648.2","671.2","4","0","0","0",1,"y",5,"159.3","positive",NULL,5,1,"He",1
"Fetuin","656.2","679.2","1","1","0","1",1,"y",1,"163.8","positive",NULL,1,1,"He",1
"Fetuin","689.2","712.2","3","1","0","0",1,"y",1,"164.8","positive",NULL,1,1,"He",1
"Fetuin","689.2","712.2","3","1","0","0",1,"y",2,"168.3","positive",NULL,2,1,"He",1
"Fetuin","689.2","712.2","3","1","0","0",1,"y",6,"169.9","positive",NULL,6,1,"He",1
"Fetuin","689.2","712.2","3","1","0","0",1,"y",5,"170","positive",NULL,5,1,"He",1
"Fetuin","689.2","712.2","3","1","0","0",1,"y",3,"171","positive",NULL,3,1,"He",1
"Fetuin","689.2","712.2","3","1","0","0",1,"y",4,"172.2","positive",NULL,4,1,"He",1
"Fetuin","707.2","730.2","3","1","0","0",1,"y",3,"175.6","positive",NULL,3,1,"He",1
"Fetuin","707.2","730.2","3","1","0","0",1,"y",5,"182.1","positive",NULL,5,1,"He",1
"Fetuin","707.2","730.2","3","1","0","0",1,"y",6,"182.7","positive",NULL,6,1,"He",1
"Fetuin","730.2","753.2","2","2","0","0",1,"y",6,"177.9","positive",NULL,6,1,"He",1
"Fetuin","730.2","753.2","2","2","0","0",1,"y",2,"177.9","positive",NULL,2,1,"He",1
"Fetuin","730.2","753.2","2","2","0","0",1,"y",3,"178","positive",NULL,3,1,"He",1
"Fetuin","730.2","753.2","2","2","0","0",1,"y",5,"179.1","positive",NULL,5,1,"He",1
"Fetuin","748.3","771.3","2","2","0","0",1,"y",1,"178","positive",NULL,1,1,"He",1
"Fetuin","748.3","771.3","2","2","0","0",1,"y",2,"179.4","positive",NULL,2,1,"He",1
"Fetuin","748.3","771.3","2","2","0","0",1,"y",3,"182.4","positive",NULL,3,1,"He",1
"Fetuin","748.3","771.3","2","2","0","0",1,"y",6,"183.3","positive",NULL,6,1,"He",1
"Fetuin","748.3","771.3","2","2","0","0",1,"y",5,"183.6","positive",NULL,5,1,"He",1
"Fetuin","748.3","771.3","2","2","0","0",1,"y",4,"183.7","positive",NULL,4,1,"He",1
"Fetuin","771.3","794.3","1","3","0","0",1,"y",3,"182.4","positive",NULL,3,1,"He",1
"Fetuin","789.3","812.3","1","3","0","0",1,"y",3,"192.8","positive",NULL,3,1,"He",1
"Fetuin","810.3","833.3","5","0","0","0",1,"y",4,"181.5","positive",NULL,4,1,"He",1
"Fetuin","810.3","833.3","5","0","0","0",1,"y",5,"183.1","positive",NULL,5,1,"He",1
"Fetuin","810.3","833.3","5","0","0","0",1,"y",6,"184.3","positive",NULL,6,1,"He",1
"Fetuin","828.3","851.3","5","0","0","0",1,"y",5,"185","positive",NULL,5,1,"He",1
"Fetuin","828.3","851.3","5","0","0","0",1,"y",6,"187.1","positive",NULL,6,1,"He",1
"Fetuin","851.3","874.3","4","1","0","0",1,"y",6,"192.4","positive",NULL,6,1,"He",1
"Fetuin","851.3","874.3","4","1","0","0",1,"y",5,"193.2","positive",NULL,5,1,"He",1
"Fetuin","851.3","874.3","4","1","0","0",1,"y",4,"197.3","positive",NULL,4,1,"He",1
"Fetuin","869.3","892.3","4","1","0","0",1,"y",4,"194.4","positive",NULL,4,1,"He",1
"Fetuin","869.3","892.3","4","1","0","0",1,"y",5,"196.4","positive",NULL,5,1,"He",1
"Fetuin","869.3","892.3","4","1","0","0",1,"y",6,"199.4","positive",NULL,6,1,"He",1
"Fetuin","892.3","915.3","3","2","0","0",1,"y",3,"202.5","positive",NULL,3,1,"He",1
"Fetuin","910.3","933.3","3","2","0","0",1,"y",2,"200.3","positive",NULL,2,1,"He",1
"Fetuin","910.3","933.3","3","2","0","0",1,"y",1,"204.9","positive",NULL,1,1,"He",1
"Fetuin","910.3","933.3","3","2","0","0",1,"y",6,"208.4","positive",NULL,6,1,"He",1
"Fetuin","910.3","933.3","3","2","0","0",1,"y",5,"209","positive",NULL,5,1,"He",1
"Fetuin","910.3","933.3","3","2","0","0",1,"y",4,"209.8","positive",NULL,4,1,"He",1
"Fetuin","910.3","933.3","3","2","0","0",1,"y",3,"212.2","positive",NULL,3,1,"He",1
"Fetuin","972.3","995.3","6","0","0","0",1,"y",4,"213.2","positive",NULL,4,1,"He",1
"Fetuin","1013.3","1036.3","5","1","0","0",1,"y",3,"221.7","positive",NULL,3,1,"He",1
"Fetuin","1013.3","1036.3","5","1","0","0",1,"y",4,"224.2","positive",NULL,4,1,"He",1
"Fetuin","1013.3","1036.3","5","1","0","0",1,"y",6,"226.2","positive",NULL,6,1,"He",1
"Fetuin","1013.3","1036.3","5","1","0","0",1,"y",5,"227.8","positive",NULL,5,1,"He",1
"Fetuin","1031.3","1054.3","5","1","0","0",1,"n",4,"227","positive",NULL,4,1,"He",1
"Fetuin","1031.3","1054.3","5","1","0","0",1,"n",6,"230.6","positive",NULL,6,1,"He",1
"Fetuin","1031.3","1054.3","5","1","0","0",1,"n",5,"232.6","positive",NULL,5,1,"He",1
"Fetuin","1054.4","1077.4","4","2","0","0",1,"y",6,"225.8","positive",NULL,6,1,"He",1
"Fetuin","1054.4","1077.4","4","2","0","0",1,"y",5,"226.9","positive",NULL,5,1,"He",1
"Fetuin","1054.4","1077.4","4","2","0","0",1,"y",2,"227.8","positive",NULL,2,1,"He",1
"Fetuin","1056.4","1079.4","3","2","1","0",1,"n",6,"229.7","positive",NULL,6,1,"He",1
"Fetuin","1056.4","1079.4","3","2","1","0",1,"n",5,"231.3","positive",NULL,5,1,"He",1
"Fetuin","1072.4","1095.4","4","2","0","0",1,"y",4,"231.4","positive","y",4,1,"He",1
"Fetuin","1072.4","1095.4","4","2","0","0",1,"y",6,"233.8","positive","y",6,1,"He",1
"Fetuin","1072.4","1095.4","4","2","0","0",1,"y",5,"236.1","positive","y",5,1,"He",1
"Fetuin","1095.4","1118.4","3","3","0","0",1,"y",2,"235.7","positive",NULL,2,1,"He",1
"Fetuin","1095.4","1118.4","3","3","0","0",1,"y",3,"236.6","positive",NULL,3,1,"He",1
"Fetuin","1113.4","1136.4","3","3","0","0",1,"y",4,"231.2","positive",NULL,4,1,"He",1
"Fetuin","1113.4","1136.4","3","3","0","0",1,"y",2,"237.2","positive",NULL,2,1,"He",1
"Fetuin","1113.4","1136.4","3","3","0","0",1,"y",6,"237.6","positive",NULL,6,1,"He",1
"Fetuin","1113.4","1136.4","3","3","0","0",1,"y",5,"239.1","positive",NULL,5,1,"He",1
"Fetuin","1113.4","1136.4","3","3","0","0",1,"y",3,"241.2","positive","y",3,1,"He",1
"Fetuin","1113.4","1136.4","3","3","0","0",1,"y",1,"243.9","positive",NULL,1,1,"He",1
"Fetuin","1134.4","1157.4","7","0","0","0",1,"n",6,"249.4","positive",NULL,6,1,"He",1
"Fetuin","1134.4","1157.4","7","0","0","0",1,"n",5,"251","positive",NULL,5,1,"He",1
"Fetuin","1175.4","1198.4","6","1","0","0",1,"n",4,"250.4","positive",NULL,4,1,"He",1
"Fetuin","1175.4","1198.4","6","1","0","0",1,"n",3,"250.4","positive",NULL,3,1,"He",1
"Fetuin","1175.4","1198.4","6","1","0","0",1,"n",6,"250.6","positive",NULL,6,1,"He",1
"Fetuin","1175.4","1198.4","6","1","0","0",1,"n",5,"252.5","positive",NULL,5,1,"He",1
"Fetuin","1193.4","1216.4","6","1","0","0",1,"n",4,"247.5","positive",NULL,4,1,"He",1
"Fetuin","1193.4","1216.4","6","1","0","0",1,"n",5,"250.4","positive",NULL,5,1,"He",1
"Fetuin","1193.4","1216.4","6","1","0","0",1,"n",6,"251.4","positive",NULL,6,1,"He",1
"Fetuin","1216.4","1239.4","5","2","0","0",1,"n",2,"246.9","positive",NULL,2,1,"He",1
"Fetuin","1216.4","1239.4","5","2","0","0",1,"n",6,"249.2","positive",NULL,6,1,"He",1
"Fetuin","1216.4","1239.4","5","2","0","0",1,"n",5,"250.8","positive",NULL,5,1,"He",1
"Fetuin","1216.4","1239.4","5","2","0","0",1,"n",1,"253.5","positive",NULL,1,1,"He",1
"Fetuin","1216.4","1239.4","5","2","0","0",1,"y",4,"260","positive",NULL,4,1,"He",1
"Fetuin","1234.4","1257.4","5","2","0","0",1,"y",6,"258.6","positive","y",6,1,"He",1
"Fetuin","1234.4","1257.4","5","2","0","0",1,"n",2,"259.2","positive",NULL,2,1,"He",1
"Fetuin","1234.4","1257.4","5","2","0","0",1,"y",3,"261.5","positive",NULL,3,1,"He",1
"Fetuin","1234.4","1257.4","5","2","0","0",1,"y",5,"263.5","positive","y",5,1,"He",1
"Fetuin","1234.4","1257.4","5","2","0","0",1,"y",4,"265.2","positive","y",4,1,"He",1
"Fetuin","1234.4","1257.4","5","2","0","0",1,"n",1,"268.9","positive",NULL,1,1,"He",1
"Fetuin","1257.4","1280.4","4","3","0","0",1,"y",2,"256.1","positive",NULL,2,1,"He",1
"Fetuin","1257.4","1280.4","4","3","0","0",1,"y",3,"259.6","positive",NULL,3,1,"He",1
"Fetuin","1259.5","1282.5","3","3","0","0",1,"n",5,"259.1","positive","y",5,1,"He",1
"Fetuin","1259.5","1282.5","3","3","0","0",1,"n",6,"261.9","positive","y",6,1,"He",1
"Fetuin","1275.5","1298.5","4","3","0","0",1,"y",3,"250.6","positive","y",3,1,"He",1
"Fetuin","1275.5","1298.5","4","3","0","0",1,"y",2,"256.8","positive",NULL,2,1,"He",1
"Fetuin","1275.5","1298.5","4","3","0","0",1,"y",5,"259.4","positive","y",5,1,"He",1
"Fetuin","1275.5","1298.5","4","3","0","0",1,"y",6,"259.5","positive","y",6,1,"He",1
"Fetuin","1275.5","1298.5","4","3","0","0",1,"y",1,"264.3","positive",NULL,1,1,"He",1
"Fetuin","1316.5","681.3","3","4","0","0",2,"n",3,"259.9","positive","y",3,1,"He",1
"Fetuin","1316.5","1339.5","3","4","0","0",1,"y",3,"269.7","positive","y",3,1,"He",1
"Fetuin","1337.4","1360.4","7","1","0","0",1,"n",6,"272.5","positive",NULL,6,1,"He",1
"Fetuin","1337.4","1360.4","7","1","0","0",1,"n",5,"275","positive",NULL,5,1,"He",1
"Fetuin","1378.5","1401.5","6","2","0","0",1,"n",4,"290.5","positive",NULL,4,1,"He",1
"Fetuin","1396.5","1419.5","6","2","0","0",1,"n",4,"275.3","positive","y",4,1,"He",1
"Fetuin","1396.5","1419.5","6","2","0","0",1,"n",6,"279.1","positive","y",6,1,"He",1
"Fetuin","1396.5","1419.5","6","2","0","0",1,"n",5,"279.8","positive","y",5,1,"He",1
"Fetuin","1396.5","1419.5","6","2","0","0",1,"n",3,"281.4","positive","y",3,1,"He",1
"Fetuin","1419.5","1442.5","5","3","0","0",1,"n",2,"276.4","positive",NULL,2,1,"He",1
"Fetuin","1419.5","1442.5","5","3","0","0",1,"n",6,"278.5","positive",NULL,6,1,"He",1
"Fetuin","1419.5","1442.5","5","3","0","0",1,"n",5,"280.1","positive",NULL,5,1,"He",1
"Fetuin","1421.5","1444.5","4","3","1","",1,"y",5,"282.9","positive","y",5,1,"He",1
"Fetuin","1421.5","1444.5","4","3","1","",1,"y",6,"283.5","positive","y",6,1,"He",1
"Fetuin","1437.5","1460.5","5","3","0","0",1,"n",2,"275.9","positive",NULL,2,1,"He",1
"Fetuin","1437.5","1460.5","5","3","0","0",1,"n",6,"277.4","positive","y",6,1,"He",1
"Fetuin","1437.5","1460.5","5","3","0","0",1,"n",5,"279.5","positive","y",5,1,"He",1
"Fetuin","1437.5","1460.5","5","3","0","0",1,"n",3,"287.2","positive","y",3,1,"He",1
"Fetuin","1460.5","1483.5","4","4","0","0",1,"y",2,"281","positive",NULL,2,1,"He",1
"Fetuin","1460.5","1483.5","4","4","0","0",1,"y",3,"286.9","positive",NULL,3,1,"He",1
"Fetuin","1462.5","1485.5","3","4","1","",1,"n",6,"291.5","positive","y",6,1,"He",1
"Fetuin","1462.5","1485.5","3","4","1","",1,"n",5,"292.5","positive","y",5,1,"He",1
"Fetuin","1478.5","1501.5","4","4","0","0",1,"y",2,"280.1","positive",NULL,2,1,"He",1
"Fetuin","1478.5","1501.5","4","4","0","0",1,"n",6,"282.4","positive","y",6,1,"He",1
"Fetuin","1478.5","1501.5","4","4","0","0",1,"n",5,"283.6","positive","y",5,1,"He",1
"Fetuin","1478.5","1501.5","4","4","0","0",1,"n",3,"284.8","positive","y",3,1,"He",1
"Fetuin","1478.5","1501.5","4","4","0","0",1,"y",1,"285.3","positive",NULL,1,1,"He",1
"Fetuin","1478.6","762.3","4","4","0","0",2,"y",3,"273.5","positive","y",3,1,"He",1
"Fetuin","1499.5","1522.5","8","1","0","0",1,"n",6,"295.5","positive",NULL,6,1,"He",1
"Fetuin","1499.5","1522.5","8","1","0","0",1,"n",5,"297.6","positive",NULL,5,1,"He",1
"Fetuin","1501.5","1524.5","3","5","0","0",1,"n",3,"298.2","positive",NULL,3,1,"He",1
"Fetuin","1517.5","1540.5","8","1","0","0",1,"n",6,"292.5","positive",NULL,6,1,"He",1
"Fetuin","1517.5","1540.5","8","1","0","0",1,"n",5,"294.2","positive",NULL,5,1,"He",1
"Fetuin","1517.5","1540.5","8","1","0","0",1,"n",4,"302.1","positive",NULL,4,1,"He",1
"Fetuin","1519.6","782.8","3","5","0","0",2,"y",3,"280.9","positive","y",3,1,"He",1
"Fetuin","1519.6","1542.6","3","5","0","0",1,"n",3,"299.3","positive","y",3,1,"He",1
"Fetuin","1540.5","1563.5","7","2","0","0",1,"y",5,"289.5","positive",NULL,5,1,"He",1
"Fetuin","1540.5","1563.5","7","2","0","0",1,"y",6,"294.8","positive",NULL,6,1,"He",1
"Fetuin","1540.5","1563.5","7","2","0","0",1,"y",4,"296.5","positive",NULL,4,1,"He",1
"Fetuin","1558.5","1581.5","7","2","0","0",1,"y",6,"296.3","positive","y",6,1,"He",1
"Fetuin","1558.5","1581.5","7","2","0","0",1,"y",5,"298","positive","y",5,1,"He",1
"Fetuin","1558.5","1581.5","7","2","0","0",1,"y",4,"304.5","positive","y",4,1,"He",1
"Fetuin","1558.6","802.3","7","2","0","0",2,"y",4,"287.1","positive","y",4,1,"He",1
"Fetuin","1581.5","1604.5","6","3","0","0",1,"?",4,"307.6","positive",NULL,4,1,"He",1
"Fetuin","1583.6","1606.6","5","3","1","0",1,"n",6,"300.2","positive","y",6,1,"He",1
"Fetuin","1583.6","1606.6","5","3","1","0",1,"n",5,"302.1","positive","y",5,1,"He",1
"Fetuin","1599.6","1622.6","6","3","0","0",1,"n",6,"303.8","positive","y",6,1,"He",1
"Fetuin","1599.6","1622.6","6","3","0","0",1,"n",5,"304.9","positive","y",5,1,"He",1
"Fetuin","1599.6","1622.6","6","3","0","0",1,"n",3,"309.9","positive","y",3,1,"He",1
"Fetuin","1600.4","1623.4","6","3","0","0",1,"?",4,"312","positive",NULL,4,1,"He",1
"Fetuin","1622.6","1645.6","5","4","0","0",1,"n",1,"299.1","positive",NULL,1,1,"He",1
"Fetuin","1622.6","1645.6","5","4","0","0",1,"n",2,"299.8","positive",NULL,2,1,"He",1
"Fetuin","1624.6","835.3","4","4 + fuc","1","0",2,"y",5,"282.9","positive","y",5,1,"He",1
"Fetuin","1624.6","835.3","4","4 + fuc","1","0",2,"y",6,"288.5","positive","y",6,1,"He",1
"Fetuin","1624.6","1647.6","4","4","1","0",1,"n",6,"310.4","positive","y",6,1,"He",1
"Fetuin","1624.6","1647.6","4","4","1","0",1,"n",5,"312.6","positive","y",5,1,"He",1
"Fetuin","1640.6","843.3","5","4","0","0",2,"n",6,"278.5","positive","y",6,1,"He",1
"Fetuin","1640.6","843.3","5","4","0","0",2,"n",5,"280.1","positive","y",5,1,"He",1
"Fetuin","1640.6","843.3","5","4","0","0",2,"n",2,"286.7","positive","y",2,1,"He",1
"Fetuin","1640.6","843.3","5","4","0","0",2,"n",3,"295.5","positive","y",3,1,"He",1
"Fetuin","1640.6","1663.6","5","4","0","0",1,"n",2,"296.7","positive",NULL,2,1,"He",1
"Fetuin","1640.6","1663.6","5","4","0","0",1,"n",6,"298.1","positive","y",6,1,"He",1
"Fetuin","1640.6","1663.6","5","4","0","0",1,"n",5,"300.6","positive","y",5,1,"He",1
"Fetuin","1640.6","1663.6","5","4","0","0",1,"n",4,"305.2","positive",NULL,4,1,"He",1
"Fetuin","1640.6","1663.6","5","4","0","0",1,"n",3,"318.7","positive","y",3,1,"He",1
"Fetuin","1661.5","1684.5","9","1","0","0",1,"n",6,"316","positive",NULL,6,1,"He",1
"Fetuin","1661.5","1684.5","9","1","0","0",1,"n",5,"318","positive",NULL,5,1,"He",1
"Fetuin","1663.6","1686.6","4","5","0","0",1,"y",3,"318.6","positive",NULL,3,1,"He",1
"Fetuin","1681.6","1704.6","4","5","0","0",1,"y",3,"317.7","positive","y",3,1,"He",1
"Fetuin","1704.6","1727.6","3","6","0","0",1,"y",3,"328.7","positive",NULL,3,1,"He",1
"Fetuin","1720.6","883.3","8","2","0","0",2,"n",5,"296.2","positive","y",5,1,"He",1
"Fetuin","1720.6","883.3","8","2","0","0",2,"n",6,"298.1","positive","y",6,1,"He",1
"Fetuin","1720.6","883.3","8","2","0","0",2,"n",4,"306.2","positive","y",4,1,"He",1
"Fetuin","1720.6","1743.6","8","2","0","0",1,"n",6,"322.6","positive","y",6,1,"He",1
"Fetuin","1720.6","1743.6","8","2","0","0",1,"n",5,"324.7","positive","y",5,1,"He",1
"Fetuin","1720.6","1743.6","8","2","0","0",1,"n",4,"331.8","positive","y",4,1,"He",1
"Fetuin","1722.6","884.3","3","6","0","0",2,"n",3,"310.6","positive","y",3,1,"He",1
"Fetuin","1722.6","1745.6","3","6","0","0",1,"n",3,"326.7","positive","y",3,1,"He",1
"Fetuin","1744.6","895.3","6","3 + fuc","1","0",2,"y",6,"296","positive","y",6,1,"He",1
"Fetuin","1744.6","895.3","6","3 + fuc","1","0",2,"y",5,"296.4","positive","y",5,1,"He",1
"Fetuin","1784.6","915.3","6","4","0","0",2,"n",2,"316.6","positive",NULL,2,1,"He",1
"Fetuin","1784.6","1807.6","6","4","0","0",1,"y",2,"319.1","positive",NULL,2,1,"He",1
"Fetuin","1786.6","916.3","5","4+fuc","1","0",2,"y",5,"302.9","positive","y",5,1,"He",1
"Fetuin","1786.6","916.3","5","4+fuc","1","0",2,"y",6,"304.3","positive","y",6,1,"He",1
"Fetuin","1786.6","1809.6","5","4","1","0",1,"y",6,"330.8","positive","y",6,1,"He",1
"Fetuin","1786.6","1809.6","5","4","1","0",1,"y",5,"332.6","positive","y",5,1,"He",1
"Fetuin","1792.6","1815.6","3","5","0","1",1,"y",1,"319.4","positive",NULL,1,1,"He",1
"Fetuin","1802.6","924.3","6","4","0","0",2,"y",2,"317","positive","y",2,1,"He",1
"Fetuin","1802.6","1825.6","6","4","0","0",1,"y",6,"322.7","positive","y",6,1,"He",1
"Fetuin","1802.6","1825.6","6","4","0","0",1,"y",5,"323.9","positive","y",5,1,"He",1
"Fetuin","1825.7","1848.7","5","5","0","0",1,"y",3,"335.6","positive",NULL,3,1,"He",1
"Fetuin","1843.7","944.9","5","5","0","0",2,"n",2,"313.4","positive","y",2,1,"He",1
"Fetuin","1843.7","1866.7","5","5","0","0",1,"y",2,"323","positive",NULL,2,1,"He",1
"Fetuin","1843.7","1866.7","5","5","0","0",1,"y",1,"323.5","positive",NULL,1,1,"He",1
"Fetuin","1843.7","1866.7","5","5","0","0",1,"y",6,"334.9","positive","y",6,1,"He",1
"Fetuin","1843.7","1866.7","5","5","0","0",1,"y",5,"341.4","positive","y",5,1,"He",1
"Fetuin","1843.7","1866.7","5","5","0","0",1,"n",3,"342.2","positive","y",3,1,"He",1
"Fetuin","1866.7","1889.7","4","6","0","0",1,"y",3,"347.2","positive",NULL,3,1,"He",1
"Fetuin","1882.6","964.3","9","2","0","0",2,"n",5,"318","positive","y",5,1,"He",1
"Fetuin","1882.6","964.3","9","2","0","0",2,"n",6,"319.1","positive","y",6,1,"He",1
"Fetuin","1882.6","1905.6","9","2","0","0",1,"n",6,"345.6","positive","y",6,1,"He",1
"Fetuin","1882.6","1905.6","9","2","0","0",1,"n",5,"347.3","positive","y",5,1,"He",1
"Fetuin","1882.6","1905.6","9","2","0","0",1,"n",4,"348.3","positive","y",4,1,"He",1
"Fetuin","1884.7","1907.7","4","6","0","0",1,"y",3,"344.3","positive","y",3,1,"He",1
"Fetuin","1925.7","1948.7","3","7","0","0",1,"y",3,"352","positive","y",3,1,"He",1
"Fetuin","1925.8","985.9","3","7","0","0",2,"n",3,"333.2","positive","y",3,1,"He",1
"Fetuin","1931.7","1954.7","5","4","0","1",1,"y",2,"340","positive","y",2,1,"He",1
"Fetuin","1932.6","989.3","5","4","2","0",2,"y",6,"333.7","positive","y",6,1,"He",1
"Fetuin","1932.6","989.3","5","4","2","0",2,"y",5,"335.3","positive","y",5,1,"He",1
"Fetuin","1948.6","997.3","6","4","1","0",2,"n",6,"320.2","positive","y",6,1,"He",1
"Fetuin","1948.6","997.3","6","4","1","0",2,"n",5,"320.4","positive","y",5,1,"He",1
"Fetuin","1948.6","1971.6","6","4","0","1",1,"y",6,"344","positive","y",6,1,"He",1
"Fetuin","1948.6","1971.6","6","4","0","1",1,"y",5,"347.7","positive","y",5,1,"He",1
"Fetuin","1953.6","999.8","5","4","0","1(Na)",2,"n",1,"316.6","positive","y",1,1,"He",1
"Fetuin","1953.6","1976.6","5","4","0","1(Na)",1,"y",1,"342.1","positive","y",1,1,"He",1
"Fetuin","1987.7","2010.7","6","5","0","0",1,"n",2,"355","positive",NULL,2,1,"He",1
"Fetuin","1989.7","2012.7","5","5","0","1",1,"y",6,"355.7","positive","y",6,1,"He",1
"Fetuin","1989.7","2012.7","5","5","0","1",1,"y",5,"360.4","positive","y",5,1,"He",1
"Fetuin","1989.8","1017.9","5","5","1","0",2,"y",6,"333.8","positive","y",6,1,"He",1
"Fetuin","1989.8","1017.9","5","5","1","0",2,"y",5,"336.9","positive","y",5,1,"He",1
"Fetuin","2005.7","1025.9","6","5","0","0",2,"n",2,"335.8","positive","y",2,1,"He",1
"Fetuin","2005.7","2028.7","6","5","0","0",1,"n",2,"346","positive","y",2,1,"He",1
"Fetuin","2005.7","2028.7","6","5","0","0",1,"n",1,"348.3","positive","y",1,1,"He",1
"Fetuin","2046.8","1046.4","5","6","0","0",2,"y",2,"343.6","positive","y",2,1,"He",1
"Fetuin","2069.8","1057.9","4","7","0","0",2,"y",3,"354.4","positive",NULL,3,1,"He",1
"Fetuin","2087.6","1066.8","4","7","0","0",2,"y",3,"352.3","positive","y",3,1,"He",1
"Fetuin","2094.8","1070.4","6","4","2","0",2,"y",6,"352.9","positive","y",6,1,"He",1
"Fetuin","2094.8","1070.4","6","4","2","0",2,"y",5,"354.8","positive","y",5,1,"He",1
"Fetuin","2124.8","2147.8","6","5","0","1",1,"y",6,"373","positive","y",6,1,"He",1
"Fetuin","2124.8","2147.8","6","5","0","1",1,"y",5,"375.4","positive","y",5,1,"He",1
"Fetuin","2128.8","1087.4","3","8","0","0",2,"n",3,"358.1","positive","y",3,1,"He",1
"Fetuin","2151.8","1098.9","6","5","1","0",2,"y",6,"351.2","positive","y",6,1,"He",1
"Fetuin","2151.8","1098.9","6","5","1","0",2,"y",5,"355.2","positive","y",5,1,"He",1
"Fetuin","2194.8","1120.4","5","6","1","0",2,"y",6,"360.6","positive","y",6,1,"He",1
"Fetuin","2194.8","1120.4","5","6","1","0",2,"y",5,"362.6","positive","y",5,1,"He",1
"Fetuin","2266.8","1156.4","5","4","0","2(Na)",2,"n",1,"358.7","positive","y",1,1,"He",1
"Fetuin","2278.8","1162.4","6","5","0","1",2,"y",2,"359.5","positive",NULL,2,1,"He",1
"Fetuin","2290.8","1168.4","4","8","0","0",2,"y",3,"379.1","positive","y",3,1,"He",1
"Fetuin","2296.8","1171.4","6","5","0","1",2,"y",2,"363.2","positive","y",2,1,"He",1
"Fetuin","2313.8","1179.9","7","5","1","0",2,"y",6,"370.2","positive","y",6,1,"He",1
"Fetuin","2313.8","1179.9","7","5","1","0",2,"y",5,"373.9","positive","y",5,1,"He",1
"Fetuin","2318.8","1182.4","6","5","0","1(Na)",2,"y",1,"364.5","positive","y",1,1,"He",1
"Fetuin","2318.8","1182.4","6","5","0","1(Na)",2,"y",2,"368.4","positive","y",2,1,"He",1
"Fetuin","2361.8","1203.9","5","6","0","1(Na)",2,"y",2,"375.3","positive","y",2,1,"He",1
"Fetuin","2631.8","1338.9","6","5","0","2(Na)",2,"y",2,"405.3","positive","y",2,1,"He",1
"Fetuin","2631.8","1338.9","6","5","0","2(Na)",2,"y",1,"406.2","positive","y",1,1,"He",1
"Fetuin","2945","1495.5","6","5","0","3(Na)",2,"y",1,"449.3","positive","y",1,1,"He",1
"Fetuin","365.1","388.1","1","1","0","0",1,"y",5,"178.5","positive",NULL,5,2,"N",1
"Fetuin","365.1","388.1","1","1","0","0",1,"y",3,"179.1","positive",NULL,3,2,"N",1
"Fetuin","365.1","388.1","1","1","0","0",1,"y",6,"180.3","positive",NULL,6,2,"N",1
"Fetuin","365.1","388.1","1","1","0","0",1,"y",4,"180.4","positive",NULL,4,2,"N",1
"Fetuin","365.1","388.1","1","1","0","0",1,"y",2,"181.7","positive",NULL,2,2,"N",1
"Fetuin","365.1","388.1","1","1","0","0",1,"y",1,"182","positive",NULL,1,2,"N",1
"Fetuin","383.1","406.1","1","1","0","0",1,"y",3,"183.8","positive",NULL,3,2,"N",1
"Fetuin","383.1","406.1","1","1","0","0",1,"y",5,"185.4","positive",NULL,5,2,"N",1
"Fetuin","383.1","406.1","1","1","0","0",1,"y",2,"187.7","positive",NULL,2,2,"N",1
"Fetuin","383.1","406.1","1","1","0","0",1,"y",6,"187.8","positive",NULL,6,2,"N",1
"Fetuin","406.1","429.1","0","2","0","0",1,"y",3,"190","positive",NULL,3,2,"N",1
"Fetuin","406.1","429.1","0","2","0","0",1,"y",6,"193.5","positive",NULL,6,2,"N",1
"Fetuin","406.1","429.1","0","2","0","0",1,"y",5,"194.4","positive",NULL,5,2,"N",1
"Fetuin","424.2","447.2","0","2","0","0",1,"y",3,"197.3","positive",NULL,3,2,"N",1
"Fetuin","424.2","447.2","0","2","0","0",1,"y",6,"197.4","positive",NULL,6,2,"N",1
"Fetuin","424.2","447.2","0","2","0","0",1,"y",4,"198.4","positive",NULL,4,2,"N",1
"Fetuin","424.2","447.2","0","2","0","0",1,"y",2,"199.1","positive",NULL,2,2,"N",1
"Fetuin","424.2","447.2","0","2","0","0",1,"y",5,"199.7","positive",NULL,5,2,"N",1
"Fetuin","486.1","509.1","3","0","0","0",1,"y",3,"200.6","positive",NULL,3,2,"N",1
"Fetuin","486.1","509.1","3","0","0","0",1,"y",5,"202.1","positive",NULL,5,2,"N",1
"Fetuin","486.1","509.1","3","0","0","0",1,"y",4,"203.6","positive",NULL,4,2,"N",1
"Fetuin","486.1","509.1","3","0","0","0",1,"y",6,"204.1","positive",NULL,6,2,"N",1
"Fetuin","504.2","527.2","3","0","0","0",1,"y",4,"207.3","positive",NULL,4,2,"N",1
"Fetuin","504.2","527.2","3","0","0","0",1,"y",5,"215.5","positive",NULL,5,2,"N",1
"Fetuin","504.2","527.2","3","0","0","0",1,"y",6,"217.1","positive",NULL,6,2,"N",1
"Fetuin","527.2","550.2","2","1","0","0",1,"y",1,"218.7","positive",NULL,1,2,"N",1
"Fetuin","527.2","550.2","2","1","0","0",1,"y",3,"219","positive",NULL,3,2,"N",1
"Fetuin","527.2","550.2","2","1","0","0",1,"y",5,"219","positive",NULL,5,2,"N",1
"Fetuin","527.2","550.2","2","1","0","0",1,"y",2,"219","positive",NULL,2,2,"N",1
"Fetuin","527.2","550.2","2","1","0","0",1,"y",6,"219.6","positive",NULL,6,2,"N",1
"Fetuin","527.2","550.2","2","1","0","0",1,"y",4,"220.5","positive",NULL,4,2,"N",1
"Fetuin","545.2","568.2","2","1","0","0",1,"y",4,"210.8","positive",NULL,4,2,"N",1
"Fetuin","545.2","568.2","2","1","0","0",1,"y",1,"215.6","positive",NULL,1,2,"N",1
"Fetuin","545.2","568.2","2","1","0","0",1,"y",5,"219.8","positive",NULL,5,2,"N",1
"Fetuin","545.2","568.2","2","1","0","0",1,"y",6,"222","positive",NULL,6,2,"N",1
"Fetuin","545.2","568.2","2","1","0","0",1,"y",3,"224.9","positive",NULL,3,2,"N",1
"Fetuin","568.2","591.2","1","2","0","0",1,"y",1,"220.1","positive",NULL,1,2,"N",1
"Fetuin","568.2","591.2","1","2","0","0",1,"y",3,"229.5","positive",NULL,3,2,"N",1
"Fetuin","570.2","593.2","0","2","1","0",1,"y",5,"226.7","positive",NULL,5,2,"N",1
"Fetuin","570.2","593.2","0","2","1","0",1,"y",6,"230","positive",NULL,6,2,"N",1
"Fetuin","586.2","609.2","1","2","0","0",1,"y",1,"228.4","positive",NULL,1,2,"N",1
"Fetuin","648.2","671.2","4","0","0","0",1,"y",5,"241.1","positive",NULL,5,2,"N",1
"Fetuin","648.2","671.2","4","0","0","0",1,"y",4,"242","positive",NULL,4,2,"N",1
"Fetuin","648.2","671.2","4","0","0","0",1,"y",6,"243.2","positive",NULL,6,2,"N",1
"Fetuin","656.2","679.2","1","1","0","1",1,"y",1,"246.3","positive",NULL,1,2,"N",1
"Fetuin","689.2","712.2","3","1","0","0",1,"y",3,"252.3","positive",NULL,3,2,"N",1
"Fetuin","689.2","712.2","3","1","0","0",1,"y",6,"253.8","positive",NULL,6,2,"N",1
"Fetuin","689.2","712.2","3","1","0","0",1,"y",1,"254.4","positive",NULL,1,2,"N",1
"Fetuin","689.2","712.2","3","1","0","0",1,"y",5,"255.6","positive",NULL,5,2,"N",1
"Fetuin","689.2","712.2","3","1","0","0",1,"y",2,"256.5","positive",NULL,2,2,"N",1
"Fetuin","689.2","712.2","3","1","0","0",1,"y",4,"257.5","positive",NULL,4,2,"N",1
"Fetuin","707.2","730.2","3","1","0","0",1,"y",3,"250.1","positive",NULL,3,2,"N",1
"Fetuin","707.2","730.2","3","1","0","0",1,"y",6,"262.9","positive",NULL,6,2,"N",1
"Fetuin","707.2","730.2","3","1","0","0",1,"y",5,"265.8","positive",NULL,5,2,"N",1
"Fetuin","730.2","753.2","2","2","0","0",1,"y",3,"260.9","positive",NULL,3,2,"N",1
"Fetuin","730.2","753.2","2","2","0","0",1,"y",6,"262.3","positive",NULL,6,2,"N",1
"Fetuin","730.2","753.2","2","2","0","0",1,"y",2,"262.5","positive",NULL,2,2,"N",1
"Fetuin","730.2","753.2","2","2","0","0",1,"y",5,"267.2","positive",NULL,5,2,"N",1
"Fetuin","748.3","771.3","2","2","0","0",1,"y",3,"265.3","positive",NULL,3,2,"N",1
"Fetuin","748.3","771.3","2","2","0","0",1,"y",2,"265.3","positive",NULL,2,2,"N",1
"Fetuin","748.3","771.3","2","2","0","0",1,"y",1,"266.6","positive",NULL,1,2,"N",1
"Fetuin","748.3","771.3","2","2","0","0",1,"y",5,"267.7","positive",NULL,5,2,"N",1
"Fetuin","748.3","771.3","2","2","0","0",1,"y",4,"267.7","positive",NULL,4,2,"N",1
"Fetuin","748.3","771.3","2","2","0","0",1,"y",6,"268.4","positive",NULL,6,2,"N",1
"Fetuin","771.3","794.3","1","3","0","0",1,"y",3,"261.9","positive",NULL,3,2,"N",1
"Fetuin","789.3","812.3","1","3","0","0",1,"y",3,"268","positive",NULL,3,2,"N",1
"Fetuin","810.3","833.3","5","0","0","0",1,"y",4,"268.6","positive",NULL,4,2,"N",1
"Fetuin","810.3","833.3","5","0","0","0",1,"y",6,"273.2","positive",NULL,6,2,"N",1
"Fetuin","810.3","833.3","5","0","0","0",1,"y",5,"274","positive",NULL,5,2,"N",1
"Fetuin","828.3","851.3","5","0","0","0",1,"y",6,"275.8","positive",NULL,6,2,"N",1
"Fetuin","828.3","851.3","5","0","0","0",1,"y",5,"276.1","positive",NULL,5,2,"N",1
"Fetuin","851.3","874.3","4","1","0","0",1,"y",6,"281","positive",NULL,6,2,"N",1
"Fetuin","851.3","874.3","4","1","0","0",1,"y",4,"283.3","positive",NULL,4,2,"N",1
"Fetuin","851.3","874.3","4","1","0","0",1,"y",5,"289","positive",NULL,5,2,"N",1
"Fetuin","869.3","892.3","4","1","0","0",1,"y",4,"278.1","positive",NULL,4,2,"N",1
"Fetuin","869.3","892.3","4","1","0","0",1,"y",6,"288.7","positive",NULL,6,2,"N",1
"Fetuin","869.3","892.3","4","1","0","0",1,"y",5,"303.5","positive",NULL,5,2,"N",1
"Fetuin","892.3","915.3","3","2","0","0",1,"y",3,"292.4","positive",NULL,3,2,"N",1
"Fetuin","910.3","933.3","3","2","0","0",1,"y",1,"285.4","positive",NULL,1,2,"N",1
"Fetuin","910.3","933.3","3","2","0","0",1,"y",2,"285.6","positive",NULL,2,2,"N",1
"Fetuin","910.3","933.3","3","2","0","0",1,"y",4,"291.7","positive",NULL,4,2,"N",1
"Fetuin","910.3","933.3","3","2","0","0",1,"y",6,"293.6","positive",NULL,6,2,"N",1
"Fetuin","910.3","933.3","3","2","0","0",1,"y",5,"297.8","positive",NULL,5,2,"N",1
"Fetuin","910.3","933.3","3","2","0","0",1,"y",3,"298","positive",NULL,3,2,"N",1
"Fetuin","972.3","995.3","6","0","0","0",1,"y",4,"305.3","positive",NULL,4,2,"N",1
"Fetuin","1013.3","1036.3","5","1","0","0",1,"y",3,"313.3","positive",NULL,3,2,"N",1
"Fetuin","1013.3","1036.3","5","1","0","0",1,"y",4,"315","positive",NULL,4,2,"N",1
"Fetuin","1013.3","1036.3","5","1","0","0",1,"y",6,"317.5","positive",NULL,6,2,"N",1
"Fetuin","1013.3","1036.3","5","1","0","0",1,"y",5,"319.6","positive",NULL,5,2,"N",1
"Fetuin","1031.3","1054.3","5","1","0","0",1,"n",4,"317.9","positive",NULL,4,2,"N",1
"Fetuin","1031.3","1054.3","5","1","0","0",1,"n",5,"321.5","positive",NULL,5,2,"N",1
"Fetuin","1031.3","1054.3","5","1","0","0",1,"n",6,"323.5","positive",NULL,6,2,"N",1
"Fetuin","1054.4","1077.4","4","2","0","0",1,"y",5,"314.1","positive",NULL,5,2,"N",1
"Fetuin","1054.4","1077.4","4","2","0","0",1,"y",2,"314.9","positive",NULL,2,2,"N",1
"Fetuin","1054.4","1077.4","4","2","0","0",1,"y",6,"316.7","positive",NULL,6,2,"N",1
"Fetuin","1056.4","1079.4","3","2","1","0",1,"n",5,"318.3","positive",NULL,5,2,"N",1
"Fetuin","1056.4","1079.4","3","2","1","0",1,"n",6,"318.8","positive",NULL,6,2,"N",1
"Fetuin","1072.4","1095.4","4","2","0","0",1,"y",4,"321.3","positive","y",4,2,"N",1
"Fetuin","1072.4","1095.4","4","2","0","0",1,"y",6,"321.9","positive","y",6,2,"N",1
"Fetuin","1072.4","1095.4","4","2","0","0",1,"y",5,"326.4","positive","y",5,2,"N",1
"Fetuin","1095.4","1118.4","3","3","0","0",1,"y",3,"322.3","positive",NULL,3,2,"N",1
"Fetuin","1095.4","1118.4","3","3","0","0",1,"y",2,"322.6","positive",NULL,2,2,"N",1
"Fetuin","1113.4","1136.4","3","3","0","0",1,"y",2,"325.2","positive",NULL,2,2,"N",1
"Fetuin","1113.4","1136.4","3","3","0","0",1,"y",1,"325.8","positive",NULL,1,2,"N",1
"Fetuin","1113.4","1136.4","3","3","0","0",1,"y",5,"326","positive",NULL,5,2,"N",1
"Fetuin","1113.4","1136.4","3","3","0","0",1,"y",6,"326.6","positive",NULL,6,2,"N",1
"Fetuin","1113.4","1136.4","3","3","0","0",1,"y",3,"328","positive","y",3,2,"N",1
"Fetuin","1113.4","1136.4","3","3","0","0",1,"y",4,"330.1","positive",NULL,4,2,"N",1
"Fetuin","1134.4","1157.4","7","0","0","0",1,"n",5,"338.5","positive",NULL,5,2,"N",1
"Fetuin","1134.4","1157.4","7","0","0","0",1,"n",6,"342.1","positive",NULL,6,2,"N",1
"Fetuin","1175.4","1198.4","6","1","0","0",1,"n",4,"340.9","positive",NULL,4,2,"N",1
"Fetuin","1175.4","1198.4","6","1","0","0",1,"n",5,"343","positive",NULL,5,2,"N",1
"Fetuin","1175.4","1198.4","6","1","0","0",1,"n",6,"344.8","positive",NULL,6,2,"N",1
"Fetuin","1175.4","1198.4","6","1","0","0",1,"n",3,"345.8","positive",NULL,3,2,"N",1
"Fetuin","1193.4","1216.4","6","1","0","0",1,"n",4,"345.8","positive",NULL,4,2,"N",1
"Fetuin","1193.4","1216.4","6","1","0","0",1,"n",5,"347.7","positive",NULL,5,2,"N",1
"Fetuin","1193.4","1216.4","6","1","0","0",1,"n",6,"348.7","positive",NULL,6,2,"N",1
"Fetuin","1216.4","1239.4","5","2","0","0",1,"n",5,"337.6","positive",NULL,5,2,"N",1
"Fetuin","1216.4","1239.4","5","2","0","0",1,"n",2,"339.6","positive",NULL,2,2,"N",1
"Fetuin","1216.4","1239.4","5","2","0","0",1,"n",1,"339.9","positive",NULL,1,2,"N",1
"Fetuin","1216.4","1239.4","5","2","0","0",1,"n",6,"341","positive",NULL,6,2,"N",1
"Fetuin","1216.4","1239.4","5","2","0","0",1,"y",4,"347.8","positive",NULL,4,2,"N",1
"Fetuin","1234.4","1257.4","5","2","0","0",1,"n",2,"344.3","positive",NULL,2,2,"N",1
"Fetuin","1234.4","1257.4","5","2","0","0",1,"y",4,"348.9","positive","y",4,2,"N",1
"Fetuin","1234.4","1257.4","5","2","0","0",1,"n",1,"352","positive",NULL,1,2,"N",1
"Fetuin","1234.4","1257.4","5","2","0","0",1,"y",6,"355.7","positive","y",6,2,"N",1
"Fetuin","1234.4","1257.4","5","2","0","0",1,"y",5,"356.5","positive","y",5,2,"N",1
"Fetuin","1234.4","1257.4","5","2","0","0",1,"y",3,"358","positive","y",3,2,"N",1
"Fetuin","1257.4","1280.4","4","3","0","0",1,"y",2,"343.9","positive",NULL,2,2,"N",1
"Fetuin","1257.4","1280.4","4","3","0","0",1,"y",3,"346.7","positive",NULL,3,2,"N",1
"Fetuin","1259.5","1282.5","3","3","0","0",1,"n",6,"343.4","positive","y",6,2,"N",1
"Fetuin","1259.5","1282.5","3","3","0","0",1,"n",5,"353.2","positive","y",5,2,"N",1
"Fetuin","1275.5","1298.5","4","3","0","0",1,"y",6,"346.5","positive","y",6,2,"N",1
"Fetuin","1275.5","1298.5","4","3","0","0",1,"y",3,"347.8","positive","y",3,2,"N",1
"Fetuin","1275.5","1298.5","4","3","0","0",1,"y",2,"348.8","positive",NULL,2,2,"N",1
"Fetuin","1275.5","1298.5","4","3","0","0",1,"y",1,"351.6","positive",NULL,1,2,"N",1
"Fetuin","1275.5","1298.5","4","3","0","0",1,"y",5,"354.8","positive","y",5,2,"N",1
"Fetuin","1316.5","1339.5","3","4","0","0",1,"y",3,"360.7","positive","y",3,2,"N",1
"Fetuin","1316.5","681.3","3","4","0","0",2,"n",3,"362.3","positive","y",3,2,"N",1
"Fetuin","1337.4","1360.4","7","1","0","0",1,"n",6,"362.6","positive",NULL,6,2,"N",1
"Fetuin","1337.4","1360.4","7","1","0","0",1,"n",5,"370.3","positive",NULL,5,2,"N",1
"Fetuin","1378.5","1401.5","6","2","0","0",1,"n",4,"382.3","positive",NULL,4,2,"N",1
"Fetuin","1396.5","1419.5","6","2","0","0",1,"n",6,"373.1","positive","y",6,2,"N",1
"Fetuin","1396.5","1419.5","6","2","0","0",1,"n",3,"376.4","positive","y",3,2,"N",1
"Fetuin","1396.5","1419.5","6","2","0","0",1,"n",4,"378.9","positive","y",4,2,"N",1
"Fetuin","1396.5","1419.5","6","2","0","0",1,"n",5,"382.2","positive","y",5,2,"N",1
"Fetuin","1419.5","1442.5","5","3","0","0",1,"n",2,"367.1","positive",NULL,2,2,"N",1
"Fetuin","1419.5","1442.5","5","3","0","0",1,"n",6,"368.4","positive",NULL,6,2,"N",1
"Fetuin","1419.5","1442.5","5","3","0","0",1,"n",5,"372.9","positive",NULL,5,2,"N",1
"Fetuin","1421.5","1444.5","4","3","1","",1,"y",6,"373.7","positive","y",6,2,"N",1
"Fetuin","1421.5","1444.5","4","3","1","",1,"y",5,"376.5","positive","y",5,2,"N",1
"Fetuin","1437.5","1460.5","5","3","0","0",1,"n",5,"366.6","positive","y",5,2,"N",1
"Fetuin","1437.5","1460.5","5","3","0","0",1,"n",2,"368.9","positive",NULL,2,2,"N",1
"Fetuin","1437.5","1460.5","5","3","0","0",1,"n",6,"369","positive","y",6,2,"N",1
"Fetuin","1437.5","1460.5","5","3","0","0",1,"n",3,"376.7","positive","y",3,2,"N",1
"Fetuin","1460.5","1483.5","4","4","0","0",1,"y",3,"377.7","positive",NULL,3,2,"N",1
"Fetuin","1460.5","1483.5","4","4","0","0",1,"y",2,"377.9","positive",NULL,2,2,"N",1
"Fetuin","1462.5","1485.5","3","4","1","",1,"n",5,"378.3","positive","y",5,2,"N",1
"Fetuin","1462.5","1485.5","3","4","1","",1,"n",6,"380.9","positive","y",6,2,"N",1
"Fetuin","1478.5","1501.5","4","4","0","0",1,"y",1,"370.5","positive",NULL,1,2,"N",1
"Fetuin","1478.5","1501.5","4","4","0","0",1,"y",2,"377.5","positive",NULL,2,2,"N",1
"Fetuin","1478.5","1501.5","4","4","0","0",1,"n",6,"377.7","positive","y",6,2,"N",1
"Fetuin","1478.5","1501.5","4","4","0","0",1,"n",5,"381.4","positive","y",5,2,"N",1
"Fetuin","1478.5","1501.5","4","4","0","0",1,"n",3,"387.1","positive","y",3,2,"N",1
"Fetuin","1478.6","762.3","4","4","0","0",2,"y",3,"379.1","positive","y",3,2,"N",1
"Fetuin","1499.5","1522.5","8","1","0","0",1,"n",6,"390","positive",NULL,6,2,"N",1
"Fetuin","1499.5","1522.5","8","1","0","0",1,"n",5,"390.9","positive",NULL,5,2,"N",1
"Fetuin","1501.5","1524.5","3","5","0","0",1,"n",3,"390.9","positive",NULL,3,2,"N",1
"Fetuin","1517.5","1540.5","8","1","0","0",1,"n",4,"377.1","positive",NULL,4,2,"N",1
"Fetuin","1517.5","1540.5","8","1","0","0",1,"n",6,"386.1","positive",NULL,6,2,"N",1
"Fetuin","1517.5","1540.5","8","1","0","0",1,"n",5,"392.8","positive",NULL,5,2,"N",1
"Fetuin","1519.6","782.8","3","5","0","0",2,"y",3,"390.5","positive","y",3,2,"N",1
"Fetuin","1519.6","1542.6","3","5","0","0",1,"n",3,"394.9","positive","y",3,2,"N",1
"Fetuin","1540.5","1563.5","7","2","0","0",1,"y",4,"390.7","positive",NULL,4,2,"N",1
"Fetuin","1540.5","1563.5","7","2","0","0",1,"y",6,"393.8","positive",NULL,6,2,"N",1
"Fetuin","1540.5","1563.5","7","2","0","0",1,"y",5,"394.2","positive",NULL,5,2,"N",1
"Fetuin","1558.5","1581.5","7","2","0","0",1,"y",6,"394.7","positive","y",6,2,"N",1
"Fetuin","1558.5","1581.5","7","2","0","0",1,"y",5,"398.9","positive","y",5,2,"N",1
"Fetuin","1558.5","1581.5","7","2","0","0",1,"y",4,"399","positive","y",4,2,"N",1
"Fetuin","1558.6","802.3","7","2","0","0",2,"y",4,"355.9","positive","y",4,2,"N",1
"Fetuin","1581.5","1604.5","6","3","0","0",1,"?",4,"406.3","positive",NULL,4,2,"N",1
"Fetuin","1583.6","1606.6","5","3","1","0",1,"n",6,"398.4","positive","y",6,2,"N",1
"Fetuin","1583.6","1606.6","5","3","1","0",1,"n",5,"404.1","positive","y",5,2,"N",1
"Fetuin","1599.6","1622.6","6","3","0","0",1,"n",6,"409.8","positive","y",6,2,"N",1
"Fetuin","1599.6","1622.6","6","3","0","0",1,"n",5,"413.2","positive","y",5,2,"N",1
"Fetuin","1599.6","1622.6","6","3","0","0",1,"n",3,"418.5","positive","y",3,2,"N",1
"Fetuin","1600.4","1623.4","6","3","0","0",1,"?",4,"413.4","positive",NULL,4,2,"N",1
"Fetuin","1622.6","1645.6","5","4","0","0",1,"n",1,"394.4","positive",NULL,1,2,"N",1
"Fetuin","1622.6","1645.6","5","4","0","0",1,"n",2,"394.7","positive",NULL,2,2,"N",1
"Fetuin","1624.6","835.3","4","4 + fuc","1","0",2,"y",5,"396.8","positive","y",5,2,"N",1
"Fetuin","1624.6","835.3","4","4 + fuc","1","0",2,"y",6,"400.1","positive","y",6,2,"N",1
"Fetuin","1624.6","1647.6","4","4","1","0",1,"n",6,"409.3","positive","y",6,2,"N",1
"Fetuin","1624.6","1647.6","4","4","1","0",1,"n",5,"413","positive","y",5,2,"N",1
"Fetuin","1640.6","1663.6","5","4","0","0",1,"n",4,"397.5","positive",NULL,4,2,"N",1
"Fetuin","1640.6","1663.6","5","4","0","0",1,"n",5,"397.9","positive","y",5,2,"N",1
"Fetuin","1640.6","1663.6","5","4","0","0",1,"n",2,"400.5","positive","y",2,2,"N",1
"Fetuin","1640.6","843.3","5","4","0","0",2,"n",6,"401.9","positive","y",6,2,"N",1
"Fetuin","1640.6","843.3","5","4","0","0",2,"n",2,"404.3","positive","y",2,2,"N",1
"Fetuin","1640.6","1663.6","5","4","0","0",1,"n",6,"406.9","positive","y",6,2,"N",1
"Fetuin","1640.6","843.3","5","4","0","0",2,"n",3,"407.6","positive","y",3,2,"N",1
"Fetuin","1640.6","843.3","5","4","0","0",2,"n",5,"412.8","positive","y",5,2,"N",1
"Fetuin","1640.6","1663.6","5","4","0","0",1,"n",3,"423.1","positive","y",3,2,"N",1
"Fetuin","1661.5","1684.5","9","1","0","0",1,"n",5,"412.5","positive",NULL,5,2,"N",1
"Fetuin","1661.5","1684.5","9","1","0","0",1,"n",6,"418.3","positive",NULL,6,2,"N",1
"Fetuin","1663.6","1686.6","4","5","0","0",1,"y",3,"424.6","positive",NULL,3,2,"N",1
"Fetuin","1681.6","1704.6","4","5","0","0",1,"y",3,"435.3","positive","y",3,2,"N",1
"Fetuin","1704.6","1727.6","3","6","0","0",1,"y",3,"443.1","positive",NULL,3,2,"N",1
"Fetuin","1720.6","883.3","8","2","0","0",2,"n",4,"381.4","positive","y",4,2,"N",1
"Fetuin","1720.6","883.3","8","2","0","0",2,"n",5,"420.2","positive","y",5,2,"N",1
"Fetuin","1720.6","883.3","8","2","0","0",2,"n",6,"424.4","positive","y",6,2,"N",1
"Fetuin","1720.6","1743.6","8","2","0","0",1,"n",4,"425.4","positive","y",4,2,"N",1
"Fetuin","1720.6","1743.6","8","2","0","0",1,"n",5,"426.1","positive","y",5,2,"N",1
"Fetuin","1720.6","1743.6","8","2","0","0",1,"n",6,"427.8","positive","y",6,2,"N",1
"Fetuin","1722.6","884.3","3","6","0","0",2,"n",3,"422.6","positive","y",3,2,"N",1
"Fetuin","1722.6","1745.6","3","6","0","0",1,"n",3,"442.6","positive","y",3,2,"N",1
"Fetuin","1744.6","895.3","6","3 + fuc","1","0",2,"y",6,"412.6","positive","y",6,2,"N",1
"Fetuin","1744.6","895.3","6","3 + fuc","1","0",2,"y",5,"418.6","positive","y",5,2,"N",1
"Fetuin","1784.6","1807.6","6","4","0","0",1,"y",2,"416.1","positive",NULL,2,2,"N",1
"Fetuin","1784.6","915.3","6","4","0","0",2,"n",2,"432.1","positive",NULL,2,2,"N",1
"Fetuin","1786.6","916.3","5","4+fuc","1","0",2,"y",5,"421.3","positive","y",5,2,"N",1
"Fetuin","1786.6","916.3","5","4+fuc","1","0",2,"y",6,"424.4","positive","y",6,2,"N",1
"Fetuin","1786.6","1809.6","5","4","1","0",1,"y",6,"428.9","positive","y",6,2,"N",1
"Fetuin","1786.6","1809.6","5","4","1","0",1,"y",5,"434.7","positive","y",5,2,"N",1
"Fetuin","1792.6","1815.6","3","5","0","1",1,"y",1,"427.5","positive",NULL,1,2,"N",1
"Fetuin","1802.6","1825.6","6","4","0","0",1,"y",5,"426.9","positive","y",5,2,"N",1
"Fetuin","1802.6","1825.6","6","4","0","0",1,"y",6,"432.7","positive","y",6,2,"N",1
"Fetuin","1802.6","924.3","6","4","0","0",2,"y",2,"434.1","positive","y",2,2,"N",1
"Fetuin","1825.7","1848.7","5","5","0","0",1,"y",3,"467.6","positive",NULL,3,2,"N",1
"Fetuin","1843.7","1866.7","5","5","0","0",1,"y",2,"430.2","positive",NULL,2,2,"N",1
"Fetuin","1843.7","1866.7","5","5","0","0",1,"y",1,"431.6","positive",NULL,1,2,"N",1
"Fetuin","1843.7","1866.7","5","5","0","0",1,"y",5,"433.8","positive","y",5,2,"N",1
"Fetuin","1843.7","944.9","5","5","0","0",2,"n",2,"434.2","positive","y",2,2,"N",1
"Fetuin","1843.7","1866.7","5","5","0","0",1,"y",6,"441.5","positive","y",6,2,"N",1
"Fetuin","1843.7","1866.7","5","5","0","0",1,"n",3,"468.3","positive","y",3,2,"N",1
"Fetuin","1866.7","1889.7","4","6","0","0",1,"y",3,"470.5","positive",NULL,3,2,"N",1
"Fetuin","1882.6","964.3","9","2","0","0",2,"n",5,"441","positive","y",5,2,"N",1
"Fetuin","1882.6","964.3","9","2","0","0",2,"n",6,"441.7","positive","y",6,2,"N",1
"Fetuin","1882.6","1905.6","9","2","0","0",1,"n",6,"450.8","positive","y",6,2,"N",1
"Fetuin","1882.6","1905.6","9","2","0","0",1,"n",5,"452.8","positive","y",5,2,"N",1
"Fetuin","1882.6","1905.6","9","2","0","0",1,"n",4,"461.6","positive","y",4,2,"N",1
"Fetuin","1884.7","1907.7","4","6","0","0",1,"y",3,"449.7","positive","y",3,2,"N",1
"Fetuin","1925.7","1948.7","3","7","0","0",1,"y",3,"460.9","positive","y",3,2,"N",1
"Fetuin","1925.8","985.9","3","7","0","0",2,"n",3,"448.7","positive","y",3,2,"N",1
"Fetuin","1931.7","1954.7","5","4","0","1",1,"y",2,"436.5","positive","y",2,2,"N",1
"Fetuin","1932.6","989.3","5","4","2","0",2,"y",5,"451.4","positive","y",5,2,"N",1
"Fetuin","1932.6","989.3","5","4","2","0",2,"y",6,"452.4","positive","y",6,2,"N",1
"Fetuin","1948.6","997.3","6","4","1","0",2,"n",6,"440.5","positive","y",6,2,"N",1
"Fetuin","1948.6","997.3","6","4","1","0",2,"n",5,"443.7","positive","y",5,2,"N",1
"Fetuin","1948.6","1971.6","6","4","0","1",1,"y",6,"445.4","positive","y",6,2,"N",1
"Fetuin","1948.6","1971.6","6","4","0","1",1,"y",5,"457.8","positive","y",5,2,"N",1
"Fetuin","1953.6","999.8","5","4","0","1(Na)",2,"n",1,"433.6","positive","y",1,2,"N",1
"Fetuin","1953.6","1976.6","5","4","0","1(Na)",1,"y",1,"437.4","positive","y",1,2,"N",1
"Fetuin","1987.7","2010.7","6","5","0","0",1,"n",2,"455.3","positive",NULL,2,2,"N",1
"Fetuin","1989.7","2012.7","5","5","0","1",1,"y",5,"474","positive","y",5,2,"N",1
"Fetuin","1989.7","2012.7","5","5","0","1",1,"y",6,"475.8","positive","y",6,2,"N",1
"Fetuin","1989.8","1017.9","5","5","1","0",2,"y",6,"455.3","positive","y",6,2,"N",1
"Fetuin","1989.8","1017.9","5","5","1","0",2,"y",5,"456.4","positive","y",5,2,"N",1
"Fetuin","2005.7","2028.7","6","5","0","0",1,"n",1,"440.7","positive","y",1,2,"N",1
"Fetuin","2005.7","2028.7","6","5","0","0",1,"n",2,"451.4","positive","y",2,2,"N",1
"Fetuin","2005.7","1025.9","6","5","0","0",2,"n",2,"464.9","positive","y",2,2,"N",1
"Fetuin","2046.8","1046.4","5","6","0","0",2,"y",2,"461.2","positive","y",2,2,"N",1
"Fetuin","2069.8","1057.9","4","7","0","0",2,"y",3,"470.6","positive",NULL,3,2,"N",1
"Fetuin","2087.6","1066.8","4","7","0","0",2,"y",3,"470.3","positive","y",3,2,"N",1
"Fetuin","2094.8","1070.4","6","4","2","0",2,"y",5,"471.4","positive","y",5,2,"N",1
"Fetuin","2094.8","1070.4","6","4","2","0",2,"y",6,"474.8","positive","y",6,2,"N",1
"Fetuin","2124.8","2147.8","6","5","0","1",1,"y",6,"475.9","positive","y",6,2,"N",1
"Fetuin","2124.8","2147.8","6","5","0","1",1,"y",5,"489.1","positive","y",5,2,"N",1
"Fetuin","2128.8","1087.4","3","8","0","0",2,"n",3,"479","positive","y",3,2,"N",1
"Fetuin","2151.8","1098.9","6","5","1","0",2,"y",5,"473.5","positive","y",5,2,"N",1
"Fetuin","2151.8","1098.9","6","5","1","0",2,"y",6,"474.4","positive","y",6,2,"N",1
"Fetuin","2194.8","1120.4","5","6","1","0",2,"y",5,"478.6","positive","y",5,2,"N",1
"Fetuin","2194.8","1120.4","5","6","1","0",2,"y",6,"482.9","positive","y",6,2,"N",1
"Fetuin","2266.8","1156.4","5","4","0","2(Na)",2,"n",1,"475.3","positive","y",1,2,"N",1
"Fetuin","2278.8","1162.4","6","5","0","1",2,"y",2,"492.7","positive",NULL,2,2,"N",1
"Fetuin","2290.8","1168.4","4","8","0","0",2,"y",3,"499.6","positive","y",3,2,"N",1
"Fetuin","2296.8","1171.4","6","5","0","1",2,"y",2,"488.7","positive","y",2,2,"N",1
"Fetuin","2313.8","1179.9","7","5","1","0",2,"y",5,"498.2","positive","y",5,2,"N",1
"Fetuin","2313.8","1179.9","7","5","1","0",2,"y",6,"505.3","positive","y",6,2,"N",1
"Fetuin","2318.8","1182.4","6","5","0","1(Na)",2,"y",1,"487.3","positive","y",1,2,"N",1
"Fetuin","2318.8","1182.4","6","5","0","1(Na)",2,"y",2,"490.6","positive","y",2,2,"N",1
"Fetuin","2361.8","1203.9","5","6","0","1(Na)",2,"y",2,"497.1","positive","y",2,2,"N",1
"Fetuin","2631.8","1338.9","6","5","0","2(Na)",2,"y",2,"526.7","positive","y",2,2,"N",1
"Fetuin","2631.8","1338.9","6","5","0","2(Na)",2,"y",1,"536.5","positive","y",1,2,"N",1
"Fetuin","2945","1495.5","6","5","0","3(Na)",2,"y",1,"556.2","positive","y",1,2,"N",1
