comment,description,uniprot,pmid,id
,,http://purl.uniprot.org/uniprot/P00738,6327299,7436
,,http://purl.uniprot.org/uniprot/P00738,6327299,7485
,,http://purl.uniprot.org/uniprot/P00738,6327299,7711
,,http://purl.uniprot.org/uniprot/P00738,6327299,7483
,,http://purl.uniprot.org/uniprot/P00738,6327299,7707
,,http://purl.uniprot.org/uniprot/P00738,6327299,7428
,,http://purl.uniprot.org/uniprot/P00738,6327299,7861
,,http://purl.uniprot.org/uniprot/P00738,6327299,7699
,,http://purl.uniprot.org/uniprot/P00738,2040277,7436
,,http://purl.uniprot.org/uniprot/P00738,2040277,7485
,,http://purl.uniprot.org/uniprot/P00738,2040277,7711
,,http://purl.uniprot.org/uniprot/P00738,2040277,7483
,,http://purl.uniprot.org/uniprot/P00738,2040277,7707
,,http://purl.uniprot.org/uniprot/P00738,2040277,7428
,,http://purl.uniprot.org/uniprot/P00738,2040277,7861
,,http://purl.uniprot.org/uniprot/P00738,2040277,7699
,,http://purl.uniprot.org/uniprot/P00738,7635154,7436
,,http://purl.uniprot.org/uniprot/P00738,7635154,7485
,,http://purl.uniprot.org/uniprot/P00738,7635154,7711
,,http://purl.uniprot.org/uniprot/P00738,7635154,7483
,,http://purl.uniprot.org/uniprot/P00738,7635154,7707
,,http://purl.uniprot.org/uniprot/P00738,7635154,7428
,,http://purl.uniprot.org/uniprot/P00738,7635154,7861
,,http://purl.uniprot.org/uniprot/P00738,7635154,7699
,,http://purl.uniprot.org/uniprot/P00738,7635155,7436
,,http://purl.uniprot.org/uniprot/P00738,7635155,7485
,,http://purl.uniprot.org/uniprot/P00738,7635155,7711
,,http://purl.uniprot.org/uniprot/P00738,7635155,7483
,,http://purl.uniprot.org/uniprot/P00738,7635155,7707
,,http://purl.uniprot.org/uniprot/P00738,7635155,7428
,,http://purl.uniprot.org/uniprot/P00738,7635155,7861
,,http://purl.uniprot.org/uniprot/P00738,7635155,7699
,,http://purl.uniprot.org/uniprot/P00738,9376680,7436
,,http://purl.uniprot.org/uniprot/P00738,9376680,7485
,,http://purl.uniprot.org/uniprot/P00738,9376680,7711
,,http://purl.uniprot.org/uniprot/P00738,9376680,7483
,,http://purl.uniprot.org/uniprot/P00738,9376680,7707
,,http://purl.uniprot.org/uniprot/P00738,9376680,7428
,,http://purl.uniprot.org/uniprot/P00738,9376680,7861
,,http://purl.uniprot.org/uniprot/P00738,9376680,7699
,,http://purl.uniprot.org/uniprot/P00738,9530955,7436
,,http://purl.uniprot.org/uniprot/P00738,9530955,7485
,,http://purl.uniprot.org/uniprot/P00738,9530955,7711
,,http://purl.uniprot.org/uniprot/P00738,9530955,7483
,,http://purl.uniprot.org/uniprot/P00738,9530955,7707
,,http://purl.uniprot.org/uniprot/P00738,9530955,7428
,,http://purl.uniprot.org/uniprot/P00738,9530955,7861
,,http://purl.uniprot.org/uniprot/P00738,9530955,7699
,,http://purl.uniprot.org/uniprot/P00738,9076522,7436
,,http://purl.uniprot.org/uniprot/P00738,9076522,7485
,,http://purl.uniprot.org/uniprot/P00738,9076522,7711
,,http://purl.uniprot.org/uniprot/P00738,9076522,7483
,,http://purl.uniprot.org/uniprot/P00738,9076522,7707
,,http://purl.uniprot.org/uniprot/P00738,9076522,7428
,,http://purl.uniprot.org/uniprot/P00738,9076522,7861
,,http://purl.uniprot.org/uniprot/P00738,9076522,7699
,,http://purl.uniprot.org/uniprot/P00738,8436110,7436
,,http://purl.uniprot.org/uniprot/P00738,8436110,7485
,,http://purl.uniprot.org/uniprot/P00738,8436110,7711
,,http://purl.uniprot.org/uniprot/P00738,8436110,7483
,,http://purl.uniprot.org/uniprot/P00738,8436110,7707
,,http://purl.uniprot.org/uniprot/P00738,8436110,7428
,,http://purl.uniprot.org/uniprot/P00738,8436110,7861
,,http://purl.uniprot.org/uniprot/P00738,8436110,7699
,,http://purl.uniprot.org/uniprot/P00738,1323463,7436
,,http://purl.uniprot.org/uniprot/P00738,1323463,7485
,,http://purl.uniprot.org/uniprot/P00738,1323463,7711
,,http://purl.uniprot.org/uniprot/P00738,1323463,7483
,,http://purl.uniprot.org/uniprot/P00738,1323463,7707
,,http://purl.uniprot.org/uniprot/P00738,1323463,7428
,,http://purl.uniprot.org/uniprot/P00738,1323463,7861
,,http://purl.uniprot.org/uniprot/P00738,1323463,7699
,,http://purl.uniprot.org/uniprot/P00738,2001693,7436
,,http://purl.uniprot.org/uniprot/P00738,2001693,7485
,,http://purl.uniprot.org/uniprot/P00738,2001693,7711
,,http://purl.uniprot.org/uniprot/P00738,2001693,7483
,,http://purl.uniprot.org/uniprot/P00738,2001693,7707
,,http://purl.uniprot.org/uniprot/P00738,2001693,7428
,,http://purl.uniprot.org/uniprot/P00738,2001693,7861
,,http://purl.uniprot.org/uniprot/P00738,2001693,7699
,,http://purl.uniprot.org/uniprot/P00738,3967649,7436
,,http://purl.uniprot.org/uniprot/P00738,3967649,7485
,,http://purl.uniprot.org/uniprot/P00738,3967649,7711
,,http://purl.uniprot.org/uniprot/P00738,3967649,7483
,,http://purl.uniprot.org/uniprot/P00738,3967649,7707
,,http://purl.uniprot.org/uniprot/P00738,3967649,7428
,,http://purl.uniprot.org/uniprot/P00738,3967649,7861
,,http://purl.uniprot.org/uniprot/P00738,3967649,7699
,,http://purl.uniprot.org/uniprot/P00738,8631363,7436
,,http://purl.uniprot.org/uniprot/P00738,8631363,7485
,,http://purl.uniprot.org/uniprot/P00738,8631363,7711
,,http://purl.uniprot.org/uniprot/P00738,8631363,7483
,,http://purl.uniprot.org/uniprot/P00738,8631363,7707
,,http://purl.uniprot.org/uniprot/P00738,8631363,7428
,,http://purl.uniprot.org/uniprot/P00738,8631363,7861
,,http://purl.uniprot.org/uniprot/P00738,8631363,7699
,,http://purl.uniprot.org/uniprot/P00738,8034632,7436
,,http://purl.uniprot.org/uniprot/P00738,8034632,7485
,,http://purl.uniprot.org/uniprot/P00738,8034632,7711
,,http://purl.uniprot.org/uniprot/P00738,8034632,7483
,,http://purl.uniprot.org/uniprot/P00738,8034632,7707
,,http://purl.uniprot.org/uniprot/P00738,8034632,7428
,,http://purl.uniprot.org/uniprot/P00738,8034632,7861
,,http://purl.uniprot.org/uniprot/P00738,8034632,7699
,,http://purl.uniprot.org/uniprot/P00738,3345750,7436
,,http://purl.uniprot.org/uniprot/P00738,3345750,7485
,,http://purl.uniprot.org/uniprot/P00738,3345750,7711
,,http://purl.uniprot.org/uniprot/P00738,3345750,7483
,,http://purl.uniprot.org/uniprot/P00738,3345750,7707
,,http://purl.uniprot.org/uniprot/P00738,3345750,7428
,,http://purl.uniprot.org/uniprot/P00738,3345750,7861
,,http://purl.uniprot.org/uniprot/P00738,3345750,7699
,,http://purl.uniprot.org/uniprot/P00738,3345749,7436
,,http://purl.uniprot.org/uniprot/P00738,3345749,7485
,,http://purl.uniprot.org/uniprot/P00738,3345749,7711
,,http://purl.uniprot.org/uniprot/P00738,3345749,7483
,,http://purl.uniprot.org/uniprot/P00738,3345749,7707
,,http://purl.uniprot.org/uniprot/P00738,3345749,7428
,,http://purl.uniprot.org/uniprot/P00738,3345749,7861
,,http://purl.uniprot.org/uniprot/P00738,3345749,7699
,,http://purl.uniprot.org/uniprot/P00738,2040278,7436
,,http://purl.uniprot.org/uniprot/P00738,2040278,7485
,,http://purl.uniprot.org/uniprot/P00738,2040278,7711
,,http://purl.uniprot.org/uniprot/P00738,2040278,7483
,,http://purl.uniprot.org/uniprot/P00738,2040278,7707
,,http://purl.uniprot.org/uniprot/P00738,2040278,7428
,,http://purl.uniprot.org/uniprot/P00738,2040278,7861
,,http://purl.uniprot.org/uniprot/P00738,2040278,7699
,,http://purl.uniprot.org/uniprot/P00738,3665914,7436
,,http://purl.uniprot.org/uniprot/P00738,3665914,7485
,,http://purl.uniprot.org/uniprot/P00738,3665914,7711
,,http://purl.uniprot.org/uniprot/P00738,3665914,7483
,,http://purl.uniprot.org/uniprot/P00738,3665914,7707
,,http://purl.uniprot.org/uniprot/P00738,3665914,7428
,,http://purl.uniprot.org/uniprot/P00738,3665914,7861
,,http://purl.uniprot.org/uniprot/P00738,3665914,7699
,,http://purl.uniprot.org/uniprot/P00738,0,7436
,,http://purl.uniprot.org/uniprot/P00738,0,7485
,,http://purl.uniprot.org/uniprot/P00738,0,7711
,,http://purl.uniprot.org/uniprot/P00738,0,7483
,,http://purl.uniprot.org/uniprot/P00738,0,7707
,,http://purl.uniprot.org/uniprot/P00738,0,7428
,,http://purl.uniprot.org/uniprot/P00738,0,7861
,,http://purl.uniprot.org/uniprot/P00738,0,7699
,,http://purl.uniprot.org/uniprot/P00738,3665919,7436
,,http://purl.uniprot.org/uniprot/P00738,3665919,7485
,,http://purl.uniprot.org/uniprot/P00738,3665919,7711
,,http://purl.uniprot.org/uniprot/P00738,3665919,7483
,,http://purl.uniprot.org/uniprot/P00738,3665919,7707
,,http://purl.uniprot.org/uniprot/P00738,3665919,7428
,,http://purl.uniprot.org/uniprot/P00738,3665919,7861
,,http://purl.uniprot.org/uniprot/P00738,3665919,7699
,,http://purl.uniprot.org/uniprot/P00738,3191509,7436
,,http://purl.uniprot.org/uniprot/P00738,3191509,7485
,,http://purl.uniprot.org/uniprot/P00738,3191509,7711
,,http://purl.uniprot.org/uniprot/P00738,3191509,7483
,,http://purl.uniprot.org/uniprot/P00738,3191509,7707
,,http://purl.uniprot.org/uniprot/P00738,3191509,7428
,,http://purl.uniprot.org/uniprot/P00738,3191509,7861
,,http://purl.uniprot.org/uniprot/P00738,3191509,7699
,,http://purl.uniprot.org/uniprot/P00738,8193552,7436
,,http://purl.uniprot.org/uniprot/P00738,8193552,7485
,,http://purl.uniprot.org/uniprot/P00738,8193552,7711
,,http://purl.uniprot.org/uniprot/P00738,8193552,7483
,,http://purl.uniprot.org/uniprot/P00738,8193552,7707
,,http://purl.uniprot.org/uniprot/P00738,8193552,7428
,,http://purl.uniprot.org/uniprot/P00738,8193552,7861
,,http://purl.uniprot.org/uniprot/P00738,8193552,7699
,,http://purl.uniprot.org/uniprot/P04070,9076522,7576
,,http://purl.uniprot.org/uniprot/P04070,9076522,7410
,,http://purl.uniprot.org/uniprot/P04070,9076522,7833
,,http://purl.uniprot.org/uniprot/P04070,9076522,7828
,,http://purl.uniprot.org/uniprot/P04070,9076522,7543
,,http://purl.uniprot.org/uniprot/P04070,9076522,7476
,,http://purl.uniprot.org/uniprot/P04070,9076522,7603
,,http://purl.uniprot.org/uniprot/P04070,9076522,7518
,,http://purl.uniprot.org/uniprot/P04070,9076522,7423
,,http://purl.uniprot.org/uniprot/P04070,9076522,7643
,,http://purl.uniprot.org/uniprot/P04070,9076522,7881
,,http://purl.uniprot.org/uniprot/P04070,9076522,7501
,,http://purl.uniprot.org/uniprot/P04070,9076522,7796
,,http://purl.uniprot.org/uniprot/P04070,9076522,7756
,,http://purl.uniprot.org/uniprot/P04070,9076522,7471
,,http://purl.uniprot.org/uniprot/P04070,9076522,7692
,,http://purl.uniprot.org/uniprot/P04070,3191509,7576
,,http://purl.uniprot.org/uniprot/P04070,3191509,7410
,,http://purl.uniprot.org/uniprot/P04070,3191509,7833
,,http://purl.uniprot.org/uniprot/P04070,3191509,7828
,,http://purl.uniprot.org/uniprot/P04070,3191509,7543
,,http://purl.uniprot.org/uniprot/P04070,3191509,7476
,,http://purl.uniprot.org/uniprot/P04070,3191509,7603
,,http://purl.uniprot.org/uniprot/P04070,3191509,7518
,,http://purl.uniprot.org/uniprot/P04070,3191509,7423
,,http://purl.uniprot.org/uniprot/P04070,3191509,7643
,,http://purl.uniprot.org/uniprot/P04070,3191509,7881
,,http://purl.uniprot.org/uniprot/P04070,3191509,7501
,,http://purl.uniprot.org/uniprot/P04070,3191509,7796
,,http://purl.uniprot.org/uniprot/P04070,3191509,7756
,,http://purl.uniprot.org/uniprot/P04070,3191509,7471
,,http://purl.uniprot.org/uniprot/P04070,3191509,7692
,,http://purl.uniprot.org/uniprot/P04070,8436110,7576
,,http://purl.uniprot.org/uniprot/P04070,8436110,7410
,,http://purl.uniprot.org/uniprot/P04070,8436110,7833
,,http://purl.uniprot.org/uniprot/P04070,8436110,7828
,,http://purl.uniprot.org/uniprot/P04070,8436110,7543
,,http://purl.uniprot.org/uniprot/P04070,8436110,7476
,,http://purl.uniprot.org/uniprot/P04070,8436110,7603
,,http://purl.uniprot.org/uniprot/P04070,8436110,7518
,,http://purl.uniprot.org/uniprot/P04070,8436110,7423
,,http://purl.uniprot.org/uniprot/P04070,8436110,7643
,,http://purl.uniprot.org/uniprot/P04070,8436110,7881
,,http://purl.uniprot.org/uniprot/P04070,8436110,7501
,,http://purl.uniprot.org/uniprot/P04070,8436110,7796
,,http://purl.uniprot.org/uniprot/P04070,8436110,7756
,,http://purl.uniprot.org/uniprot/P04070,8436110,7471
,,http://purl.uniprot.org/uniprot/P04070,8436110,7692
,,http://purl.uniprot.org/uniprot/P04070,8631363,7576
,,http://purl.uniprot.org/uniprot/P04070,8631363,7410
,,http://purl.uniprot.org/uniprot/P04070,8631363,7833
,,http://purl.uniprot.org/uniprot/P04070,8631363,7828
,,http://purl.uniprot.org/uniprot/P04070,8631363,7543
,,http://purl.uniprot.org/uniprot/P04070,8631363,7476
,,http://purl.uniprot.org/uniprot/P04070,8631363,7603
,,http://purl.uniprot.org/uniprot/P04070,8631363,7518
,,http://purl.uniprot.org/uniprot/P04070,8631363,7423
,,http://purl.uniprot.org/uniprot/P04070,8631363,7643
,,http://purl.uniprot.org/uniprot/P04070,8631363,7881
,,http://purl.uniprot.org/uniprot/P04070,8631363,7501
,,http://purl.uniprot.org/uniprot/P04070,8631363,7796
,,http://purl.uniprot.org/uniprot/P04070,8631363,7756
,,http://purl.uniprot.org/uniprot/P04070,8631363,7471
,,http://purl.uniprot.org/uniprot/P04070,8631363,7692
,,http://purl.uniprot.org/uniprot/P04070,1323463,7576
,,http://purl.uniprot.org/uniprot/P04070,1323463,7410
,,http://purl.uniprot.org/uniprot/P04070,1323463,7833
,,http://purl.uniprot.org/uniprot/P04070,1323463,7828
,,http://purl.uniprot.org/uniprot/P04070,1323463,7543
,,http://purl.uniprot.org/uniprot/P04070,1323463,7476
,,http://purl.uniprot.org/uniprot/P04070,1323463,7603
,,http://purl.uniprot.org/uniprot/P04070,1323463,7518
,,http://purl.uniprot.org/uniprot/P04070,1323463,7423
,,http://purl.uniprot.org/uniprot/P04070,1323463,7643
,,http://purl.uniprot.org/uniprot/P04070,1323463,7881
,,http://purl.uniprot.org/uniprot/P04070,1323463,7501
,,http://purl.uniprot.org/uniprot/P04070,1323463,7796
,,http://purl.uniprot.org/uniprot/P04070,1323463,7756
,,http://purl.uniprot.org/uniprot/P04070,1323463,7471
,,http://purl.uniprot.org/uniprot/P04070,1323463,7692
,,http://purl.uniprot.org/uniprot/P04070,2040277,7576
,,http://purl.uniprot.org/uniprot/P04070,2040277,7410
,,http://purl.uniprot.org/uniprot/P04070,2040277,7833
,,http://purl.uniprot.org/uniprot/P04070,2040277,7828
,,http://purl.uniprot.org/uniprot/P04070,2040277,7543
,,http://purl.uniprot.org/uniprot/P04070,2040277,7476
,,http://purl.uniprot.org/uniprot/P04070,2040277,7603
,,http://purl.uniprot.org/uniprot/P04070,2040277,7518
,,http://purl.uniprot.org/uniprot/P04070,2040277,7423
,,http://purl.uniprot.org/uniprot/P04070,2040277,7643
,,http://purl.uniprot.org/uniprot/P04070,2040277,7881
,,http://purl.uniprot.org/uniprot/P04070,2040277,7501
,,http://purl.uniprot.org/uniprot/P04070,2040277,7796
,,http://purl.uniprot.org/uniprot/P04070,2040277,7756
,,http://purl.uniprot.org/uniprot/P04070,2040277,7471
,,http://purl.uniprot.org/uniprot/P04070,2040277,7692
,,http://purl.uniprot.org/uniprot/P04070,2001693,7576
,,http://purl.uniprot.org/uniprot/P04070,2001693,7410
,,http://purl.uniprot.org/uniprot/P04070,2001693,7833
,,http://purl.uniprot.org/uniprot/P04070,2001693,7828
,,http://purl.uniprot.org/uniprot/P04070,2001693,7543
,,http://purl.uniprot.org/uniprot/P04070,2001693,7476
,,http://purl.uniprot.org/uniprot/P04070,2001693,7603
,,http://purl.uniprot.org/uniprot/P04070,2001693,7518
,,http://purl.uniprot.org/uniprot/P04070,2001693,7423
,,http://purl.uniprot.org/uniprot/P04070,2001693,7643
,,http://purl.uniprot.org/uniprot/P04070,2001693,7881
,,http://purl.uniprot.org/uniprot/P04070,2001693,7501
,,http://purl.uniprot.org/uniprot/P04070,2001693,7796
,,http://purl.uniprot.org/uniprot/P04070,2001693,7756
,,http://purl.uniprot.org/uniprot/P04070,2001693,7471
,,http://purl.uniprot.org/uniprot/P04070,2001693,7692
,,http://purl.uniprot.org/uniprot/P04070,3967649,7576
,,http://purl.uniprot.org/uniprot/P04070,3967649,7410
,,http://purl.uniprot.org/uniprot/P04070,3967649,7833
,,http://purl.uniprot.org/uniprot/P04070,3967649,7828
,,http://purl.uniprot.org/uniprot/P04070,3967649,7543
,,http://purl.uniprot.org/uniprot/P04070,3967649,7476
,,http://purl.uniprot.org/uniprot/P04070,3967649,7603
,,http://purl.uniprot.org/uniprot/P04070,3967649,7518
,,http://purl.uniprot.org/uniprot/P04070,3967649,7423
,,http://purl.uniprot.org/uniprot/P04070,3967649,7643
,,http://purl.uniprot.org/uniprot/P04070,3967649,7881
,,http://purl.uniprot.org/uniprot/P04070,3967649,7501
,,http://purl.uniprot.org/uniprot/P04070,3967649,7796
,,http://purl.uniprot.org/uniprot/P04070,3967649,7756
,,http://purl.uniprot.org/uniprot/P04070,3967649,7471
,,http://purl.uniprot.org/uniprot/P04070,3967649,7692
,,http://purl.uniprot.org/uniprot/P04070,7635155,7576
,,http://purl.uniprot.org/uniprot/P04070,7635155,7410
,,http://purl.uniprot.org/uniprot/P04070,7635155,7833
,,http://purl.uniprot.org/uniprot/P04070,7635155,7828
,,http://purl.uniprot.org/uniprot/P04070,7635155,7543
,,http://purl.uniprot.org/uniprot/P04070,7635155,7476
,,http://purl.uniprot.org/uniprot/P04070,7635155,7603
,,http://purl.uniprot.org/uniprot/P04070,7635155,7518
,,http://purl.uniprot.org/uniprot/P04070,7635155,7423
,,http://purl.uniprot.org/uniprot/P04070,7635155,7643
,,http://purl.uniprot.org/uniprot/P04070,7635155,7881
,,http://purl.uniprot.org/uniprot/P04070,7635155,7501
,,http://purl.uniprot.org/uniprot/P04070,7635155,7796
,,http://purl.uniprot.org/uniprot/P04070,7635155,7756
,,http://purl.uniprot.org/uniprot/P04070,7635155,7471
,,http://purl.uniprot.org/uniprot/P04070,7635155,7692
,,http://purl.uniprot.org/uniprot/P04070,8034632,7576
,,http://purl.uniprot.org/uniprot/P04070,8034632,7410
,,http://purl.uniprot.org/uniprot/P04070,8034632,7833
,,http://purl.uniprot.org/uniprot/P04070,8034632,7828
,,http://purl.uniprot.org/uniprot/P04070,8034632,7543
,,http://purl.uniprot.org/uniprot/P04070,8034632,7476
,,http://purl.uniprot.org/uniprot/P04070,8034632,7603
,,http://purl.uniprot.org/uniprot/P04070,8034632,7518
,,http://purl.uniprot.org/uniprot/P04070,8034632,7423
,,http://purl.uniprot.org/uniprot/P04070,8034632,7643
,,http://purl.uniprot.org/uniprot/P04070,8034632,7881
,,http://purl.uniprot.org/uniprot/P04070,8034632,7501
,,http://purl.uniprot.org/uniprot/P04070,8034632,7796
,,http://purl.uniprot.org/uniprot/P04070,8034632,7756
,,http://purl.uniprot.org/uniprot/P04070,8034632,7471
,,http://purl.uniprot.org/uniprot/P04070,8034632,7692
,,http://purl.uniprot.org/uniprot/P04070,3665919,7576
,,http://purl.uniprot.org/uniprot/P04070,3665919,7410
,,http://purl.uniprot.org/uniprot/P04070,3665919,7833
,,http://purl.uniprot.org/uniprot/P04070,3665919,7828
,,http://purl.uniprot.org/uniprot/P04070,3665919,7543
,,http://purl.uniprot.org/uniprot/P04070,3665919,7476
,,http://purl.uniprot.org/uniprot/P04070,3665919,7603
,,http://purl.uniprot.org/uniprot/P04070,3665919,7518
,,http://purl.uniprot.org/uniprot/P04070,3665919,7423
,,http://purl.uniprot.org/uniprot/P04070,3665919,7643
,,http://purl.uniprot.org/uniprot/P04070,3665919,7881
,,http://purl.uniprot.org/uniprot/P04070,3665919,7501
,,http://purl.uniprot.org/uniprot/P04070,3665919,7796
,,http://purl.uniprot.org/uniprot/P04070,3665919,7756
,,http://purl.uniprot.org/uniprot/P04070,3665919,7471
,,http://purl.uniprot.org/uniprot/P04070,3665919,7692
,,http://purl.uniprot.org/uniprot/P04070,8193552,7576
,,http://purl.uniprot.org/uniprot/P04070,8193552,7410
,,http://purl.uniprot.org/uniprot/P04070,8193552,7833
,,http://purl.uniprot.org/uniprot/P04070,8193552,7828
,,http://purl.uniprot.org/uniprot/P04070,8193552,7543
,,http://purl.uniprot.org/uniprot/P04070,8193552,7476
,,http://purl.uniprot.org/uniprot/P04070,8193552,7603
,,http://purl.uniprot.org/uniprot/P04070,8193552,7518
,,http://purl.uniprot.org/uniprot/P04070,8193552,7423
,,http://purl.uniprot.org/uniprot/P04070,8193552,7643
,,http://purl.uniprot.org/uniprot/P04070,8193552,7881
,,http://purl.uniprot.org/uniprot/P04070,8193552,7501
,,http://purl.uniprot.org/uniprot/P04070,8193552,7796
,,http://purl.uniprot.org/uniprot/P04070,8193552,7756
,,http://purl.uniprot.org/uniprot/P04070,8193552,7471
,,http://purl.uniprot.org/uniprot/P04070,8193552,7692
,,http://purl.uniprot.org/uniprot/P04070,9530955,7576
,,http://purl.uniprot.org/uniprot/P04070,9530955,7410
,,http://purl.uniprot.org/uniprot/P04070,9530955,7833
,,http://purl.uniprot.org/uniprot/P04070,9530955,7828
,,http://purl.uniprot.org/uniprot/P04070,9530955,7543
,,http://purl.uniprot.org/uniprot/P04070,9530955,7476
,,http://purl.uniprot.org/uniprot/P04070,9530955,7603
,,http://purl.uniprot.org/uniprot/P04070,9530955,7518
,,http://purl.uniprot.org/uniprot/P04070,9530955,7423
,,http://purl.uniprot.org/uniprot/P04070,9530955,7643
,,http://purl.uniprot.org/uniprot/P04070,9530955,7881
,,http://purl.uniprot.org/uniprot/P04070,9530955,7501
,,http://purl.uniprot.org/uniprot/P04070,9530955,7796
,,http://purl.uniprot.org/uniprot/P04070,9530955,7756
,,http://purl.uniprot.org/uniprot/P04070,9530955,7471
,,http://purl.uniprot.org/uniprot/P04070,9530955,7692
,,http://purl.uniprot.org/uniprot/P04070,9376680,7576
,,http://purl.uniprot.org/uniprot/P04070,9376680,7410
,,http://purl.uniprot.org/uniprot/P04070,9376680,7833
,,http://purl.uniprot.org/uniprot/P04070,9376680,7828
,,http://purl.uniprot.org/uniprot/P04070,9376680,7543
,,http://purl.uniprot.org/uniprot/P04070,9376680,7476
,,http://purl.uniprot.org/uniprot/P04070,9376680,7603
,,http://purl.uniprot.org/uniprot/P04070,9376680,7518
,,http://purl.uniprot.org/uniprot/P04070,9376680,7423
,,http://purl.uniprot.org/uniprot/P04070,9376680,7643
,,http://purl.uniprot.org/uniprot/P04070,9376680,7881
,,http://purl.uniprot.org/uniprot/P04070,9376680,7501
,,http://purl.uniprot.org/uniprot/P04070,9376680,7796
,,http://purl.uniprot.org/uniprot/P04070,9376680,7756
,,http://purl.uniprot.org/uniprot/P04070,9376680,7471
,,http://purl.uniprot.org/uniprot/P04070,9376680,7692
,,http://purl.uniprot.org/uniprot/P04070,2040278,7576
,,http://purl.uniprot.org/uniprot/P04070,2040278,7410
,,http://purl.uniprot.org/uniprot/P04070,2040278,7833
,,http://purl.uniprot.org/uniprot/P04070,2040278,7828
,,http://purl.uniprot.org/uniprot/P04070,2040278,7543
,,http://purl.uniprot.org/uniprot/P04070,2040278,7476
,,http://purl.uniprot.org/uniprot/P04070,2040278,7603
,,http://purl.uniprot.org/uniprot/P04070,2040278,7518
,,http://purl.uniprot.org/uniprot/P04070,2040278,7423
,,http://purl.uniprot.org/uniprot/P04070,2040278,7643
,,http://purl.uniprot.org/uniprot/P04070,2040278,7881
,,http://purl.uniprot.org/uniprot/P04070,2040278,7501
,,http://purl.uniprot.org/uniprot/P04070,2040278,7796
,,http://purl.uniprot.org/uniprot/P04070,2040278,7756
,,http://purl.uniprot.org/uniprot/P04070,2040278,7471
,,http://purl.uniprot.org/uniprot/P04070,2040278,7692
,,http://purl.uniprot.org/uniprot/P04070,0,7576
,,http://purl.uniprot.org/uniprot/P04070,0,7410
,,http://purl.uniprot.org/uniprot/P04070,0,7833
,,http://purl.uniprot.org/uniprot/P04070,0,7828
,,http://purl.uniprot.org/uniprot/P04070,0,7543
,,http://purl.uniprot.org/uniprot/P04070,0,7476
,,http://purl.uniprot.org/uniprot/P04070,0,7603
,,http://purl.uniprot.org/uniprot/P04070,0,7518
,,http://purl.uniprot.org/uniprot/P04070,0,7423
,,http://purl.uniprot.org/uniprot/P04070,0,7643
,,http://purl.uniprot.org/uniprot/P04070,0,7881
,,http://purl.uniprot.org/uniprot/P04070,0,7501
,,http://purl.uniprot.org/uniprot/P04070,0,7796
,,http://purl.uniprot.org/uniprot/P04070,0,7756
,,http://purl.uniprot.org/uniprot/P04070,0,7471
,,http://purl.uniprot.org/uniprot/P04070,0,7692
,,http://purl.uniprot.org/uniprot/P04070,7635154,7576
,,http://purl.uniprot.org/uniprot/P04070,7635154,7410
,,http://purl.uniprot.org/uniprot/P04070,7635154,7833
,,http://purl.uniprot.org/uniprot/P04070,7635154,7828
,,http://purl.uniprot.org/uniprot/P04070,7635154,7543
,,http://purl.uniprot.org/uniprot/P04070,7635154,7476
,,http://purl.uniprot.org/uniprot/P04070,7635154,7603
,,http://purl.uniprot.org/uniprot/P04070,7635154,7518
,,http://purl.uniprot.org/uniprot/P04070,7635154,7423
,,http://purl.uniprot.org/uniprot/P04070,7635154,7643
,,http://purl.uniprot.org/uniprot/P04070,7635154,7881
,,http://purl.uniprot.org/uniprot/P04070,7635154,7501
,,http://purl.uniprot.org/uniprot/P04070,7635154,7796
,,http://purl.uniprot.org/uniprot/P04070,7635154,7756
,,http://purl.uniprot.org/uniprot/P04070,7635154,7471
,,http://purl.uniprot.org/uniprot/P04070,7635154,7692
,,http://purl.uniprot.org/uniprot/P04070,3665914,7576
,,http://purl.uniprot.org/uniprot/P04070,3665914,7410
,,http://purl.uniprot.org/uniprot/P04070,3665914,7833
,,http://purl.uniprot.org/uniprot/P04070,3665914,7828
,,http://purl.uniprot.org/uniprot/P04070,3665914,7543
,,http://purl.uniprot.org/uniprot/P04070,3665914,7476
,,http://purl.uniprot.org/uniprot/P04070,3665914,7603
,,http://purl.uniprot.org/uniprot/P04070,3665914,7518
,,http://purl.uniprot.org/uniprot/P04070,3665914,7423
,,http://purl.uniprot.org/uniprot/P04070,3665914,7643
,,http://purl.uniprot.org/uniprot/P04070,3665914,7881
,,http://purl.uniprot.org/uniprot/P04070,3665914,7501
,,http://purl.uniprot.org/uniprot/P04070,3665914,7796
,,http://purl.uniprot.org/uniprot/P04070,3665914,7756
,,http://purl.uniprot.org/uniprot/P04070,3665914,7471
,,http://purl.uniprot.org/uniprot/P04070,3665914,7692
,,http://purl.uniprot.org/uniprot/P08709,9530955,7643
,,http://purl.uniprot.org/uniprot/P08709,9530955,7464
,,http://purl.uniprot.org/uniprot/P08709,9530955,7878
,,http://purl.uniprot.org/uniprot/P08709,9530955,7702
,,http://purl.uniprot.org/uniprot/P08709,9530955,7593
,,http://purl.uniprot.org/uniprot/P08709,9530955,7644
,,http://purl.uniprot.org/uniprot/P08709,9530955,7869
,,http://purl.uniprot.org/uniprot/P08709,9530955,7510
,,http://purl.uniprot.org/uniprot/P08709,9530955,7480
,,http://purl.uniprot.org/uniprot/P08709,2040277,7643
,,http://purl.uniprot.org/uniprot/P08709,2040277,7464
,,http://purl.uniprot.org/uniprot/P08709,2040277,7878
,,http://purl.uniprot.org/uniprot/P08709,2040277,7702
,,http://purl.uniprot.org/uniprot/P08709,2040277,7593
,,http://purl.uniprot.org/uniprot/P08709,2040277,7644
,,http://purl.uniprot.org/uniprot/P08709,2040277,7869
,,http://purl.uniprot.org/uniprot/P08709,2040277,7510
,,http://purl.uniprot.org/uniprot/P08709,2040277,7480
,,http://purl.uniprot.org/uniprot/P08709,1323463,7643
,,http://purl.uniprot.org/uniprot/P08709,1323463,7464
,,http://purl.uniprot.org/uniprot/P08709,1323463,7878
,,http://purl.uniprot.org/uniprot/P08709,1323463,7702
,,http://purl.uniprot.org/uniprot/P08709,1323463,7593
,,http://purl.uniprot.org/uniprot/P08709,1323463,7644
,,http://purl.uniprot.org/uniprot/P08709,1323463,7869
,,http://purl.uniprot.org/uniprot/P08709,1323463,7510
,,http://purl.uniprot.org/uniprot/P08709,1323463,7480
,,http://purl.uniprot.org/uniprot/P08709,7635155,7643
,,http://purl.uniprot.org/uniprot/P08709,7635155,7464
,,http://purl.uniprot.org/uniprot/P08709,7635155,7878
,,http://purl.uniprot.org/uniprot/P08709,7635155,7702
,,http://purl.uniprot.org/uniprot/P08709,7635155,7593
,,http://purl.uniprot.org/uniprot/P08709,7635155,7644
,,http://purl.uniprot.org/uniprot/P08709,7635155,7869
,,http://purl.uniprot.org/uniprot/P08709,7635155,7510
,,http://purl.uniprot.org/uniprot/P08709,7635155,7480
,,http://purl.uniprot.org/uniprot/P08709,2040278,7643
,,http://purl.uniprot.org/uniprot/P08709,2040278,7464
,,http://purl.uniprot.org/uniprot/P08709,2040278,7878
,,http://purl.uniprot.org/uniprot/P08709,2040278,7702
,,http://purl.uniprot.org/uniprot/P08709,2040278,7593
,,http://purl.uniprot.org/uniprot/P08709,2040278,7644
,,http://purl.uniprot.org/uniprot/P08709,2040278,7869
,,http://purl.uniprot.org/uniprot/P08709,2040278,7510
,,http://purl.uniprot.org/uniprot/P08709,2040278,7480
,,http://purl.uniprot.org/uniprot/P08709,7635154,7643
,,http://purl.uniprot.org/uniprot/P08709,7635154,7464
,,http://purl.uniprot.org/uniprot/P08709,7635154,7878
,,http://purl.uniprot.org/uniprot/P08709,7635154,7702
,,http://purl.uniprot.org/uniprot/P08709,7635154,7593
,,http://purl.uniprot.org/uniprot/P08709,7635154,7644
,,http://purl.uniprot.org/uniprot/P08709,7635154,7869
,,http://purl.uniprot.org/uniprot/P08709,7635154,7510
,,http://purl.uniprot.org/uniprot/P08709,7635154,7480
,,http://purl.uniprot.org/uniprot/P08709,9076522,7643
,,http://purl.uniprot.org/uniprot/P08709,9076522,7464
,,http://purl.uniprot.org/uniprot/P08709,9076522,7878
,,http://purl.uniprot.org/uniprot/P08709,9076522,7702
,,http://purl.uniprot.org/uniprot/P08709,9076522,7593
,,http://purl.uniprot.org/uniprot/P08709,9076522,7644
,,http://purl.uniprot.org/uniprot/P08709,9076522,7869
,,http://purl.uniprot.org/uniprot/P08709,9076522,7510
,,http://purl.uniprot.org/uniprot/P08709,9076522,7480
,,http://purl.uniprot.org/uniprot/P08709,9376680,7643
,,http://purl.uniprot.org/uniprot/P08709,9376680,7464
,,http://purl.uniprot.org/uniprot/P08709,9376680,7878
,,http://purl.uniprot.org/uniprot/P08709,9376680,7702
,,http://purl.uniprot.org/uniprot/P08709,9376680,7593
,,http://purl.uniprot.org/uniprot/P08709,9376680,7644
,,http://purl.uniprot.org/uniprot/P08709,9376680,7869
,,http://purl.uniprot.org/uniprot/P08709,9376680,7510
,,http://purl.uniprot.org/uniprot/P08709,9376680,7480
,,http://purl.uniprot.org/uniprot/P08709,8436110,7643
,,http://purl.uniprot.org/uniprot/P08709,8436110,7464
,,http://purl.uniprot.org/uniprot/P08709,8436110,7878
,,http://purl.uniprot.org/uniprot/P08709,8436110,7702
,,http://purl.uniprot.org/uniprot/P08709,8436110,7593
,,http://purl.uniprot.org/uniprot/P08709,8436110,7644
,,http://purl.uniprot.org/uniprot/P08709,8436110,7869
,,http://purl.uniprot.org/uniprot/P08709,8436110,7510
,,http://purl.uniprot.org/uniprot/P08709,8436110,7480
