﻿Protein,Position,Id,Toucan,AminoAcid,TypeAminoAcid,Notes,Pmid,AdditionalNotes,doi,Composition,Cellosaurus,Peptide,Species,Tissue,Uoxf,Abundance,SamplePreparation,Virus,Disease
,,G59741XZ,G59741XZ,Asn,N-linked,N-glycans release from gel bands corresponding to gp120 and gp41ECTO,34327564,"Glycans were released from BG505 SOSIP.664 trimers that were transiently expressed in HEK 293T cells  and purified by 2G12-affinity chromatography followed by size-exclusion chromatography. Synapt G2Si travelling wave ion mobility mass spectrometer (Waters, Manchester, UK) [31] fitted with a nano-electrospray (nESI) ion source.",10.1007/s00216-021-03477-3,,CVCL_0063,,,,,,,human immunodeficiency virus,DOID:526
,,G93438EY,G93438EY,Asn,N-linked,N-glycans release from gel bands corresponding to gp120 and gp41ECTO,34327564,"Glycans were released from BG505 SOSIP.664 trimers that were transiently expressed in HEK 293T cells  and purified by 2G12-affinity chromatography followed by size-exclusion chromatography. Synapt G2Si travelling wave ion mobility mass spectrometer (Waters, Manchester, UK) [31] fitted with a nano-electrospray (nESI) ion source.",10.1007/s00216-021-03477-3,,CVCL_0063,,,,,,,human immunodeficiency virus,DOID:526
,,G37565XR,G37565XR,Asn,N-linked,N-glycans release from gel bands corresponding to gp120 and gp41ECTO,34327564,"Glycans were released from BG505 SOSIP.664 trimers that were transiently expressed in HEK 293T cells  and purified by 2G12-affinity chromatography followed by size-exclusion chromatography. Synapt G2Si travelling wave ion mobility mass spectrometer (Waters, Manchester, UK) [31] fitted with a nano-electrospray (nESI) ion source.",10.1007/s00216-021-03477-3,,CVCL_0063,,,,,,,human immunodeficiency virus,DOID:526
,,G93857UP,G93857UP,Asn,N-linked,N-glycans release from gel bands corresponding to gp120 and gp41ECTO,34327564,"Glycans were released from BG505 SOSIP.664 trimers that were transiently expressed in HEK 293T cells  and purified by 2G12-affinity chromatography followed by size-exclusion chromatography. Synapt G2Si travelling wave ion mobility mass spectrometer (Waters, Manchester, UK) [31] fitted with a nano-electrospray (nESI) ion source.",10.1007/s00216-021-03477-3,,CVCL_0063,,,,,,,human immunodeficiency virus,DOID:526
,,G40309II,G40309II,Asn,N-linked,N-glycans release from gel bands corresponding to gp120 and gp41ECTO,34327564,"Glycans were released from BG505 SOSIP.664 trimers that were transiently expressed in HEK 293T cells  and purified by 2G12-affinity chromatography followed by size-exclusion chromatography. Synapt G2Si travelling wave ion mobility mass spectrometer (Waters, Manchester, UK) [31] fitted with a nano-electrospray (nESI) ion source.",10.1007/s00216-021-03477-3,,CVCL_0063,,,,,,,human immunodeficiency virus,DOID:526
,,G13151XE,G13151XE,Asn,N-linked,N-glycans release from gel bands corresponding to gp120 and gp41ECTO,34327564,"Glycans were released from BG505 SOSIP.664 trimers that were transiently expressed in HEK 293T cells  and purified by 2G12-affinity chromatography followed by size-exclusion chromatography. Synapt G2Si travelling wave ion mobility mass spectrometer (Waters, Manchester, UK) [31] fitted with a nano-electrospray (nESI) ion source.",10.1007/s00216-021-03477-3,,CVCL_0063,,,,,,,human immunodeficiency virus,DOID:526
,,G96063MG,G96063MG,Asn,N-linked,N-glycans release from gel bands corresponding to gp120 and gp41ECTO,34327564,"Glycans were released from BG505 SOSIP.664 trimers that were transiently expressed in HEK 293T cells  and purified by 2G12-affinity chromatography followed by size-exclusion chromatography. Synapt G2Si travelling wave ion mobility mass spectrometer (Waters, Manchester, UK) [31] fitted with a nano-electrospray (nESI) ion source.",10.1007/s00216-021-03477-3,,CVCL_0063,,,,,,,human immunodeficiency virus,DOID:526
,,G99969SS,G99969SS,Asn,N-linked,N-glycans release from gel bands corresponding to gp120 and gp41ECTO,34327564,"Glycans were released from BG505 SOSIP.664 trimers that were transiently expressed in HEK 293T cells  and purified by 2G12-affinity chromatography followed by size-exclusion chromatography. Synapt G2Si travelling wave ion mobility mass spectrometer (Waters, Manchester, UK) [31] fitted with a nano-electrospray (nESI) ion source.",10.1007/s00216-021-03477-3,,CVCL_0063,,,,,,,human immunodeficiency virus,DOID:526
,,G50709EY,G50709EY,Asn,N-linked,N-glycans release from gel bands corresponding to gp120 and gp41ECTO,34327564,"Glycans were released from BG505 SOSIP.664 trimers that were transiently expressed in HEK 293T cells  and purified by 2G12-affinity chromatography followed by size-exclusion chromatography. Synapt G2Si travelling wave ion mobility mass spectrometer (Waters, Manchester, UK) [31] fitted with a nano-electrospray (nESI) ion source.",10.1007/s00216-021-03477-3,,CVCL_0063,,,,,,,human immunodeficiency virus,DOID:526
,,G88417ED,G88417ED,Asn,N-linked,N-glycans release from gel bands corresponding to gp120 and gp41ECTO,34327564,"Glycans were released from BG505 SOSIP.664 trimers that were transiently expressed in HEK 293T cells  and purified by 2G12-affinity chromatography followed by size-exclusion chromatography. Synapt G2Si travelling wave ion mobility mass spectrometer (Waters, Manchester, UK) [31] fitted with a nano-electrospray (nESI) ion source.",10.1007/s00216-021-03477-3,,CVCL_0063,,,,,,,human immunodeficiency virus,DOID:526
,,G84791TM,G84791TM,Asn,N-linked,N-glycans release from gel bands corresponding to gp120 and gp41ECTO,34327564,"Glycans were released from BG505 SOSIP.664 trimers that were transiently expressed in HEK 293T cells  and purified by 2G12-affinity chromatography followed by size-exclusion chromatography. Synapt G2Si travelling wave ion mobility mass spectrometer (Waters, Manchester, UK) [31] fitted with a nano-electrospray (nESI) ion source.",10.1007/s00216-021-03477-3,,CVCL_0063,,,,,,,human immunodeficiency virus,DOID:526
,,G08185DV,G08185DV,Asn,N-linked,N-glycans release from gel bands corresponding to gp120 and gp41ECTO,34327564,"Glycans were released from BG505 SOSIP.664 trimers that were transiently expressed in HEK 293T cells  and purified by 2G12-affinity chromatography followed by size-exclusion chromatography. Synapt G2Si travelling wave ion mobility mass spectrometer (Waters, Manchester, UK) [31] fitted with a nano-electrospray (nESI) ion source.",10.1007/s00216-021-03477-3,,CVCL_0063,,,,,,,human immunodeficiency virus,DOID:526
,,G18641OW,G18641OW,Asn,N-linked,N-glycans release from gel bands corresponding to gp120 and gp41ECTO,34327564,"Glycans were released from BG505 SOSIP.664 trimers that were transiently expressed in HEK 293T cells  and purified by 2G12-affinity chromatography followed by size-exclusion chromatography. Synapt G2Si travelling wave ion mobility mass spectrometer (Waters, Manchester, UK) [31] fitted with a nano-electrospray (nESI) ion source.",10.1007/s00216-021-03477-3,,CVCL_0063,,,,,,,human immunodeficiency virus,DOID:526
,,G85542KD,G85542KD,Asn,N-linked,N-glycans release from gel bands corresponding to gp120 and gp41ECTO,34327564,"Glycans were released from BG505 SOSIP.664 trimers that were transiently expressed in HEK 293T cells  and purified by 2G12-affinity chromatography followed by size-exclusion chromatography. Synapt G2Si travelling wave ion mobility mass spectrometer (Waters, Manchester, UK) [31] fitted with a nano-electrospray (nESI) ion source.",10.1007/s00216-021-03477-3,,CVCL_0063,,,,,,,human immunodeficiency virus,DOID:526
,,G45656VV,G45656VV,Asn,N-linked,N-glycans release from gel bands corresponding to gp120 and gp41ECTO,34327564,"Glycans were released from BG505 SOSIP.664 trimers that were transiently expressed in HEK 293T cells  and purified by 2G12-affinity chromatography followed by size-exclusion chromatography. Synapt G2Si travelling wave ion mobility mass spectrometer (Waters, Manchester, UK) [31] fitted with a nano-electrospray (nESI) ion source.",10.1007/s00216-021-03477-3,,CVCL_0063,,,,,,,human immunodeficiency virus,DOID:526
,,,,Asn,N-linked,N-glycans release from gel bands corresponding to gp120 and gp41ECTO. Glytoucan error with S,34327564,"Glycans were released from BG505 SOSIP.664 trimers that were transiently expressed in HEK 293T cells  and purified by 2G12-affinity chromatography followed by size-exclusion chromatography. Synapt G2Si travelling wave ion mobility mass spectrometer (Waters, Manchester, UK) [31] fitted with a nano-electrospray (nESI) ion source.",10.1007/s00216-021-03477-3,,CVCL_0063,,,,,,,human immunodeficiency virus,DOID:526
,,G86102AA,G86102AA,Asn,N-linked,N-glycans release from gel bands corresponding to gp120 and gp41ECTO,34327564,"Glycans were released from BG505 SOSIP.664 trimers that were transiently expressed in HEK 293T cells  and purified by 2G12-affinity chromatography followed by size-exclusion chromatography. Synapt G2Si travelling wave ion mobility mass spectrometer (Waters, Manchester, UK) [31] fitted with a nano-electrospray (nESI) ion source.",10.1007/s00216-021-03477-3,,CVCL_0063,,,,,,,human immunodeficiency virus,DOID:526
,,,,Asn,N-linked,N-glycans release from gel bands corresponding to gp120 and gp41ECTO. Glytoucan error with S,34327564,"Glycans were released from BG505 SOSIP.664 trimers that were transiently expressed in HEK 293T cells  and purified by 2G12-affinity chromatography followed by size-exclusion chromatography. Synapt G2Si travelling wave ion mobility mass spectrometer (Waters, Manchester, UK) [31] fitted with a nano-electrospray (nESI) ion source.",10.1007/s00216-021-03477-3,,CVCL_0063,,,,,,,human immunodeficiency virus,DOID:526
,,G76136FD,G76136FD,Asn,N-linked,N-glycans release from gel bands corresponding to gp120 and gp41ECTO,34327564,"Glycans were released from BG505 SOSIP.664 trimers that were transiently expressed in HEK 293T cells  and purified by 2G12-affinity chromatography followed by size-exclusion chromatography. Synapt G2Si travelling wave ion mobility mass spectrometer (Waters, Manchester, UK) [31] fitted with a nano-electrospray (nESI) ion source.",10.1007/s00216-021-03477-3,,CVCL_0063,,,,,,,human immunodeficiency virus,DOID:526
,,G72221XM,G72221XM,Asn,N-linked,N-glycans release from gel bands corresponding to gp120 and gp41ECTO,34327564,"Glycans were released from BG505 SOSIP.664 trimers that were transiently expressed in HEK 293T cells  and purified by 2G12-affinity chromatography followed by size-exclusion chromatography. Synapt G2Si travelling wave ion mobility mass spectrometer (Waters, Manchester, UK) [31] fitted with a nano-electrospray (nESI) ion source.",10.1007/s00216-021-03477-3,,CVCL_0063,,,,,,,human immunodeficiency virus,DOID:526
,,G71673XZ,G71673XZ,Asn,N-linked,N-glycans release from gel bands corresponding to gp120 and gp41ECTO,34327564,"Glycans were released from BG505 SOSIP.664 trimers that were transiently expressed in HEK 293T cells  and purified by 2G12-affinity chromatography followed by size-exclusion chromatography. Synapt G2Si travelling wave ion mobility mass spectrometer (Waters, Manchester, UK) [31] fitted with a nano-electrospray (nESI) ion source.",10.1007/s00216-021-03477-3,,CVCL_0063,,,,,,,human immunodeficiency virus,DOID:526
,,G81599LG,G81599LG,Asn,N-linked,N-glycans release from gel bands corresponding to gp120 and gp41ECTO,34327564,"Glycans were released from BG505 SOSIP.664 trimers that were transiently expressed in HEK 293T cells  and purified by 2G12-affinity chromatography followed by size-exclusion chromatography. Synapt G2Si travelling wave ion mobility mass spectrometer (Waters, Manchester, UK) [31] fitted with a nano-electrospray (nESI) ion source.",10.1007/s00216-021-03477-3,,CVCL_0063,,,,,,,human immunodeficiency virus,DOID:526
,,G54323TO,G54323TO,Asn,N-linked,N-glycans release from gel bands corresponding to gp120 and gp41ECTO,34327564,"Glycans were released from BG505 SOSIP.664 trimers that were transiently expressed in HEK 293T cells  and purified by 2G12-affinity chromatography followed by size-exclusion chromatography. Synapt G2Si travelling wave ion mobility mass spectrometer (Waters, Manchester, UK) [31] fitted with a nano-electrospray (nESI) ion source.",10.1007/s00216-021-03477-3,,CVCL_0063,,,,,,,human immunodeficiency virus,DOID:526
,,G53859QY,G53859QY,Asn,N-linked,N-glycans release from gel bands corresponding to gp120 and gp41ECTO,34327564,"Glycans were released from BG505 SOSIP.664 trimers that were transiently expressed in HEK 293T cells  and purified by 2G12-affinity chromatography followed by size-exclusion chromatography. Synapt G2Si travelling wave ion mobility mass spectrometer (Waters, Manchester, UK) [31] fitted with a nano-electrospray (nESI) ion source.",10.1007/s00216-021-03477-3,,CVCL_0063,,,,,,,human immunodeficiency virus,DOID:526
,,G49963FN,G49963FN,Asn,N-linked,N-glycans release from gel bands corresponding to gp120 and gp41ECTO,34327564,"Glycans were released from BG505 SOSIP.664 trimers that were transiently expressed in HEK 293T cells  and purified by 2G12-affinity chromatography followed by size-exclusion chromatography. Synapt G2Si travelling wave ion mobility mass spectrometer (Waters, Manchester, UK) [31] fitted with a nano-electrospray (nESI) ion source.",10.1007/s00216-021-03477-3,,CVCL_0063,,,,,,,human immunodeficiency virus,DOID:526
,,G80295DJ,G80295DJ,Asn,N-linked,N-glycans release from gel bands corresponding to gp120 and gp41ECTO,34327564,"Glycans were released from BG505 SOSIP.664 trimers that were transiently expressed in HEK 293T cells  and purified by 2G12-affinity chromatography followed by size-exclusion chromatography. Synapt G2Si travelling wave ion mobility mass spectrometer (Waters, Manchester, UK) [31] fitted with a nano-electrospray (nESI) ion source.",10.1007/s00216-021-03477-3,,CVCL_0063,,,,,,,human immunodeficiency virus,DOID:526
,,G36191CD,G36191CD,Asn,N-linked,N-glycans release from gel bands corresponding to gp120 and gp41ECTO,34327564,"Glycans were released from BG505 SOSIP.664 trimers that were transiently expressed in HEK 293T cells  and purified by 2G12-affinity chromatography followed by size-exclusion chromatography. Synapt G2Si travelling wave ion mobility mass spectrometer (Waters, Manchester, UK) [31] fitted with a nano-electrospray (nESI) ion source.",10.1007/s00216-021-03477-3,,CVCL_0063,,,,,,,human immunodeficiency virus,DOID:526
,,G78059CC,G78059CC,Asn,N-linked,N-glycans release from gel bands corresponding to gp120 and gp41ECTO,34327564,"Glycans were released from BG505 SOSIP.664 trimers that were transiently expressed in HEK 293T cells  and purified by 2G12-affinity chromatography followed by size-exclusion chromatography. Synapt G2Si travelling wave ion mobility mass spectrometer (Waters, Manchester, UK) [31] fitted with a nano-electrospray (nESI) ion source.",10.1007/s00216-021-03477-3,,CVCL_0063,,,,,,,human immunodeficiency virus,DOID:526