Protein,Position,Toucan,AminoAcid,TypeAminoAcid,Notes,Pmid,AdditionalNotes,doi,comp
P0DTC2,63,G57321FI,Thr,O-linked,,33806155,Q Exactive HF-X,https://doi.org/10.3390/v13040551,comp_HexNAc1Hex0dHex0NeuAc0NeuGc0Pent0S0P0KDN0HexA0
P0DTC2,76,G57321FI,Thr,O-linked,,33806155,Q Exactive HF-X and Orbitrap Fusion Lumos,https://doi.org/10.3390/v13040551,comp_HexNAc1Hex0dHex0NeuAc0NeuGc0Pent0S0P0KDN0HexA0
P0DTC2,114,G57321FI,Thr,O-linked,,33806155,Q Exactive HF-X,https://doi.org/10.3390/v13040551,comp_HexNAc1Hex0dHex0NeuAc0NeuGc0Pent0S0P0KDN0HexA0
P0DTC2,167,G57321FI,Thr,O-linked,,33806155,Q Exactive HF-X,https://doi.org/10.3390/v13040551,comp_HexNAc1Hex0dHex0NeuAc0NeuGc0Pent0S0P0KDN0HexA0
P0DTC2,236,G57321FI,Thr,O-linked,,33806155,Q Exactive HF-X,https://doi.org/10.3390/v13040551,comp_HexNAc1Hex0dHex0NeuAc0NeuGc0Pent0S0P0KDN0HexA0
P0DTC2,478,G00031MO,Thr,O-linked,,33806155,Orbitrap Fusion Lumos,https://doi.org/10.3390/v13040551,comp_HexNAc1Hex1dHex0NeuAc0NeuGc0Pent0S0P0KDN0HexA0
P0DTC2,676,G00031MO,Thr,O-linked,,33806155,Orbitrap Fusion Lumos,https://doi.org/10.3390/v13040551,comp_HexNAc1Hex1dHex0NeuAc0NeuGc0Pent0S0P0KDN0HexA0
P0DTC2,678,G00031MO,Ser,O-linked,,33806155,Orbitrap Fusion Lumos,https://doi.org/10.3390/v13040551,comp_HexNAc1Hex1dHex0NeuAc0NeuGc0Pent0S0P0KDN0HexA0
P0DTC2,803,G57321FI,Thr,O-linked,,33806155,Q Exactive HF-X,https://doi.org/10.3390/v13040551,comp_HexNAc1Hex0dHex0NeuAc0NeuGc0Pent0S0P0KDN0HexA0
P0DTC2,1097,G57321FI,Ser,O-linked,,33806155,Q Exactive HF-X,https://doi.org/10.3390/v13040551,comp_HexNAc1Hex0dHex0NeuAc0NeuGc0Pent0S0P0KDN0HexA0
P0DTC2,71,G57321FI,Ser,O-linked,,33806155,Orbitrap Fusion Lumos ,https://doi.org/10.3390/v13040551,comp_HexNAc1Hex0dHex0NeuAc0NeuGc0Pent0S0P0KDN0HexA0
P0DTC2,73,G57321FI,Thr,O-linked,,33806155,Orbitrap Fusion Lumos ,https://doi.org/10.3390/v13040551,comp_HexNAc1Hex0dHex0NeuAc0NeuGc0Pent0S0P0KDN0HexA0
P0DTC2,76,G57321FI,Thr,O-linked,,33806155,Orbitrap Fusion Lumos ,https://doi.org/10.3390/v13040551,comp_HexNAc1Hex0dHex0NeuAc0NeuGc0Pent0S0P0KDN0HexA0
P0DTC2,94|95,G57321FI,Ser,O-linked,,33806155,Orbitrap Fusion Lumos. Ambiguous assignment of sites.,https://doi.org/10.3390/v13040551,comp_HexNAc1Hex0dHex0NeuAc0NeuGc0Pent0S0P0KDN0HexA0
P0DTC2,124,G57321FI,Thr,O-linked,,33806155,Orbitrap Fusion Lumos ,https://doi.org/10.3390/v13040551,comp_HexNAc1Hex0dHex0NeuAc0NeuGc0Pent0S0P0KDN0HexA0
P0DTC2,151,G57321FI,Ser,O-linked,,33806155,Orbitrap Fusion Lumos ,https://doi.org/10.3390/v13040551,comp_HexNAc1Hex0dHex0NeuAc0NeuGc0Pent0S0P0KDN0HexA0
P0DTC2,678,G57321FI,Thr,O-linked,,33806155,Orbitrap Fusion Lumos ,https://doi.org/10.3390/v13040551,comp_HexNAc1Hex0dHex0NeuAc0NeuGc0Pent0S0P0KDN0HexA0
P0DTC2,803,G57321FI,Ser,O-linked,,33806155,Orbitrap Fusion Lumos ,https://doi.org/10.3390/v13040551,comp_HexNAc1Hex0dHex0NeuAc0NeuGc0Pent0S0P0KDN0HexA0
P0DTC2,1076|1077,G57321FI,Thr,O-linked,Ambiguous site annotation,33806155,Orbitrap Fusion Lumos ,https://doi.org/10.3390/v13040551,comp_HexNAc1Hex0dHex0NeuAc0NeuGc0Pent0S0P0KDN0HexA0
P0DTC2,1097,G57321FI,Ser,O-linked,,33806155,Orbitrap Fusion Lumos ,https://doi.org/10.3390/v13040551,comp_HexNAc1Hex0dHex0NeuAc0NeuGc0Pent0S0P0KDN0HexA0
P0DTC2,63,G00031MO,Thr,O-linked,,33806155,Orbitrap Fusion Lumos ,https://doi.org/10.3390/v13040551,comp_HexNAc1Hex1dHex0NeuAc0NeuGc0Pent0S0P0KDN0HexA0
P0DTC2,71,G00031MO,Ser,O-linked,,33806155,Orbitrap Fusion Lumos ,https://doi.org/10.3390/v13040551,comp_HexNAc1Hex1dHex0NeuAc0NeuGc0Pent0S0P0KDN0HexA0
P0DTC2,73,G00031MO,Thr,O-linked,,33806155,Orbitrap Fusion Lumos ,https://doi.org/10.3390/v13040551,comp_HexNAc1Hex1dHex0NeuAc0NeuGc0Pent0S0P0KDN0HexA0
P0DTC2,76,G00031MO,Thr,O-linked,,33806155,Orbitrap Fusion Lumos ,https://doi.org/10.3390/v13040551,comp_HexNAc1Hex1dHex0NeuAc0NeuGc0Pent0S0P0KDN0HexA0
P0DTC2,478,G00031MO,Thr,O-linked,,33806155,Orbitrap Fusion Lumos ,https://doi.org/10.3390/v13040551,comp_HexNAc1Hex1dHex0NeuAc0NeuGc0Pent0S0P0KDN0HexA0
P0DTC2,618,G00031MO,Thr,O-linked,,33806155,Orbitrap Fusion Lumos ,https://doi.org/10.3390/v13040551,comp_HexNAc1Hex1dHex0NeuAc0NeuGc0Pent0S0P0KDN0HexA0
P0DTC2,676|678,G00031MO,Thr,O-linked,Ambiguous site annotation,33806155,Orbitrap Fusion Lumos ,https://doi.org/10.3390/v13040551,comp_HexNAc1Hex1dHex0NeuAc0NeuGc0Pent0S0P0KDN0HexA0
P0DTC2,1076,G00031MO,Thr,O-linked,,33806155,Orbitrap Fusion Lumos ,https://doi.org/10.3390/v13040551,comp_HexNAc1Hex1dHex0NeuAc0NeuGc0Pent0S0P0KDN0HexA0
P0DTC2,1077,G00031MO,Thr,O-linked,,33806155,Orbitrap Fusion Lumos ,https://doi.org/10.3390/v13040551,comp_HexNAc1Hex1dHex0NeuAc0NeuGc0Pent0S0P0KDN0HexA0
P0DTC2,1097,G00031MO,Thr,O-linked,,33806155,Orbitrap Fusion Lumos ,https://doi.org/10.3390/v13040551,comp_HexNAc1Hex1dHex0NeuAc0NeuGc0Pent0S0P0KDN0HexA0
P0DTC2,1100,G00031MO,Thr,O-linked,,33806155,Orbitrap Fusion Lumos ,https://doi.org/10.3390/v13040551,comp_HexNAc1Hex1dHex0NeuAc0NeuGc0Pent0S0P0KDN0HexA0
P0DTC2,315,G57321FI,Thr,O-linked,,33806155,Orbitrap Fusion Lumos ,https://doi.org/10.3390/v13040551,comp_HexNAc1Hex0dHex0NeuAc0NeuGc0Pent0S0P0KDN0HexA0
P0DTC2,323,G57321FI,Thr,O-linked,,33806155,Orbitrap Fusion Lumos ,https://doi.org/10.3390/v13040551,comp_HexNAc1Hex0dHex0NeuAc0NeuGc0Pent0S0P0KDN0HexA0
P0DTC2,333,G57321FI,Thr,O-linked,,33806155,Orbitrap Fusion Lumos ,https://doi.org/10.3390/v13040551,comp_HexNAc1Hex0dHex0NeuAc0NeuGc0Pent0S0P0KDN0HexA0
P0DTC2,345,G57321FI,Thr,O-linked,,33806155,Orbitrap Fusion Lumos ,https://doi.org/10.3390/v13040551,comp_HexNAc1Hex0dHex0NeuAc0NeuGc0Pent0S0P0KDN0HexA0
P0DTC2,415,G00031MO,Thr,O-linked,,33806155,Orbitrap Fusion Lumos ,https://doi.org/10.3390/v13040551,comp_HexNAc1Hex1dHex0NeuAc0NeuGc0Pent0S0P0KDN0HexA0
P0DTC2,523,G57321FI,Thr,O-linked,,33806155,Orbitrap Fusion Lumos ,https://doi.org/10.3390/v13040551,comp_HexNAc1Hex0dHex0NeuAc0NeuGc0Pent0S0P0KDN0HexA0
P0DTC2,323,G00031MO,Thr,O-linked,,33806155,Orbitrap Fusion Lumos ,https://doi.org/10.3390/v13040551,comp_HexNAc1Hex1dHex0NeuAc0NeuGc0Pent0S0P0KDN0HexA0