Time,Sensor A,Sensor B,Sensor C,Sensor D,Sensor E,Sensor F,Sensor G
4958616.000,-5.434,-3.915,-2.786,-19.177,-4.502,2.627,-15.393
4958633.000,-5.438,-3.914,-2.789,-19.176,-4.502,2.624,-15.393
4958650.000,-5.434,-3.911,-2.789,-19.178,-4.501,2.624,-15.390
4958667.000,-5.430,-3.910,-2.787,-19.174,-4.503,2.626,-15.392
4958685.000,-5.437,-3.910,-2.782,-19.175,-4.504,2.620,-15.393
4958703.000,-5.439,-3.912,-2.785,-19.174,-4.504,2.624,-15.391
4958722.000,-5.437,-3.913,-2.786,-19.177,-4.507,2.626,-15.396
4958740.000,-5.432,-3.912,-2.787,-19.181,-4.505,2.624,-15.391
4958758.000,-5.431,-3.910,-2.786,-19.174,-4.506,2.622,-15.393
4958777.000,-5.432,-3.909,-2.781,-19.172,-4.502,2.622,-15.394
4958795.000,-5.433,-3.912,-2.784,-19.173,-4.506,2.624,-15.391
4958813.000,-5.434,-3.915,-2.786,-19.174,-4.498,2.626,-15.387
4958831.000,-5.436,-3.912,-2.785,-19.172,-4.500,2.628,-15.394
4958848.000,-5.437,-3.914,-2.784,-19.175,-4.502,2.626,-15.390
4958865.000,-5.431,-3.910,-2.788,-19.179,-4.502,2.622,-15.389
4958883.000,-5.434,-3.910,-2.784,-19.180,-4.503,2.622,-15.394
4958901.000,-5.435,-3.914,-2.786,-19.175,-4.498,2.626,-15.393
4958918.000,-5.438,-3.910,-2.788,-19.176,-4.506,2.620,-15.391
4958936.000,-5.438,-3.917,-2.792,-19.177,-4.498,2.623,-15.393
4958953.000,-5.434,-3.914,-2.784,-19.178,-4.502,2.624,-15.394
4958971.000,-5.431,-3.911,-2.789,-19.180,-4.504,2.624,-15.394
4958988.000,-5.433,-3.911,-2.783,-19.172,-4.503,2.620,-15.393
4959006.000,-5.442,-3.911,-2.784,-19.172,-4.501,2.622,-15.394
4959023.000,-5.438,-3.911,-2.787,-19.175,-4.506,2.624,-15.393
4959041.000,-5.432,-3.910,-2.785,-19.176,-4.506,2.626,-15.391
4959061.000,-5.434,-3.912,-2.784,-19.176,-4.498,2.626,-15.390
4959079.000,-5.435,-3.910,-2.781,-19.175,-4.501,2.623,-15.393
4959097.000,-5.439,-3.910,-2.785,-19.174,-4.505,2.622,-15.392
4959114.000,-5.437,-3.912,-2.786,-19.174,-4.500,2.628,-15.389
4959132.000,-5.442,-3.909,-2.786,-19.176,-4.498,2.628,-15.393
4959151.000,-5.437,-3.911,-2.789,-19.179,-4.504,2.620,-15.390
4959169.000,-5.437,-3.911,-2.788,-19.181,-4.502,2.619,-15.390
4959187.000,-5.428,-3.908,-2.784,-19.180,-4.502,2.620,-15.392
4959206.000,-5.429,-3.911,-2.781,-19.170,-4.500,2.623,-15.394
4959224.000,-5.434,-3.911,-2.784,-19.173,-4.502,2.624,-15.393
4959243.000,-5.434,-3.914,-2.784,-19.173,-4.504,2.620,-15.393
4959260.000,-5.436,-3.915,-2.784,-19.173,-4.504,2.624,-15.391
4959277.000,-5.431,-3.909,-2.783,-19.176,-4.501,2.624,-15.390
4959294.000,-5.434,-3.909,-2.783,-19.174,-4.503,2.621,-15.393
4959311.000,-5.438,-3.912,-2.784,-19.174,-4.501,2.619,-15.393
4959328.000,-5.437,-3.913,-2.786,-19.172,-4.504,2.623,-15.388
4959344.000,-5.435,-3.911,-2.785,-19.173,-4.498,2.628,-15.394
4959361.000,-5.431,-3.906,-2.785,-19.176,-4.502,2.624,-15.392
4959378.000,-5.434,-3.911,-2.783,-19.174,-4.506,2.619,-15.393
4959396.000,-5.439,-3.910,-2.784,-19.174,-4.503,2.622,-15.391
4959413.000,-5.436,-3.914,-2.787,-19.174,-4.499,2.626,-15.393
4959430.000,-5.442,-3.912,-2.783,-19.176,-4.502,2.623,-15.392
4959449.000,-5.440,-3.913,-2.786,-19.178,-4.502,2.621,-15.394
4959467.000,-5.433,-3.911,-2.787,-19.179,-4.503,2.625,-15.388
4959485.000,-5.437,-3.908,-2.786,-19.176,-4.506,2.622,-15.392
4959503.000,-5.441,-3.912,-2.788,-19.174,-4.502,2.621,-15.390
4959520.000,-5.438,-3.917,-2.788,-19.178,-4.500,2.621,-15.392
4959537.000,-5.436,-3.916,-2.786,-19.181,-4.501,2.627,-15.390
4959555.000,-5.433,-3.911,-2.784,-19.174,-4.505,2.620,-15.393
4959571.000,-5.434,-3.908,-2.784,-19.172,-4.502,2.619,-15.393
4959589.000,-5.438,-3.911,-2.784,-19.175,-4.506,2.618,-15.391
4959607.000,-5.440,-3.915,-2.783,-19.172,-4.503,2.619,-15.395
4959624.000,-5.434,-3.911,-2.789,-19.180,-4.502,2.620,-15.395
4959641.000,-5.432,-3.911,-2.782,-19.177,-4.506,2.621,-15.394
4959659.000,-5.432,-3.907,-2.780,-19.173,-4.504,2.617,-15.393
4959677.000,-5.431,-3.910,-2.784,-19.175,-4.508,2.618,-15.395
4959694.000,-5.437,-3.912,-2.786,-19.175,-4.504,2.620,-15.395
4959712.000,-5.437,-3.912,-2.787,-19.178,-4.498,2.623,-15.390
4959731.000,-5.432,-3.916,-2.793,-19.176,-4.503,2.623,-15.389
4959748.000,-5.434,-3.910,-2.786,-19.180,-4.502,2.618,-15.393
4959766.000,-5.437,-3.911,-2.788,-19.172,-4.499,2.622,-15.390
4959783.000,-5.433,-3.909,-2.788,-19.176,-4.502,2.620,-15.389
4959801.000,-5.438,-3.916,-2.785,-19.175,-4.500,2.625,-15.388
4959818.000,-5.434,-3.911,-2.789,-19.178,-4.503,2.619,-15.394
4959836.000,-5.433,-3.913,-2.785,-19.178,-4.503,2.617,-15.390
4959853.000,-5.436,-3.907,-2.784,-19.179,-4.502,2.622,-15.393
4959871.000,-5.439,-3.908,-2.782,-19.172,-4.504,2.614,-15.389
4959889.000,-5.435,-3.913,-2.789,-19.169,-4.500,2.615,-15.393
4959906.000,-5.437,-3.913,-2.790,-19.180,-4.503,2.616,-15.393
4959924.000,-5.431,-3.909,-2.781,-19.179,-4.506,2.616,-15.391
4959941.000,-5.431,-3.909,-2.785,-19.173,-4.504,2.619,-15.389
4959959.000,-5.432,-3.912,-2.782,-19.167,-4.504,2.615,-15.391
4959976.000,-5.434,-3.911,-2.786,-19.175,-4.506,2.620,-15.392
4959994.000,-5.432,-3.911,-2.786,-19.177,-4.500,2.620,-15.394
4960011.000,-5.429,-3.911,-2.783,-19.176,-4.504,2.618,-15.391
4960028.000,-5.433,-3.908,-2.783,-19.173,-4.502,2.618,-15.392
4960046.000,-5.435,-3.912,-2.786,-19.174,-4.502,2.621,-15.391
4960063.000,-5.438,-3.915,-2.789,-19.174,-4.504,2.620,-15.393
4960080.000,-5.439,-3.913,-2.786,-19.172,-4.504,2.619,-15.391
4960097.000,-5.433,-3.911,-2.789,-19.172,-4.498,2.623,-15.391
4960115.000,-5.434,-3.912,-2.788,-19.182,-4.502,2.623,-15.393
4960132.000,-5.437,-3.911,-2.785,-19.172,-4.503,2.615,-15.390
4960150.000,-5.435,-3.914,-2.785,-19.174,-4.500,2.617,-15.392
4960167.000,-5.442,-3.915,-2.787,-19.176,-4.499,2.627,-15.389
4960185.000,-5.435,-3.911,-2.786,-19.179,-4.504,2.615,-15.392
4960203.000,-5.433,-3.910,-2.785,-19.176,-4.503,2.612,-15.388
4960220.000,-5.436,-3.909,-2.788,-19.172,-4.504,2.614,-15.390
4960238.000,-5.440,-3.910,-2.783,-19.176,-4.508,2.614,-15.392
4960256.000,-5.440,-3.914,-2.782,-19.171,-4.503,2.618,-15.392
4960273.000,-5.436,-3.911,-2.788,-19.178,-4.504,2.618,-15.392
4960290.000,-5.433,-3.910,-2.785,-19.173,-4.506,2.613,-15.395
4960308.000,-5.433,-3.909,-2.773,-19.172,-4.506,2.616,-15.396
4960325.000,-5.441,-3.914,-2.788,-19.178,-4.506,2.617,-15.394
4960342.000,-5.433,-3.909,-2.781,-19.171,-4.503,2.616,-15.395
4960359.000,-5.434,-3.909,-2.784,-19.171,-4.504,2.619,-15.395
4960376.000,-5.438,-3.914,-2.786,-19.174,-4.504,2.616,-15.397
4960394.000,-5.429,-3.911,-2.784,-19.173,-4.506,2.614,-15.392
4960411.000,-5.434,-3.908,-2.783,-19.175,-4.504,2.616,-15.393
4960429.000,-5.433,-3.909,-2.782,-19.171,-4.505,2.616,-15.391
4960446.000,-5.435,-3.911,-2.785,-19.174,-4.505,2.617,-15.388
4960464.000,-5.437,-3.909,-2.786,-19.172,-4.502,2.624,-15.388
4960482.000,-5.436,-3.911,-2.784,-19.175,-4.503,2.617,-15.391
4960500.000,-5.436,-3.916,-2.789,-19.176,-4.506,2.619,-15.393
4960519.000,-5.433,-3.915,-2.784,-19.178,-4.504,2.623,-15.389
4960536.000,-5.433,-3.913,-2.782,-19.175,-4.504,2.621,-15.396
4960554.000,-5.439,-3.910,-2.786,-19.173,-4.503,2.618,-15.392
4960572.000,-5.437,-3.915,-2.782,-19.173,-4.503,2.616,-15.392
4960590.000,-5.431,-3.914,-2.786,-19.175,-4.502,2.616,-15.395
4960607.000,-5.433,-3.911,-2.785,-19.179,-4.504,2.618,-15.394
4960626.000,-5.431,-3.911,-2.786,-19.176,-4.505,2.615,-15.394
4960643.000,-5.437,-3.911,-2.782,-19.171,-4.503,2.624,-15.393
4960661.000,-5.435,-3.909,-2.782,-19.179,-4.501,2.618,-15.393
4960678.000,-5.436,-3.914,-2.782,-19.175,-4.503,2.614,-15.396
4960695.000,-5.434,-3.915,-2.788,-19.177,-4.501,2.622,-15.391
4960714.000,-5.436,-3.911,-2.788,-19.178,-4.504,2.619,-15.393
4960730.000,-5.436,-3.911,-2.784,-19.174,-4.502,2.619,-15.392
4960747.000,-5.435,-3.912,-2.786,-19.173,-4.501,2.613,-15.391
4960765.000,-5.434,-3.914,-2.782,-19.177,-4.499,2.617,-15.391
4960783.000,-5.438,-3.917,-2.791,-19.178,-4.498,2.622,-15.395
4960801.000,-5.435,-3.914,-2.788,-19.180,-4.502,2.620,-15.392
4960820.000,-5.434,-3.910,-2.785,-19.178,-4.499,2.619,-15.388
4960838.000,-5.433,-3.908,-2.781,-19.176,-4.506,2.618,-15.397
4960856.000,-5.429,-3.910,-2.771,-19.174,-4.505,2.616,-15.391
4960874.000,-5.437,-3.911,-2.784,-19.174,-4.502,2.618,-15.394
4960893.000,-5.433,-3.912,-2.781,-19.176,-4.502,2.619,-15.396
4960911.000,-5.438,-3.911,-2.785,-19.177,-4.503,2.614,-15.397
4960928.000,-5.434,-3.908,-2.781,-19.175,-4.504,2.619,-15.389
4960944.000,-5.432,-3.911,-2.787,-19.173,-4.501,2.623,-15.392
4960962.000,-5.436,-3.914,-2.782,-19.172,-4.500,2.619,-15.394
4960979.000,-5.436,-3.915,-2.788,-19.178,-4.503,2.617,-15.392
4960997.000,-5.432,-3.916,-2.786,-19.176,-4.502,2.618,-15.390
4961014.000,-5.436,-3.907,-2.787,-19.181,-4.503,2.620,-15.389
4961032.000,-5.433,-3.911,-2.782,-19.181,-4.502,2.617,-15.393
4961050.000,-5.436,-3.910,-2.784,-19.178,-4.506,2.612,-15.391
4961067.000,-5.441,-3.914,-2.785,-19.176,-4.503,2.618,-15.390
4961086.000,-5.438,-3.915,-2.788,-19.175,-4.498,2.623,-15.393
4961103.000,-5.433,-3.912,-2.782,-19.180,-4.504,2.614,-15.392
4961120.000,-5.436,-3.911,-2.785,-19.180,-4.505,2.611,-15.392
4961138.000,-5.437,-3.912,-2.783,-19.172,-4.503,2.616,-15.398
4961155.000,-5.437,-3.916,-2.784,-19.172,-4.504,2.612,-15.392
4961173.000,-5.440,-3.913,-2.786,-19.175,-4.506,2.613,-15.392
4961191.000,-5.433,-3.911,-2.785,-19.178,-4.500,2.618,-15.391
4961208.000,-5.429,-3.913,-2.771,-19.174,-4.502,2.616,-15.392
4961226.000,-5.432,-3.908,-2.780,-19.175,-4.501,2.617,-15.390
4961245.000,-5.440,-3.908,-2.781,-19.173,-4.500,2.619,-15.395
4961263.000,-5.435,-3.915,-2.785,-19.175,-4.502,2.618,-15.393
4961280.000,-5.439,-3.910,-2.784,-19.175,-4.500,2.618,-15.388
4961298.000,-5.437,-3.915,-2.786,-19.176,-4.498,2.622,-15.389
4961315.000,-5.432,-3.906,-2.788,-19.181,-4.499,2.621,-15.391
4961333.000,-5.435,-3.911,-2.781,-19.177,-4.499,2.621,-15.391
4961350.000,-5.438,-3.912,-2.784,-19.174,-4.503,2.615,-15.389
4961368.000,-5.437,-3.920,-2.786,-19.176,-4.504,2.611,-15.395
4961386.000,-5.439,-3.909,-2.786,-19.180,-4.500,2.614,-15.393
4961404.000,-5.433,-3.908,-2.781,-19.175,-4.504,2.614,-15.392
4961422.000,-5.433,-3.914,-2.784,-19.175,-4.503,2.625,-15.396
4961439.000,-5.434,-3.906,-2.771,-19.174,-4.503,2.614,-15.388
4961458.000,-5.437,-3.909,-2.771,-19.175,-4.505,2.599,-15.392
4961475.000,-5.435,-3.914,-2.786,-19.175,-4.502,2.628,-15.394
4961492.000,-5.431,-3.910,-2.785,-19.175,-4.503,2.618,-15.392
4961510.000,-5.433,-3.909,-2.772,-19.174,-4.504,2.608,-15.396
4961527.000,-5.437,-3.911,-2.784,-19.174,-4.502,2.623,-15.389
4961544.000,-5.436,-3.911,-2.784,-19.173,-4.499,2.611,-15.390
4961562.000,-5.437,-3.910,-2.783,-19.174,-4.500,2.618,-15.398
4961580.000,-5.440,-3.910,-2.786,-19.175,-4.500,2.622,-15.390
4961598.000,-5.431,-3.911,-2.786,-19.177,-4.497,2.611,-15.393
4961615.000,-5.437,-3.912,-2.789,-19.176,-4.497,2.626,-15.395
4961633.000,-5.435,-3.913,-2.784,-19.176,-4.500,2.611,-15.392
4961650.000,-5.441,-3.914,-2.786,-19.176,-4.499,2.610,-15.391
4961668.000,-5.435,-3.913,-2.785,-19.174,-4.498,2.621,-15.391
4961685.000,-5.433,-3.909,-2.787,-19.179,-4.502,2.610,-15.391
4961703.000,-5.431,-3.910,-2.786,-19.178,-4.502,2.607,-15.395
4961721.000,-5.438,-3.908,-2.781,-19.174,-4.500,2.615,-15.395
4961740.000,-5.439,-3.914,-2.781,-19.168,-4.504,2.610,-15.395
4961757.000,-5.438,-3.916,-2.785,-19.177,-4.500,2.619,-15.396
4961774.000,-5.432,-3.911,-2.786,-19.179,-4.500,2.612,-15.394
4961791.000,-5.433,-3.909,-2.784,-19.174,-4.502,2.609,-15.396
4961810.000,-5.435,-3.917,-2.784,-19.172,-4.504,2.619,-15.398
4961828.000,-5.437,-3.910,-2.785,-19.174,-4.497,2.618,-15.390
4961846.000,-5.438,-3.912,-2.787,-19.176,-4.501,2.613,-15.391
4961865.000,-5.440,-3.914,-2.785,-19.173,-4.502,2.619,-15.391
4961883.000,-5.437,-3.911,-2.786,-19.178,-4.502,2.615,-15.391
4961901.000,-5.436,-3.913,-2.785,-19.183,-4.502,2.620,-15.395
4961920.000,-5.432,-3.911,-2.784,-19.177,-4.500,2.617,-15.394
4961938.000,-5.431,-3.908,-2.781,-19.172,-4.505,2.606,-15.391
4961955.000,-5.441,-3.911,-2.783,-19.171,-4.501,2.609,-15.396
4961972.000,-5.438,-3.915,-2.789,-19.178,-4.505,2.616,-15.393
4961990.000,-5.431,-3.909,-2.785,-19.178,-4.502,2.609,-15.390
4962007.000,-5.437,-3.908,-2.783,-19.177,-4.502,2.607,-15.393
4962025.000,-5.433,-3.914,-2.771,-19.174,-4.505,2.615,-15.395
4962043.000,-5.433,-3.905,-2.769,-19.174,-4.504,2.599,-15.394
4962060.000,-5.437,-3.911,-2.784,-19.177,-4.504,2.622,-15.393
4962078.000,-5.432,-3.911,-2.786,-19.178,-4.500,2.616,-15.393
4962095.000,-5.429,-3.910,-2.785,-19.175,-4.502,2.614,-15.393
4962114.000,-5.431,-3.911,-2.788,-19.181,-4.501,2.618,-15.391
4962132.000,-5.435,-3.911,-2.783,-19.179,-4.495,2.615,-15.389
4962149.000,-5.433,-3.913,-2.788,-19.178,-4.499,2.615,-15.391
4962168.000,-5.440,-3.915,-2.785,-19.177,-4.501,2.608,-15.392
4962185.000,-5.438,-3.915,-2.788,-19.177,-4.499,2.612,-15.390
4962202.000,-5.436,-3.911,-2.788,-19.178,-4.501,2.617,-15.393
4962219.000,-5.430,-3.910,-2.783,-19.172,-4.500,2.614,-15.392
4962237.000,-5.440,-3.911,-2.782,-19.174,-4.505,2.608,-15.393
4962255.000,-5.437,-3.910,-2.782,-19.174,-4.499,2.614,-15.395
4962273.000,-5.434,-3.909,-2.789,-19.174,-4.503,2.608,-15.398
4962290.000,-5.429,-3.910,-2.785,-19.177,-4.504,2.607,-15.395
4962309.000,-5.437,-3.909,-2.782,-19.176,-4.502,2.613,-15.394
4962326.000,-5.431,-3.908,-2.784,-19.171,-4.499,2.613,-15.393
4962343.000,-5.435,-3.908,-2.784,-19.174,-4.504,2.611,-15.396
4962360.000,-5.432,-3.910,-2.783,-19.174,-4.504,2.610,-15.393
4962376.000,-5.432,-3.908,-2.784,-19.176,-4.502,2.612,-15.392
4962395.000,-5.432,-3.909,-2.783,-19.174,-4.500,2.614,-15.395
4962412.000,-5.438,-3.909,-2.781,-19.173,-4.502,2.611,-15.397
4962429.000,-5.438,-3.914,-2.787,-19.175,-4.501,2.615,-15.392
4962447.000,-5.441,-3.911,-2.781,-19.179,-4.499,2.614,-15.393
4962466.000,-5.437,-3.918,-2.791,-19.173,-4.502,2.610,-15.394
4962484.000,-5.437,-3.909,-2.788,-19.178,-4.501,2.610,-15.391
4962501.000,-5.433,-3.914,-2.786,-19.174,-4.502,2.611,-15.390
4962519.000,-5.436,-3.912,-2.782,-19.174,-4.500,2.613,-15.395
4962536.000,-5.440,-3.914,-2.785,-19.176,-4.501,2.608,-15.392
4962553.000,-5.438,-3.915,-2.788,-19.182,-4.501,2.598,-15.394
4962571.000,-5.435,-3.909,-2.783,-19.177,-4.499,2.615,-15.397
4962588.000,-5.433,-3.909,-2.783,-19.174,-4.504,2.613,-15.395
4962606.000,-5.431,-3.910,-2.782,-19.174,-4.503,2.598,-15.396
4962624.000,-5.437,-3.911,-2.782,-19.172,-4.498,2.613,-15.392
4962641.000,-5.435,-3.909,-2.786,-19.171,-4.499,2.614,-15.394
4962659.000,-5.432,-3.912,-2.784,-19.174,-4.502,2.611,-15.395
4962676.000,-5.431,-3.911,-2.784,-19.172,-4.501,2.619,-15.390
4962695.000,-5.432,-3.908,-2.782,-19.171,-4.501,2.608,-15.391
4962712.000,-5.435,-3.912,-2.785,-19.175,-4.502,2.615,-15.396
4962729.000,-5.436,-3.910,-2.783,-19.176,-4.502,2.614,-15.388
4962747.000,-5.434,-3.908,-2.782,-19.172,-4.497,2.613,-15.390
4962765.000,-5.437,-3.912,-2.785,-19.175,-4.495,2.624,-15.393
4962783.000,-5.439,-3.912,-2.785,-19.176,-4.502,2.610,-15.387
4962800.000,-5.440,-3.914,-2.786,-19.178,-4.499,2.614,-15.393
4962818.000,-5.433,-3.912,-2.785,-19.176,-4.500,2.626,-15.391
4962835.000,-5.437,-3.912,-2.783,-19.171,-4.503,2.610,-15.389
4962853.000,-5.437,-3.915,-2.786,-19.172,-4.501,2.615,-15.393
4962870.000,-5.437,-3.916,-2.786,-19.176,-4.498,2.615,-15.392
4962888.000,-5.437,-3.912,-2.785,-19.177,-4.501,2.611,-15.393
4962907.000,-5.430,-3.908,-2.786,-19.174,-4.503,2.613,-15.392
4962924.000,-5.435,-3.909,-2.784,-19.174,-4.506,2.610,-15.394
4962942.000,-5.433,-3.906,-2.782,-19.172,-4.505,2.616,-15.397
4962961.000,-5.435,-3.911,-2.786,-19.176,-4.504,2.614,-15.392
4962979.000,-5.437,-3.913,-2.783,-19.177,-4.502,2.612,-15.393
4962997.000,-5.439,-3.911,-2.789,-19.174,-4.497,2.619,-15.393
4963016.000,-5.440,-3.914,-2.786,-19.178,-4.499,2.611,-15.391
4963034.000,-5.437,-3.914,-2.788,-19.176,-4.496,2.618,-15.390
4963052.000,-5.437,-3.909,-2.782,-19.176,-4.503,2.612,-15.391
4963070.000,-5.441,-3.913,-2.771,-19.172,-4.498,2.612,-15.390
4963088.000,-5.438,-3.914,-2.790,-19.176,-4.502,2.611,-15.396
4963105.000,-5.436,-3.912,-2.789,-19.174,-4.502,2.614,-15.396
4963122.000,-5.433,-3.909,-2.785,-19.179,-4.500,2.614,-15.390
4963141.000,-5.437,-3.909,-2.782,-19.172,-4.499,2.613,-15.395
4963158.000,-5.432,-3.909,-2.772,-19.170,-4.502,2.612,-15.394
4963175.000,-5.438,-3.911,-2.784,-19.173,-4.502,2.616,-15.393
4963192.000,-5.434,-3.912,-2.782,-19.174,-4.502,2.612,-15.392
4963210.000,-5.432,-3.909,-2.781,-19.176,-4.501,2.615,-15.395
4963228.000,-5.436,-3.910,-2.780,-19.173,-4.500,2.612,-15.396
4963245.000,-5.432,-3.907,-2.783,-19.172,-4.503,2.608,-15.392
4963262.000,-5.435,-3.911,-2.785,-19.173,-4.497,2.617,-15.394
4963282.000,-5.440,-3.914,-2.786,-19.173,-4.499,2.617,-15.392
4963299.000,-5.439,-3.918,-2.788,-19.175,-4.502,2.615,-15.394
4963317.000,-5.440,-3.914,-2.791,-19.177,-4.500,2.616,-15.392
4963336.000,-5.431,-3.910,-2.784,-19.172,-4.498,2.607,-15.396
4963354.000,-5.435,-3.909,-2.782,-19.174,-4.502,2.613,-15.396
4963371.000,-5.438,-3.912,-2.782,-19.178,-4.502,2.611,-15.392
4963390.000,-5.436,-3.912,-2.786,-19.172,-4.504,2.607,-15.394
4963408.000,-5.432,-3.912,-2.784,-19.176,-4.504,2.615,-15.394
4963426.000,-5.433,-3.908,-2.783,-19.176,-4.502,2.610,-15.392
4963446.000,-5.432,-3.910,-2.780,-19.178,-4.500,2.611,-15.399
4963463.000,-5.437,-3.912,-2.783,-19.171,-4.501,2.613,-15.391
4963481.000,-5.438,-3.914,-2.785,-19.171,-4.501,2.614,-15.391
4963499.000,-5.435,-3.911,-2.786,-19.178,-4.500,2.612,-15.396
4963516.000,-5.438,-3.913,-2.786,-19.176,-4.499,2.610,-15.396
4963534.000,-5.440,-3.914,-2.787,-19.179,-4.498,2.611,-15.392
4963552.000,-5.436,-3.913,-2.784,-19.174,-4.504,2.612,-15.396
4963572.000,-5.432,-3.911,-2.782,-19.175,-4.502,2.614,-15.390
4963589.000,-5.431,-3.910,-2.782,-19.177,-4.502,2.612,-15.397
4963606.000,-5.441,-3.915,-2.785,-19.170,-4.500,2.609,-15.395
4963624.000,-5.437,-3.911,-2.788,-19.175,-4.500,2.615,-15.396
4963642.000,-5.435,-3.909,-2.783,-19.177,-4.502,2.611,-15.393
4963660.000,-5.431,-3.909,-2.783,-19.172,-4.500,2.614,-15.395
4963677.000,-5.440,-3.911,-2.783,-19.172,-4.502,2.616,-15.394
4963695.000,-5.434,-3.915,-2.782,-19.174,-4.504,2.607,-15.397
4963712.000,-5.436,-3.912,-2.783,-19.179,-4.498,2.622,-15.394
4963730.000,-5.442,-3.913,-2.783,-19.175,-4.501,2.614,-15.395
4963747.000,-5.436,-3.910,-2.786,-19.182,-4.498,2.615,-15.396
4963766.000,-5.436,-3.911,-2.787,-19.177,-4.503,2.613,-15.392
4963783.000,-5.439,-3.911,-2.786,-19.175,-4.499,2.616,-15.391
4963801.000,-5.451,-3.915,-2.790,-19.176,-4.500,2.613,-15.393
4963818.000,-5.437,-3.916,-2.793,-19.180,-4.499,2.608,-15.391
4963835.000,-5.436,-3.914,-2.786,-19.176,-4.501,2.608,-15.393
4963854.000,-5.434,-3.910,-2.785,-19.176,-4.502,2.613,-15.395
4963871.000,-5.434,-3.908,-2.783,-19.172,-4.506,2.611,-15.394
4963889.000,-5.440,-3.907,-2.782,-19.170,-4.501,2.617,-15.394
4963907.000,-5.438,-3.921,-2.783,-19.174,-4.502,2.613,-15.397
4963926.000,-5.434,-3.903,-2.785,-19.176,-4.498,2.613,-15.394
4963944.000,-5.432,-3.905,-2.784,-19.174,-4.502,2.598,-15.393
4963963.000,-5.435,-3.912,-2.788,-19.178,-4.497,2.619,-15.393
4963981.000,-5.437,-3.906,-2.782,-19.176,-4.504,2.596,-15.389
4963999.000,-5.437,-3.916,-2.789,-19.175,-4.501,2.595,-15.395
4964018.000,-5.438,-3.914,-2.788,-19.172,-4.499,2.627,-15.395
4964035.000,-5.437,-3.915,-2.786,-19.175,-4.502,2.593,-15.393
4964052.000,-5.434,-3.911,-2.786,-19.179,-4.500,2.599,-15.396
4964068.000,-5.428,-3.913,-2.789,-19.178,-4.502,2.622,-15.391
4964086.000,-5.437,-3.914,-2.786,-19.174,-4.498,2.598,-15.387
4964102.000,-5.440,-3.914,-2.785,-19.174,-4.503,2.615,-15.400
4964121.000,-5.440,-3.912,-2.791,-19.178,-4.504,2.618,-15.391
4964138.000,-5.435,-3.913,-2.787,-19.178,-4.502,2.592,-15.398
4964156.000,-5.433,-3.906,-2.785,-19.176,-4.503,2.625,-15.399
4964174.000,-5.433,-3.913,-2.785,-19.176,-4.504,2.610,-15.393
4964191.000,-5.437,-3.911,-2.782,-19.175,-4.502,2.614,-15.394
4964209.000,-5.433,-3.910,-2.786,-19.174,-4.503,2.623,-15.394
4964226.000,-5.431,-3.911,-2.783,-19.176,-4.504,2.607,-15.394
4964244.000,-5.433,-3.910,-2.772,-19.178,-4.503,2.611,-15.394
4964261.000,-5.437,-3.910,-2.783,-19.171,-4.496,2.621,-15.387
4964279.000,-5.436,-3.913,-2.785,-19.174,-4.499,2.612,-15.391
4964296.000,-5.437,-3.913,-2.785,-19.174,-4.500,2.613,-15.392
4964314.000,-5.454,-3.914,-2.783,-19.177,-4.499,2.620,-15.388
4964332.000,-5.433,-3.910,-2.786,-19.176,-4.500,2.612,-15.389
4964349.000,-5.435,-3.911,-2.789,-19.178,-4.502,2.614,-15.391
4964367.000,-5.435,-3.912,-2.782,-19.174,-4.500,2.614,-15.389
4964385.000,-5.437,-3.913,-2.786,-19.172,-4.498,2.611,-15.392
4964403.000,-5.440,-3.914,-2.786,-19.177,-4.498,2.613,-15.395
4964420.000,-5.436,-3.913,-2.788,-19.178,-4.499,2.609,-15.392
4964439.000,-5.435,-3.911,-2.786,-19.178,-4.504,2.611,-15.392
4964455.000,-5.430,-3.911,-2.783,-19.172,-4.502,2.615,-15.395
4964472.000,-5.437,-3.910,-2.783,-19.170,-4.508,2.611,-15.392
4964489.000,-5.435,-3.911,-2.785,-19.172,-4.502,2.611,-15.394
4964506.000,-5.438,-3.908,-2.785,-19.176,-4.502,2.614,-15.394
4964522.000,-5.434,-3.908,-2.783,-19.176,-4.502,2.607,-15.393
4964540.000,-5.436,-3.905,-2.781,-19.173,-4.501,2.611,-15.396
4964558.000,-5.435,-3.911,-2.785,-19.173,-4.502,2.610,-15.394
4964574.000,-5.436,-3.909,-2.784,-19.172,-4.504,2.610,-15.389
4964591.000,-5.433,-3.905,-2.785,-19.175,-4.500,2.614,-15.397
4964608.000,-5.433,-3.907,-2.785,-19.169,-4.505,2.612,-15.396
4964628.000,-5.436,-3.912,-2.770,-19.171,-4.504,2.608,-15.387
4964644.000,-5.438,-3.909,-2.780,-19.172,-4.501,2.611,-15.395
4964661.000,-5.438,-3.912,-2.785,-19.176,-4.504,2.614,-15.392
4964679.000,-5.431,-3.912,-2.788,-19.176,-4.502,2.614,-15.392
4964698.000,-5.435,-3.914,-2.785,-19.178,-4.501,2.611,-15.394
4964715.000,-5.438,-3.908,-2.780,-19.179,-4.500,2.610,-15.390
4964732.000,-5.437,-3.910,-2.788,-19.177,-4.505,2.616,-15.391
4964749.000,-5.452,-3.914,-2.785,-19.176,-4.503,2.612,-15.390
4964768.000,-5.441,-3.912,-2.793,-19.179,-4.500,2.610,-15.389
4964784.000,-5.434,-3.912,-2.790,-19.181,-4.500,2.614,-15.393
4964802.000,-5.434,-3.908,-2.782,-19.173,-4.502,2.598,-15.394
4964820.000,-5.436,-3.910,-2.781,-19.174,-4.506,2.609,-15.393
4964837.000,-5.451,-3.915,-2.786,-19.170,-4.501,2.614,-15.393
4964854.000,-5.439,-3.912,-2.783,-19.179,-4.505,2.614,-15.390
4964872.000,-5.435,-3.911,-2.785,-19.178,-4.504,2.611,-15.392
4964890.000,-5.434,-3.909,-2.784,-19.178,-4.507,2.608,-15.394
4964907.000,-5.436,-3.910,-2.782,-19.172,-4.501,2.613,-15.396
4964925.000,-5.438,-3.911,-2.785,-19.173,-4.503,2.613,-15.394
4964942.000,-5.434,-3.912,-2.788,-19.172,-4.505,2.608,-15.392
4964960.000,-5.435,-3.909,-2.784,-19.178,-4.499,2.615,-15.393
4964977.000,-5.436,-3.908,-2.784,-19.175,-4.502,2.609,-15.395
4964996.000,-5.437,-3.908,-2.785,-19.172,-4.505,2.611,-15.390
4965013.000,-5.441,-3.914,-2.783,-19.174,-4.501,2.615,-15.388
4965031.000,-5.437,-3.911,-2.788,-19.178,-4.500,2.617,-15.390
4965048.000,-5.441,-3.918,-2.785,-19.174,-4.502,2.612,-15.392
4965066.000,-5.438,-3.912,-2.788,-19.177,-4.501,2.608,-15.392
4965083.000,-5.436,-3.910,-2.785,-19.179,-4.497,2.615,-15.390
4965101.000,-5.437,-3.910,-2.785,-19.176,-4.501,2.611,-15.392
4965119.000,-5.438,-3.914,-2.786,-19.175,-4.504,2.614,-15.392
4965136.000,-5.438,-3.915,-2.789,-19.174,-4.501,2.616,-15.391
4965154.000,-5.431,-3.912,-2.786,-19.180,-4.504,2.611,-15.391
4965173.000,-5.437,-3.911,-2.785,-19.176,-4.504,2.607,-15.392
4965190.000,-5.433,-3.911,-2.787,-19.177,-4.502,2.612,-15.392
4965207.000,-5.433,-3.910,-2.785,-19.172,-4.502,2.613,-15.396
4965224.000,-5.435,-3.910,-2.785,-19.174,-4.504,2.615,-15.392
4965244.000,-5.437,-3.911,-2.781,-19.170,-4.498,2.613,-15.391
4965262.000,-5.437,-3.911,-2.783,-19.175,-4.504,2.610,-15.397
4965279.000,-5.436,-3.910,-2.788,-19.174,-4.501,2.611,-15.388
4965297.000,-5.442,-3.916,-2.788,-19.177,-4.500,2.620,-15.388
4965315.000,-5.438,-3.913,-2.789,-19.178,-4.498,2.615,-15.392
4965332.000,-5.439,-3.910,-2.785,-19.175,-4.500,2.613,-15.391
4965348.000,-5.437,-3.914,-2.784,-19.174,-4.503,2.611,-15.388
4965366.000,-5.442,-3.911,-2.789,-19.175,-4.501,2.616,-15.391
4965383.000,-5.440,-3.915,-2.789,-19.177,-4.499,2.614,-15.392
4965400.000,-5.433,-3.915,-2.785,-19.180,-4.500,2.610,-15.394
4965417.000,-5.438,-3.914,-2.786,-19.176,-4.503,2.608,-15.393
4965434.000,-5.439,-3.913,-2.786,-19.172,-4.503,2.616,-15.389
4965452.000,-5.438,-3.916,-2.788,-19.175,-4.497,2.611,-15.396
4965469.000,-5.438,-3.914,-2.791,-19.182,-4.499,2.610,-15.391
4965487.000,-5.434,-3.911,-2.786,-19.179,-4.501,2.609,-15.391
4965504.000,-5.432,-3.907,-2.782,-19.178,-4.501,2.618,-15.395
4965522.000,-5.438,-3.908,-2.781,-19.171,-4.505,2.613,-15.392
4965540.000,-5.440,-3.913,-2.782,-19.173,-4.501,2.614,-15.394
4965557.000,-5.435,-3.911,-2.785,-19.176,-4.501,2.614,-15.393
4965574.000,-5.435,-3.911,-2.787,-19.175,-4.505,2.611,-15.395
4965592.000,-5.434,-3.909,-2.784,-19.174,-4.501,2.610,-15.395
4965609.000,-5.434,-3.912,-2.784,-19.170,-4.501,2.615,-15.393
4965625.000,-5.436,-3.913,-2.785,-19.175,-4.504,2.612,-15.393
4965642.000,-5.432,-3.911,-2.785,-19.174,-4.501,2.612,-15.397
4965660.000,-5.432,-3.908,-2.783,-19.173,-4.501,2.610,-15.392
4965677.000,-5.435,-3.913,-2.782,-19.173,-4.502,2.610,-15.392
4965695.000,-5.435,-3.912,-2.785,-19.176,-4.499,2.617,-15.391
4965713.000,-5.437,-3.908,-2.787,-19.175,-4.499,2.616,-15.393
4965731.000,-5.440,-3.913,-2.788,-19.179,-4.501,2.610,-15.394
4965749.000,-5.437,-3.914,-2.790,-19.180,-4.501,2.618,-15.390
4965768.000,-5.436,-3.915,-2.787,-19.175,-4.499,2.608,-15.390
4965786.000,-5.431,-3.910,-2.785,-19.174,-4.502,2.609,-15.390
4965804.000,-5.437,-3.909,-2.782,-19.174,-4.501,2.610,-15.389
4965822.000,-5.437,-3.918,-2.787,-19.174,-4.498,2.610,-15.392
4965839.000,-5.438,-3.914,-2.787,-19.176,-4.501,2.610,-15.395
4965855.000,-5.433,-3.912,-2.785,-19.179,-4.502,2.611,-15.391
4965872.000,-5.432,-3.911,-2.785,-19.173,-4.500,2.611,-15.390
4965889.000,-5.438,-3.906,-2.785,-19.174,-4.501,2.610,-15.392
4965906.000,-5.438,-3.911,-2.781,-19.175,-4.507,2.609,-15.392
4965923.000,-5.435,-3.914,-2.785,-19.174,-4.502,2.611,-15.390
4965940.000,-5.431,-3.911,-2.786,-19.172,-4.500,2.614,-15.393
4965958.000,-5.436,-3.910,-2.783,-19.172,-4.504,2.610,-15.393
4965977.000,-5.437,-3.908,-2.786,-19.172,-4.504,2.608,-15.389
4965995.000,-5.441,-3.910,-2.782,-19.178,-4.501,2.613,-15.391
4966014.000,-5.435,-3.910,-2.788,-19.174,-4.502,2.611,-15.392
4966032.000,-5.440,-3.914,-2.788,-19.174,-4.502,2.614,-15.390
4966049.000,-5.438,-3.915,-2.787,-19.179,-4.499,2.613,-15.387
4966066.000,-5.436,-3.911,-2.785,-19.180,-4.500,2.618,-15.389
4966083.000,-5.433,-3.911,-2.787,-19.172,-4.500,2.612,-15.395
4966101.000,-5.440,-3.917,-2.790,-19.177,-4.500,2.610,-15.388
4966117.000,-5.438,-3.914,-2.786,-19.179,-4.504,2.609,-15.390
4966135.000,-5.432,-3.913,-2.789,-19.180,-4.499,2.613,-15.392
4966153.000,-5.435,-3.911,-2.784,-19.177,-4.503,2.608,-15.392
4966172.000,-5.435,-3.909,-2.781,-19.171,-4.502,2.614,-15.392
4966189.000,-5.440,-3.909,-2.785,-19.173,-4.505,2.609,-15.393
4966207.000,-5.437,-3.916,-2.787,-19.174,-4.500,2.611,-15.392
4966225.000,-5.431,-3.911,-2.783,-19.175,-4.503,2.608,-15.394
4966242.000,-5.432,-3.911,-2.785,-19.174,-4.498,2.612,-15.392
4966260.000,-5.434,-3.911,-2.784,-19.175,-4.501,2.609,-15.394
4966278.000,-5.440,-3.911,-2.781,-19.176,-4.504,2.608,-15.389
4966295.000,-5.437,-3.911,-2.785,-19.179,-4.498,2.616,-15.387
4966312.000,-5.440,-3.915,-2.785,-19.178,-4.502,2.612,-15.390
4966330.000,-5.434,-3.912,-2.791,-19.176,-4.501,2.611,-15.389
4966348.000,-5.434,-3.910,-2.789,-19.178,-4.502,2.611,-15.389
4966365.000,-5.436,-3.915,-2.783,-19.176,-4.499,2.614,-15.391
4966383.000,-5.437,-3.907,-2.783,-19.174,-4.498,2.613,-15.393
4966401.000,-5.440,-3.913,-2.787,-19.174,-4.502,2.608,-15.392
4966418.000,-5.438,-3.916,-2.784,-19.181,-4.501,2.608,-15.390
4966436.000,-5.431,-3.911,-2.786,-19.174,-4.498,2.617,-15.391
4966453.000,-5.438,-3.909,-2.785,-19.177,-4.502,2.609,-15.395
4966471.000,-5.443,-3.916,-2.772,-19.176,-4.500,2.599,-15.392
4966488.000,-5.441,-3.917,-2.785,-19.177,-4.503,2.609,-15.395
4966505.000,-5.438,-3.912,-2.787,-19.181,-4.503,2.612,-15.393
4966523.000,-5.434,-3.908,-2.784,-19.179,-4.503,2.611,-15.390
4966540.000,-5.437,-3.911,-2.785,-19.181,-4.501,2.598,-15.392
4966558.000,-5.440,-3.911,-2.781,-19.175,-4.502,2.608,-15.392
4966575.000,-5.437,-3.908,-2.785,-19.175,-4.500,2.599,-15.395
4966591.000,-5.431,-3.912,-2.782,-19.180,-4.503,2.599,-15.391
4966607.000,-5.433,-3.911,-2.783,-19.178,-4.502,2.611,-15.392
4966626.000,-5.436,-3.909,-2.784,-19.176,-4.502,2.610,-15.391
4966643.000,-5.438,-3.913,-2.785,-19.176,-4.500,2.607,-15.394
4966660.000,-5.437,-3.914,-2.785,-19.178,-4.502,2.611,-15.393
4966677.000,-5.437,-3.908,-2.785,-19.181,-4.504,2.611,-15.392
4966695.000,-5.433,-3.907,-2.770,-19.175,-4.499,2.611,-15.390
4966712.000,-5.439,-3.910,-2.781,-19.174,-4.502,2.610,-15.393
4966729.000,-5.437,-3.912,-2.785,-19.179,-4.503,2.612,-15.387
4966747.000,-5.437,-3.912,-2.785,-19.176,-4.499,2.611,-15.389
4966764.000,-5.439,-3.914,-2.789,-19.177,-4.501,2.610,-15.388
4966781.000,-5.436,-3.911,-2.785,-19.181,-4.503,2.614,-15.390
4966798.000,-5.438,-3.911,-2.784,-19.176,-4.500,2.595,-15.391
4966816.000,-5.438,-3.914,-2.788,-19.182,-4.501,2.608,-15.387
4966834.000,-5.441,-3.915,-2.785,-19.177,-4.501,2.614,-15.391
4966851.000,-5.437,-3.915,-2.790,-19.180,-4.506,2.599,-15.389
4966869.000,-5.437,-3.912,-2.788,-19.179,-4.500,2.599,-15.391
4966886.000,-5.437,-3.910,-2.783,-19.176,-4.499,2.599,-15.391
4966904.000,-5.442,-3.911,-2.783,-19.172,-4.501,2.598,-15.392
4966921.000,-5.439,-3.911,-2.786,-19.172,-4.500,2.598,-15.392
4966939.000,-5.437,-3.913,-2.786,-19.178,-4.506,2.609,-15.391
4966956.000,-5.434,-3.911,-2.785,-19.176,-4.501,2.610,-15.394
4966972.000,-5.435,-3.910,-2.783,-19.174,-4.507,2.599,-15.396
4966989.000,-5.433,-3.911,-2.783,-19.173,-4.503,2.599,-15.392
4967007.000,-5.440,-3.914,-2.788,-19.177,-4.504,2.609,-15.392
4967025.000,-5.439,-3.911,-2.783,-19.176,-4.507,2.609,-15.395
4967042.000,-5.434,-3.909,-2.783,-19.179,-4.505,2.599,-15.391
4967059.000,-5.436,-3.909,-2.772,-19.175,-4.500,2.609,-15.392
4967077.000,-5.440,-3.911,-2.780,-19.175,-4.504,2.599,-15.391
4967096.000,-5.451,-3.913,-2.785,-19.177,-4.505,2.607,-15.389
4967113.000,-5.441,-3.915,-2.785,-19.176,-4.501,2.613,-15.390
4967130.000,-5.451,-3.913,-2.789,-19.176,-4.499,2.608,-15.391
4967147.000,-5.437,-3.912,-2.790,-19.181,-4.500,2.612,-15.391
4967165.000,-5.441,-3.914,-2.786,-19.179,-4.502,2.610,-15.389
4967182.000,-5.438,-3.915,-2.786,-19.179,-4.500,2.614,-15.391
4967200.000,-5.442,-3.914,-2.785,-19.178,-4.502,2.615,-15.390
4967217.000,-5.433,-3.917,-2.788,-19.179,-4.503,2.609,-15.391
4967235.000,-5.437,-3.909,-2.783,-19.179,-4.499,2.607,-15.390
4967254.000,-5.435,-3.913,-2.782,-19.180,-4.500,2.609,-15.391
4967271.000,-5.437,-3.911,-2.785,-19.175,-4.499,2.598,-15.392
4967289.000,-5.440,-3.911,-2.785,-19.176,-4.505,2.608,-15.392
4967308.000,-5.437,-3.915,-2.786,-19.175,-4.503,2.599,-15.395
4967326.000,-5.435,-3.911,-2.783,-19.179,-4.508,2.607,-15.395
4967343.000,-5.432,-3.910,-2.782,-19.177,-4.506,2.609,-15.388
4967361.000,-5.437,-3.909,-2.784,-19.172,-4.503,2.609,-15.392
4967378.000,-5.437,-3.909,-2.786,-19.177,-4.502,2.609,-15.397
4967395.000,-5.437,-3.912,-2.787,-19.175,-4.503,2.597,-15.395
4967412.000,-5.432,-3.911,-2.783,-19.179,-4.507,2.609,-15.392
4967429.000,-5.432,-3.913,-2.772,-19.181,-4.502,2.613,-15.391
4967447.000,-5.438,-3.913,-2.784,-19.178,-4.504,2.609,-15.393
4967464.000,-5.437,-3.913,-2.788,-19.179,-4.502,2.609,-15.393
4967482.000,-5.441,-3.916,-2.786,-19.177,-4.500,2.614,-15.390
4967499.000,-5.441,-3.914,-2.789,-19.181,-4.501,2.610,-15.387
4967517.000,-5.441,-3.912,-2.787,-19.181,-4.499,2.597,-15.394
4967534.000,-5.438,-3.912,-2.788,-19.179,-4.502,2.611,-15.391
4967552.000,-5.434,-3.915,-2.782,-19.177,-4.500,2.614,-15.390
4967569.000,-5.443,-3.914,-2.785,-19.176,-4.502,2.608,-15.390
4967587.000,-5.439,-3.913,-2.791,-19.182,-4.501,2.596,-15.388
4967605.000,-5.439,-3.913,-2.772,-19.175,-4.502,2.607,-15.391
4967622.000,-5.439,-3.913,-2.789,-19.184,-4.502,2.599,-15.394
4967639.000,-5.437,-3.912,-2.782,-19.181,-4.505,2.608,-15.394
4967657.000,-5.435,-3.911,-2.782,-19.177,-4.503,2.610,-15.394
4967675.000,-5.437,-3.911,-2.782,-19.177,-4.504,2.611,-15.393
4967693.000,-5.437,-3.910,-2.781,-19.176,-4.509,2.608,-15.394
4967711.000,-5.436,-3.911,-2.788,-19.179,-4.507,2.613,-15.393
4967729.000,-5.442,-3.911,-2.785,-19.177,-4.502,2.612,-15.390
4967747.000,-5.435,-3.916,-2.790,-19.180,-4.503,2.609,-15.387
4967764.000,-5.440,-3.910,-2.789,-19.178,-4.507,2.607,-15.390
4967781.000,-5.439,-3.912,-2.785,-19.179,-4.502,2.612,-15.390
4967798.000,-5.440,-3.911,-2.785,-19.178,-4.502,2.613,-15.391
4967816.000,-5.440,-3.913,-2.787,-19.179,-4.506,2.613,-15.392
4967834.000,-5.441,-3.912,-2.788,-19.181,-4.505,2.598,-15.390
4967853.000,-5.437,-3.909,-2.785,-19.183,-4.507,2.614,-15.388
4967870.000,-5.433,-3.911,-2.782,-19.178,-4.506,2.609,-15.395
4967888.000,-5.436,-3.909,-2.771,-19.176,-4.506,2.608,-15.393
4967906.000,-5.442,-3.910,-2.785,-19.179,-4.504,2.599,-15.396
4967924.000,-5.437,-3.913,-2.788,-19.176,-4.506,2.609,-15.392
4967941.000,-5.434,-3.911,-2.785,-19.179,-4.506,2.599,-15.394
4967959.000,-5.432,-3.910,-2.782,-19.176,-4.506,2.614,-15.392
4967977.000,-5.434,-3.908,-2.780,-19.175,-4.505,2.612,-15.391
4967995.000,-5.438,-3.909,-2.780,-19.179,-4.505,2.608,-15.393
4968013.000,-5.434,-3.912,-2.787,-19.180,-4.503,2.613,-15.391
4968031.000,-5.441,-3.914,-2.787,-19.178,-4.502,2.608,-15.391
4968049.000,-5.441,-3.910,-2.785,-19.180,-4.500,2.615,-15.389
4968067.000,-5.438,-3.912,-2.786,-19.184,-4.501,2.609,-15.388
4968084.000,-5.440,-3.911,-2.783,-19.177,-4.506,2.608,-15.387
4968101.000,-5.453,-3.911,-2.786,-19.179,-4.504,2.613,-15.390
4968117.000,-5.442,-3.914,-2.788,-19.180,-4.501,2.598,-15.389
4968134.000,-5.440,-3.917,-2.787,-19.181,-4.507,2.595,-15.390
4968151.000,-5.438,-3.912,-2.783,-19.180,-4.503,2.609,-15.389
4968169.000,-5.437,-3.912,-2.782,-19.174,-4.499,2.612,-15.392
4968186.000,-5.440,-3.920,-2.790,-19.177,-4.503,2.609,-15.391
4968204.000,-5.441,-3.913,-2.786,-19.184,-4.504,2.598,-15.388
4968221.000,-5.436,-3.911,-2.781,-19.177,-4.504,2.609,-15.393
4968240.000,-5.435,-3.914,-2.771,-19.178,-4.505,2.610,-15.395
4968258.000,-5.432,-3.909,-2.781,-19.178,-4.506,2.610,-15.391
4968276.000,-5.437,-3.912,-2.783,-19.175,-4.501,2.610,-15.392
4968294.000,-5.440,-3.914,-2.784,-19.176,-4.503,2.598,-15.392
4968312.000,-5.438,-3.911,-2.788,-19.179,-4.502,2.612,-15.389
4968331.000,-5.440,-3.918,-2.786,-19.177,-4.506,2.611,-15.388
4968348.000,-5.440,-3.912,-2.789,-19.181,-4.502,2.615,-15.390
4968366.000,-5.437,-3.908,-2.782,-19.178,-4.506,2.607,-15.390
4968384.000,-5.437,-3.912,-2.782,-19.177,-4.505,2.609,-15.394
4968401.000,-5.440,-3.912,-2.784,-19.179,-4.502,2.613,-15.389
4968418.000,-5.436,-3.916,-2.785,-19.186,-4.502,2.598,-15.391
4968435.000,-5.436,-3.914,-2.785,-19.182,-4.501,2.599,-15.390
4968453.000,-5.430,-3.909,-2.782,-19.179,-4.501,2.609,-15.389
4968471.000,-5.438,-3.913,-2.782,-19.176,-4.504,2.597,-15.393
4968488.000,-5.439,-3.913,-2.790,-19.175,-4.501,2.609,-15.390
4968506.000,-5.436,-3.915,-2.787,-19.179,-4.502,2.609,-15.391
4968524.000,-5.434,-3.908,-2.782,-19.180,-4.505,2.609,-15.394
4968542.000,-5.435,-3.912,-2.782,-19.180,-4.508,2.612,-15.394
4968559.000,-5.438,-3.912,-2.782,-19.174,-4.506,2.612,-15.392
4968576.000,-5.440,-3.914,-2.782,-19.178,-4.502,2.614,-15.392
4968594.000,-5.433,-3.915,-2.787,-19.175,-4.503,2.610,-15.393
4968611.000,-5.431,-3.908,-2.783,-19.180,-4.507,2.609,-15.391
4968628.000,-5.432,-3.909,-2.782,-19.176,-4.505,2.609,-15.390
4968645.000,-5.435,-3.911,-2.783,-19.176,-4.502,2.609,-15.387
4968662.000,-5.437,-3.912,-2.782,-19.176,-4.501,2.614,-15.391
4968679.000,-5.438,-3.912,-2.783,-19.183,-4.504,2.612,-15.389
4968697.000,-5.434,-3.913,-2.789,-19.180,-4.504,2.615,-15.387
4968715.000,-5.438,-3.913,-2.787,-19.183,-4.501,2.614,-15.387
4968734.000,-5.438,-3.911,-2.785,-19.179,-4.501,2.599,-15.389
4968751.000,-5.437,-3.910,-2.787,-19.176,-4.507,2.609,-15.390
4968768.000,-5.438,-3.914,-2.789,-19.180,-4.504,2.612,-15.386
4968785.000,-5.436,-3.912,-2.791,-19.181,-4.500,2.618,-15.391
4968803.000,-5.437,-3.910,-2.783,-19.179,-4.505,2.610,-15.392
4968822.000,-5.434,-3.911,-2.780,-19.177,-4.502,2.612,-15.392
4968839.000,-5.433,-3.911,-2.782,-19.177,-4.504,2.611,-15.393
4968857.000,-5.436,-3.913,-2.784,-19.172,-4.505,2.613,-15.391
4968874.000,-5.437,-3.911,-2.784,-19.178,-4.502,2.610,-15.389
4968892.000,-5.437,-3.911,-2.784,-19.178,-4.506,2.619,-15.390
4968909.000,-5.432,-3.906,-2.783,-19.175,-4.502,2.618,-15.395
4968926.000,-5.437,-3.913,-2.782,-19.175,-4.506,2.614,-15.392
4968945.000,-5.438,-3.912,-2.785,-19.176,-4.502,2.618,-15.391
4968962.000,-5.439,-3.911,-2.789,-19.177,-4.502,2.619,-15.393
4968980.000,-5.441,-3.917,-2.785,-19.177,-4.500,2.616,-15.387
4968999.000,-5.437,-3.914,-2.786,-19.181,-4.502,2.618,-15.391
4969017.000,-5.434,-3.912,-2.785,-19.180,-4.500,2.612,-15.389
4969036.000,-5.437,-3.910,-2.786,-19.179,-4.503,2.616,-15.388
4969053.000,-5.438,-3.913,-2.784,-19.175,-4.501,2.619,-15.388
4969070.000,-5.443,-3.913,-2.786,-19.177,-4.502,2.615,-15.388
4969086.000,-5.441,-3.912,-2.790,-19.179,-4.502,2.613,-15.388
4969104.000,-5.434,-3.912,-2.784,-19.176,-4.504,2.615,-15.390
4969121.000,-5.436,-3.911,-2.782,-19.176,-4.506,2.616,-15.389
4969138.000,-5.442,-3.911,-2.784,-19.173,-4.503,2.615,-15.393
4969157.000,-5.436,-3.911,-2.785,-19.178,-4.503,2.613,-15.392
4969175.000,-5.438,-3.911,-2.788,-19.177,-4.499,2.618,-15.390
4969193.000,-5.433,-3.912,-2.783,-19.182,-4.507,2.618,-15.392
4969212.000,-5.436,-3.910,-2.784,-19.179,-4.501,2.619,-15.392
4969231.000,-5.436,-3.913,-2.781,-19.180,-4.498,2.621,-15.389
4969248.000,-5.438,-3.913,-2.785,-19.176,-4.501,2.619,-15.392
4969266.000,-5.440,-3.913,-2.784,-19.177,-4.506,2.614,-15.390
4969284.000,-5.440,-3.912,-2.789,-19.180,-4.499,2.614,-15.388
4969301.000,-5.437,-3.916,-2.787,-19.183,-4.502,2.620,-15.394
4969319.000,-5.432,-3.910,-2.786,-19.175,-4.503,2.614,-15.389
4969337.000,-5.437,-3.911,-2.780,-19.178,-4.500,2.614,-15.391
4969354.000,-5.443,-3.916,-2.771,-19.175,-4.502,2.617,-15.394
4969371.000,-5.437,-3.914,-2.789,-19.181,-4.502,2.614,-15.394
4969389.000,-5.433,-3.910,-2.787,-19.184,-4.505,2.616,-15.391
4969407.000,-5.435,-3.911,-2.783,-19.178,-4.503,2.618,-15.390
4969424.000,-5.432,-3.909,-2.785,-19.178,-4.502,2.615,-15.394
4969442.000,-5.435,-3.911,-2.783,-19.173,-4.506,2.616,-15.393
4969459.000,-5.437,-3.916,-2.788,-19.178,-4.506,2.616,-15.392
4969477.000,-5.435,-3.911,-2.788,-19.176,-4.501,2.618,-15.390
4969494.000,-5.434,-3.910,-2.783,-19.179,-4.499,2.619,-15.393
4969512.000,-5.437,-3.910,-2.781,-19.175,-4.505,2.619,-15.385
4969529.000,-5.435,-3.912,-2.785,-19.177,-4.499,2.623,-15.390
4969547.000,-5.440,-3.913,-2.787,-19.180,-4.499,2.622,-15.392
4969564.000,-5.438,-3.916,-2.784,-19.182,-4.501,2.622,-15.390
4969581.000,-5.436,-3.912,-2.788,-19.184,-4.503,2.613,-15.391
4969598.000,-5.433,-3.911,-2.785,-19.178,-4.501,2.624,-15.388
4969616.000,-5.438,-3.911,-2.784,-19.179,-4.500,2.620,-15.390
4969634.000,-5.441,-3.913,-2.787,-19.175,-4.503,2.619,-15.392
4969652.000,-5.437,-3.915,-2.789,-19.178,-4.502,2.618,-15.388
4969669.000,-5.436,-3.911,-2.788,-19.183,-4.502,2.619,-15.392
4969687.000,-5.436,-3.911,-2.784,-19.176,-4.505,2.617,-15.390
4969705.000,-5.430,-3.912,-2.783,-19.176,-4.505,2.615,-15.391
4969722.000,-5.440,-3.911,-2.771,-19.176,-4.503,2.619,-15.395
4969739.000,-5.439,-3.914,-2.785,-19.174,-4.505,2.616,-15.393
4969756.000,-5.435,-3.911,-2.787,-19.181,-4.507,2.616,-15.391
4969774.000,-5.433,-3.909,-2.781,-19.177,-4.505,2.616,-15.390
4969791.000,-5.435,-3.908,-2.770,-19.177,-4.504,2.618,-15.390
4969808.000,-5.438,-3.911,-2.784,-19.174,-4.507,2.616,-15.393
4969826.000,-5.440,-3.911,-2.787,-19.174,-4.502,2.617,-15.394
4969843.000,-5.434,-3.911,-2.784,-19.178,-4.503,2.622,-15.387
4969861.000,-5.432,-3.910,-2.781,-19.180,-4.503,2.621,-15.393
4969878.000,-5.435,-3.911,-2.780,-19.176,-4.504,2.622,-15.396
4969895.000,-5.440,-3.912,-2.783,-19.176,-4.508,2.617,-15.392
4969913.000,-5.439,-3.912,-2.787,-19.177,-4.501,2.622,-15.388
4969930.000,-5.439,-3.914,-2.785,-19.178,-4.504,2.619,-15.391
4969948.000,-5.436,-3.914,-2.788,-19.183,-4.505,2.620,-15.391
4969965.000,-5.439,-3.912,-2.787,-19.180,-4.504,2.617,-15.387
4969983.000,-5.438,-3.917,-2.783,-19.178,-4.501,2.622,-15.391
4970000.000,-5.441,-3.915,-2.787,-19.180,-4.499,2.624,-15.392
4970018.000,-5.437,-3.910,-2.783,-19.177,-4.504,2.615,-15.391
4970035.000,-5.441,-3.911,-2.786,-19.178,-4.505,2.619,-15.392
4970053.000,-5.440,-3.915,-2.787,-19.180,-4.502,2.617,-15.393
4970070.000,-5.438,-3.915,-2.785,-19.181,-4.504,2.616,-15.392
4970088.000,-5.433,-3.912,-2.784,-19.179,-4.502,2.614,-15.390
4970106.000,-5.437,-3.909,-2.785,-19.174,-4.503,2.618,-15.395
4970123.000,-5.441,-3.910,-2.783,-19.172,-4.506,2.616,-15.389
4970141.000,-5.440,-3.914,-2.785,-19.179,-4.506,2.614,-15.394
4970158.000,-5.433,-3.915,-2.785,-19.181,-4.503,2.618,-15.390
4970176.000,-5.432,-3.911,-2.785,-19.179,-4.501,2.617,-15.391
4970193.000,-5.437,-3.910,-2.783,-19.176,-4.505,2.619,-15.394
4970211.000,-5.437,-3.912,-2.784,-19.176,-4.505,2.612,-15.388
4970228.000,-5.436,-3.915,-2.782,-19.180,-4.501,2.623,-15.389
4970246.000,-5.441,-3.916,-2.784,-19.177,-4.500,2.621,-15.390
4970263.000,-5.438,-3.916,-2.788,-19.180,-4.503,2.616,-15.386
4970281.000,-5.437,-3.912,-2.787,-19.180,-4.503,2.624,-15.386
4970298.000,-5.438,-3.912,-2.790,-19.177,-4.503,2.624,-15.387
4970316.000,-5.437,-3.914,-2.785,-19.180,-4.502,2.626,-15.389
4970333.000,-5.443,-3.916,-2.789,-19.179,-4.503,2.616,-15.390
4970351.000,-5.439,-3.913,-2.787,-19.185,-4.501,2.620,-15.386
4970368.000,-5.439,-3.911,-2.785,-19.181,-4.499,2.623,-15.390
4970386.000,-5.437,-3.913,-2.781,-19.179,-4.505,2.615,-15.390
4970403.000,-5.437,-3.912,-2.785,-19.178,-4.504,2.612,-15.393
4970420.000,-5.443,-3.913,-2.785,-19.182,-4.504,2.620,-15.396
4970438.000,-5.439,-3.913,-2.789,-19.181,-4.507,2.616,-15.391
4970456.000,-5.434,-3.911,-2.784,-19.176,-4.505,2.624,-15.393
4970474.000,-5.436,-3.909,-2.781,-19.174,-4.507,2.621,-15.392
4970491.000,-5.438,-3.912,-2.782,-19.174,-4.505,2.619,-15.392
4970509.000,-5.441,-3.911,-2.783,-19.178,-4.505,2.620,-15.396
4970526.000,-5.437,-3.911,-2.786,-19.179,-4.506,2.616,-15.388
4970544.000,-5.437,-3.911,-2.782,-19.179,-4.500,2.627,-15.389
4970561.000,-5.435,-3.909,-2.784,-19.177,-4.502,2.627,-15.390
4970578.000,-5.440,-3.910,-2.785,-19.175,-4.502,2.622,-15.391
4970596.000,-5.440,-3.916,-2.782,-19.176,-4.502,2.628,-15.387
4970613.000,-5.441,-3.909,-2.784,-19.179,-4.502,2.622,-15.389
4970631.000,-5.434,-3.914,-2.792,-19.178,-4.503,2.623,-15.392
4970647.000,-5.435,-3.910,-2.782,-19.179,-4.506,2.623,-15.388
4970665.000,-5.440,-3.912,-2.785,-19.177,-4.502,2.622,-15.388
4970683.000,-5.437,-3.910,-2.785,-19.178,-4.499,2.623,-15.390
4970700.000,-5.441,-3.917,-2.785,-19.178,-4.502,2.624,-15.390
4970716.000,-5.437,-3.913,-2.788,-19.180,-4.504,2.614,-15.390
4970734.000,-5.437,-3.913,-2.785,-19.179,-4.502,2.621,-15.389
4970751.000,-5.440,-3.912,-2.786,-19.177,-4.499,2.626,-15.391
4970769.000,-5.440,-3.918,-2.789,-19.178,-4.501,2.618,-15.391
4970786.000,-5.439,-3.915,-2.789,-19.177,-4.503,2.617,-15.393
4970803.000,-5.438,-3.913,-2.784,-19.182,-4.504,2.618,-15.392
4970821.000,-5.441,-3.910,-2.785,-19.179,-4.504,2.623,-15.394
4970838.000,-5.435,-3.909,-2.783,-19.176,-4.503,2.623,-15.392
4970856.000,-5.443,-3.916,-2.782,-19.178,-4.502,2.619,-15.390
4970873.000,-5.436,-3.914,-2.789,-19.176,-4.502,2.623,-15.391
4970890.000,-5.436,-3.908,-2.784,-19.179,-4.506,2.624,-15.391
4970908.000,-5.435,-3.911,-2.782,-19.178,-4.504,2.618,-15.390
4970925.000,-5.436,-3.911,-2.782,-19.178,-4.502,2.622,-15.394
4970943.000,-5.438,-3.911,-2.785,-19.175,-4.502,2.620,-15.391
4970960.000,-5.437,-3.908,-2.782,-19.179,-4.500,2.620,-15.389
4970978.000,-5.436,-3.915,-2.786,-19.178,-4.502,2.621,-15.390
4970996.000,-5.435,-3.910,-2.780,-19.179,-4.498,2.623,-15.390
4971013.000,-5.439,-3.914,-2.783,-19.174,-4.506,2.616,-15.392
4971031.000,-5.439,-3.911,-2.787,-19.178,-4.502,2.623,-15.392
4971048.000,-5.439,-3.912,-2.789,-19.175,-4.497,2.624,-15.391
4971066.000,-5.441,-3.914,-2.785,-19.181,-4.504,2.620,-15.392
4971083.000,-5.435,-3.909,-2.790,-19.182,-4.506,2.616,-15.391
4971101.000,-5.440,-3.911,-2.780,-19.179,-4.503,2.618,-15.389
4971118.000,-5.439,-3.914,-2.782,-19.176,-4.501,2.622,-15.390
4971136.000,-5.452,-3.917,-2.788,-19.175,-4.504,2.614,-15.392
4971153.000,-5.438,-3.911,-2.787,-19.183,-4.506,2.618,-15.391
4971171.000,-5.437,-3.913,-2.785,-19.178,-4.503,2.617,-15.394
4971188.000,-5.436,-3.911,-2.783,-19.178,-4.505,2.620,-15.392
4971207.000,-5.436,-3.908,-2.782,-19.174,-4.503,2.615,-15.391
4971224.000,-5.441,-3.910,-2.783,-19.176,-4.503,2.619,-15.394
4971242.000,-5.434,-3.912,-2.785,-19.175,-4.503,2.616,-15.391
4971259.000,-5.436,-3.911,-2.785,-19.179,-4.508,2.618,-15.392
4971277.000,-5.435,-3.907,-2.783,-19.175,-4.505,2.620,-15.392
4971294.000,-5.438,-3.909,-2.783,-19.175,-4.506,2.620,-15.391
4971311.000,-5.440,-3.914,-2.782,-19.177,-4.504,2.616,-15.395
4971329.000,-5.437,-3.911,-2.782,-19.176,-4.504,2.616,-15.389
4971346.000,-5.443,-3.914,-2.785,-19.176,-4.503,2.617,-15.391
4971364.000,-5.436,-3.911,-2.790,-19.183,-4.499,2.620,-15.392
4971381.000,-5.434,-3.908,-2.784,-19.181,-4.506,2.619,-15.389
4971399.000,-5.437,-3.911,-2.785,-19.176,-4.503,2.620,-15.390
4971416.000,-5.441,-3.914,-2.788,-19.179,-4.500,2.616,-15.390
4971434.000,-5.440,-3.914,-2.786,-19.178,-4.501,2.618,-15.392
4971451.000,-5.437,-3.915,-2.789,-19.177,-4.503,2.610,-15.392
4971469.000,-5.437,-3.911,-2.782,-19.179,-4.506,2.618,-15.390
4971487.000,-5.437,-3.911,-2.785,-19.176,-4.506,2.612,-15.392
4971504.000,-5.453,-3.915,-2.771,-19.172,-4.504,2.617,-15.393
4971522.000,-5.440,-3.914,-2.787,-19.174,-4.504,2.612,-15.389
4971539.000,-5.436,-3.914,-2.783,-19.184,-4.504,2.618,-15.393
4971556.000,-5.439,-3.911,-2.783,-19.180,-4.502,2.618,-15.394
4971574.000,-5.438,-3.911,-2.783,-19.174,-4.504,2.617,-15.391
4971591.000,-5.438,-3.909,-2.784,-19.176,-4.502,2.614,-15.392
4971609.000,-5.440,-3.914,-2.783,-19.180,-4.504,2.618,-15.392
4971626.000,-5.437,-3.912,-2.788,-19.179,-4.506,2.614,-15.399
4971644.000,-5.435,-3.909,-2.781,-19.177,-4.506,2.611,-15.392
4971661.000,-5.433,-3.910,-2.782,-19.175,-4.501,2.620,-15.390
4971679.000,-5.438,-3.914,-2.785,-19.179,-4.502,2.620,-15.391
4971696.000,-5.437,-3.912,-2.785,-19.179,-4.505,2.619,-15.392
4971714.000,-5.451,-3.913,-2.785,-19.177,-4.502,2.620,-15.389
4971732.000,-5.441,-3.911,-2.788,-19.182,-4.500,2.622,-15.391
4971749.000,-5.440,-3.908,-2.783,-19.184,-4.502,2.620,-15.394
4971766.000,-5.440,-3.910,-2.785,-19.175,-4.505,2.614,-15.391
4971784.000,-5.441,-3.914,-2.786,-19.176,-4.504,2.619,-15.390
4971800.000,-5.441,-3.914,-2.787,-19.180,-4.503,2.622,-15.390
4971818.000,-5.442,-3.913,-2.788,-19.179,-4.501,2.616,-15.394
4971835.000,-5.437,-3.911,-2.782,-19.178,-4.506,2.615,-15.391
4971852.000,-5.435,-3.911,-2.784,-19.176,-4.505,2.611,-15.390
4971869.000,-5.454,-3.916,-2.784,-19.177,-4.504,2.618,-15.393
4971887.000,-5.440,-3.912,-2.787,-19.182,-4.504,2.616,-15.393
4971904.000,-5.435,-3.913,-2.784,-19.176,-4.505,2.611,-15.390
4971922.000,-5.434,-3.909,-2.781,-19.178,-4.502,2.617,-15.395
4971939.000,-5.437,-3.908,-2.770,-19.178,-4.507,2.617,-15.392
4971957.000,-5.438,-3.911,-2.783,-19.174,-4.506,2.613,-15.394
4971974.000,-5.437,-3.914,-2.784,-19.179,-4.502,2.617,-15.393
4971992.000,-5.437,-3.911,-2.782,-19.182,-4.504,2.618,-15.395
4972010.000,-5.436,-3.910,-2.782,-19.175,-4.503,2.619,-15.397
4972027.000,-5.439,-3.912,-2.784,-19.174,-4.504,2.614,-15.389
4972044.000,-5.434,-3.914,-2.784,-19.173,-4.500,2.619,-15.395
4972062.000,-5.437,-3.914,-2.786,-19.176,-4.505,2.619,-15.394
4972079.000,-5.439,-3.916,-2.785,-19.178,-4.502,2.615,-15.391
4972096.000,-5.435,-3.911,-2.789,-19.182,-4.502,2.618,-15.392
4972114.000,-5.437,-3.912,-2.784,-19.181,-4.503,2.620,-15.390
4972132.000,-5.435,-3.912,-2.784,-19.177,-4.503,2.616,-15.392
4972150.000,-5.442,-3.911,-2.785,-19.178,-4.505,2.614,-15.389
4972167.000,-5.440,-3.916,-2.785,-19.179,-4.504,2.620,-15.391
4972185.000,-5.435,-3.914,-2.788,-19.181,-4.502,2.619,-15.392
4972202.000,-5.434,-3.911,-2.784,-19.180,-4.504,2.613,-15.395
4972220.000,-5.437,-3.910,-2.783,-19.179,-4.506,2.609,-15.395
4972237.000,-5.440,-3.915,-2.782,-19.175,-4.502,2.612,-15.394
4972255.000,-5.434,-3.912,-2.786,-19.177,-4.506,2.608,-15.394
4972272.000,-5.436,-3.913,-2.785,-19.183,-4.505,2.614,-15.389
4972290.000,-5.432,-3.914,-2.782,-19.178,-4.506,2.616,-15.392
4972307.000,-5.433,-3.908,-2.785,-19.179,-4.508,2.614,-15.393
4972325.000,-5.438,-3.911,-2.784,-19.175,-4.507,2.614,-15.397
4972342.000,-5.443,-3.913,-2.781,-19.177,-4.509,2.617,-15.393
4972360.000,-5.434,-3.911,-2.787,-19.177,-4.500,2.614,-15.394
4972377.000,-5.432,-3.908,-2.783,-19.179,-4.503,2.618,-15.397
4972395.000,-5.436,-3.911,-2.782,-19.174,-4.504,2.614,-15.392
4972412.000,-5.433,-3.906,-2.784,-19.179,-4.506,2.619,-15.392
4972429.000,-5.438,-3.909,-2.785,-19.178,-4.503,2.618,-15.395
4972447.000,-5.438,-3.909,-2.785,-19.178,-4.504,2.616,-15.391
4972464.000,-5.441,-3.912,-2.783,-19.176,-4.504,2.619,-15.390
4972483.000,-5.438,-3.914,-2.787,-19.178,-4.505,2.620,-15.391
4972499.000,-5.438,-3.911,-2.788,-19.183,-4.501,2.620,-15.393
4972517.000,-5.436,-3.908,-2.784,-19.179,-4.506,2.615,-15.393
4972534.000,-5.435,-3.912,-2.783,-19.178,-4.502,2.613,-15.392
4972552.000,-5.442,-3.913,-2.785,-19.174,-4.502,2.617,-15.394
4972569.000,-5.440,-3.915,-2.785,-19.182,-4.505,2.618,-15.395
4972587.000,-5.434,-3.912,-2.784,-19.182,-4.509,2.616,-15.395
4972604.000,-5.432,-3.908,-2.784,-19.174,-4.504,2.618,-15.392
4972622.000,-5.434,-3.909,-2.781,-19.177,-4.506,2.615,-15.398
4972639.000,-5.437,-3.909,-2.781,-19.174,-4.507,2.614,-15.393
4972657.000,-5.435,-3.911,-2.782,-19.181,-4.500,2.616,-15.392
4972674.000,-5.432,-3.912,-2.785,-19.180,-4.506,2.614,-15.395
4972692.000,-5.433,-3.910,-2.783,-19.177,-4.506,2.615,-15.394
4972709.000,-5.433,-3.911,-2.784,-19.174,-4.508,2.617,-15.395
4972728.000,-5.433,-3.911,-2.785,-19.177,-4.505,2.620,-15.392
4972746.000,-5.437,-3.910,-2.786,-19.176,-4.503,2.614,-15.394
4972763.000,-5.440,-3.915,-2.782,-19.179,-4.503,2.612,-15.393
4972781.000,-5.439,-3.912,-2.785,-19.180,-4.502,2.618,-15.392
4972798.000,-5.435,-3.912,-2.783,-19.183,-4.500,2.620,-15.390
4972816.000,-5.438,-3.911,-2.783,-19.180,-4.503,2.614,-15.391
4972834.000,-5.438,-3.913,-2.789,-19.177,-4.502,2.618,-15.391
4972852.000,-5.435,-3.915,-2.785,-19.180,-4.504,2.621,-15.395
4972869.000,-5.436,-3.913,-2.788,-19.180,-4.507,2.614,-15.393
4972886.000,-5.433,-3.908,-2.785,-19.178,-4.504,2.614,-15.393
4972904.000,-5.431,-3.910,-2.782,-19.175,-4.509,2.612,-15.398
4972922.000,-5.438,-3.907,-2.786,-19.174,-4.501,2.614,-15.395
4972939.000,-5.436,-3.911,-2.783,-19.177,-4.503,2.611,-15.395
4972957.000,-5.436,-3.911,-2.787,-19.179,-4.504,2.614,-15.397
4972974.000,-5.435,-3.910,-2.780,-19.174,-4.504,2.612,-15.396
4972992.000,-5.434,-3.909,-2.782,-19.175,-4.506,2.617,-15.396
4973009.000,-5.436,-3.908,-2.785,-19.174,-4.504,2.620,-15.392
4973028.000,-5.435,-3.907,-2.787,-19.176,-4.503,2.615,-15.393
4973045.000,-5.437,-3.911,-2.785,-19.175,-4.504,2.616,-15.394
4973063.000,-5.434,-3.914,-2.785,-19.180,-4.504,2.615,-15.389
4973080.000,-5.437,-3.908,-2.784,-19.181,-4.499,2.620,-15.390
4973097.000,-5.436,-3.911,-2.783,-19.180,-4.500,2.618,-15.393
4973116.000,-5.435,-3.916,-2.784,-19.178,-4.502,2.614,-15.393
4973133.000,-5.440,-3.914,-2.785,-19.181,-4.502,2.619,-15.396
4973150.000,-5.436,-3.911,-2.785,-19.180,-4.503,2.616,-15.391
4973168.000,-5.437,-3.912,-2.788,-19.181,-4.502,2.616,-15.392
4973185.000,-5.435,-3.910,-2.780,-19.180,-4.504,2.613,-15.395
4973202.000,-5.439,-3.915,-2.785,-19.175,-4.504,2.613,-15.392
4973220.000,-5.438,-3.914,-2.785,-19.178,-4.502,2.615,-15.393
4973238.000,-5.435,-3.913,-2.785,-19.181,-4.506,2.610,-15.393
4973254.000,-5.435,-3.914,-2.784,-19.178,-4.504,2.614,-15.397
4973271.000,-5.435,-3.911,-2.780,-19.179,-4.501,2.614,-15.395
4973289.000,-5.435,-3.910,-2.781,-19.170,-4.502,2.614,-15.397
4973307.000,-5.440,-3.909,-2.785,-19.180,-4.503,2.615,-15.397
4973324.000,-5.437,-3.911,-2.785,-19.180,-4.503,2.613,-15.393
4973341.000,-5.434,-3.908,-2.781,-19.177,-4.507,2.617,-15.396
4973358.000,-5.436,-3.908,-2.781,-19.177,-4.502,2.615,-15.396
4973375.000,-5.437,-3.910,-2.784,-19.175,-4.500,2.616,-15.396
4973393.000,-5.437,-3.911,-2.785,-19.176,-4.506,2.615,-15.393
4973411.000,-5.440,-3.910,-2.785,-19.177,-4.503,2.615,-15.395
4973428.000,-5.435,-3.908,-2.789,-19.179,-4.503,2.615,-15.396
4973446.000,-5.435,-3.908,-2.780,-19.180,-4.503,2.616,-15.395
4973464.000,-5.439,-3.911,-2.785,-19.172,-4.504,2.619,-15.394
4973482.000,-5.440,-3.914,-2.786,-19.178,-4.502,2.622,-15.395
4973499.000,-5.442,-3.913,-2.783,-19.179,-4.504,2.613,-15.391
4973516.000,-5.437,-3.912,-2.790,-19.184,-4.503,2.615,-15.388
4973533.000,-5.437,-3.912,-2.783,-19.179,-4.502,2.620,-15.390
4973551.000,-5.438,-3.910,-2.783,-19.177,-4.500,2.613,-15.392
4973568.000,-5.438,-3.915,-2.785,-19.173,-4.502,2.614,-15.395
4973585.000,-5.441,-3.912,-2.790,-19.181,-4.503,2.614,-15.393
4973604.000,-5.437,-3.910,-2.784,-19.183,-4.506,2.609,-15.397
4973621.000,-5.433,-3.910,-2.781,-19.175,-4.502,2.616,-15.397
4973639.000,-5.429,-3.910,-2.782,-19.176,-4.501,2.612,-15.396
4973658.000,-5.436,-3.913,-2.780,-19.175,-4.506,2.617,-15.397
4973675.000,-5.437,-3.910,-2.783,-19.178,-4.509,2.612,-15.394
4973693.000,-5.436,-3.912,-2.780,-19.177,-4.504,2.612,-15.391
4973710.000,-5.432,-3.908,-2.784,-19.179,-4.504,2.618,-15.390
4973728.000,-5.435,-3.909,-2.783,-19.183,-4.502,2.618,-15.395
4973746.000,-5.438,-3.910,-2.784,-19.179,-4.502,2.619,-15.389
4973763.000,-5.437,-3.911,-2.784,-19.179,-4.506,2.619,-15.393
4973781.000,-5.437,-3.914,-2.785,-19.177,-4.500,2.618,-15.391
4973799.000,-5.439,-3.913,-2.789,-19.176,-4.504,2.612,-15.394
4973816.000,-5.436,-3.912,-2.786,-19.181,-4.504,2.614,-15.391
4973833.000,-5.437,-3.911,-2.786,-19.176,-4.501,2.614,-15.391
4973850.000,-5.441,-3.911,-2.783,-19.178,-4.498,2.616,-15.395
4973868.000,-5.439,-3.912,-2.783,-19.181,-4.502,2.614,-15.396
4973886.000,-5.437,-3.912,-2.787,-19.182,-4.504,2.616,-15.392
4973903.000,-5.434,-3.910,-2.788,-19.180,-4.498,2.614,-15.396
4973920.000,-5.433,-3.909,-2.782,-19.179,-4.508,2.618,-15.395
4973938.000,-5.434,-3.908,-2.783,-19.172,-4.503,2.615,-15.392
4973956.000,-5.438,-3.913,-2.783,-19.176,-4.506,2.614,-15.396
4973973.000,-5.435,-3.911,-2.785,-19.178,-4.505,2.615,-15.396
4973991.000,-5.434,-3.912,-2.784,-19.179,-4.508,2.615,-15.397
4974009.000,-5.434,-3.910,-2.780,-19.176,-4.508,2.617,-15.390
4974027.000,-5.435,-3.911,-2.783,-19.173,-4.505,2.617,-15.394
4974044.000,-5.440,-3.911,-2.785,-19.176,-4.505,2.616,-15.398
4974061.000,-5.443,-3.910,-2.783,-19.178,-4.506,2.617,-15.393
4974078.000,-5.434,-3.914,-2.785,-19.178,-4.504,2.616,-15.389
4974096.000,-5.434,-3.910,-2.785,-19.180,-4.500,2.614,-15.391
4974113.000,-5.436,-3.912,-2.783,-19.180,-4.502,2.618,-15.393
4974131.000,-5.438,-3.909,-2.784,-19.177,-4.502,2.618,-15.393
4974148.000,-5.439,-3.911,-2.785,-19.180,-4.500,2.618,-15.392
4974165.000,-5.439,-3.911,-2.785,-19.179,-4.502,2.622,-15.393
4974182.000,-5.435,-3.912,-2.785,-19.181,-4.503,2.612,-15.393
4974199.000,-5.436,-3.911,-2.782,-19.178,-4.502,2.616,-15.394
4974217.000,-5.438,-3.911,-2.786,-19.177,-4.503,2.621,-15.390
4974235.000,-5.440,-3.913,-2.785,-19.177,-4.500,2.613,-15.395
4974252.000,-5.437,-3.916,-2.786,-19.182,-4.505,2.616,-15.393
4974270.000,-5.435,-3.912,-2.785,-19.181,-4.502,2.619,-15.395
4974288.000,-5.431,-3.911,-2.782,-19.176,-4.504,2.612,-15.397
4974305.000,-5.434,-3.909,-2.771,-19.177,-4.508,2.616,-15.397
4974322.000,-5.440,-3.912,-2.782,-19.174,-4.504,2.618,-15.392
4974340.000,-5.434,-3.913,-2.788,-19.179,-4.504,2.618,-15.397
4974357.000,-5.432,-3.911,-2.781,-19.180,-4.504,2.614,-15.397
4974375.000,-5.433,-3.908,-2.782,-19.178,-4.507,2.615,-15.392
4974392.000,-5.435,-3.911,-2.782,-19.173,-4.503,2.615,-15.394
4974410.000,-5.436,-3.911,-2.787,-19.180,-4.502,2.618,-15.394
4974427.000,-5.439,-3.914,-2.785,-19.179,-4.502,2.613,-15.399
4974445.000,-5.435,-3.912,-2.783,-19.178,-4.500,2.619,-15.391
4974463.000,-5.437,-3.912,-2.792,-19.182,-4.500,2.619,-15.391
4974481.000,-5.440,-3.911,-2.785,-19.182,-4.506,2.617,-15.395
4974498.000,-5.442,-3.912,-2.784,-19.176,-4.502,2.616,-15.393
4974516.000,-5.440,-3.914,-2.783,-19.179,-4.502,2.617,-15.391
4974534.000,-5.440,-3.915,-2.787,-19.179,-4.500,2.619,-15.394
4974551.000,-5.437,-3.910,-2.785,-19.183,-4.508,2.614,-15.394
4974569.000,-5.433,-3.913,-2.783,-19.178,-4.506,2.614,-15.396
4974586.000,-5.436,-3.908,-2.784,-19.178,-4.502,2.620,-15.400
4974604.000,-5.440,-3.913,-2.781,-19.175,-4.507,2.614,-15.394
4974622.000,-5.439,-3.912,-2.786,-19.175,-4.508,2.616,-15.393
4974639.000,-5.434,-3.910,-2.784,-19.179,-4.502,2.617,-15.395
4974657.000,-5.431,-3.907,-2.780,-19.175,-4.506,2.619,-15.397
4974676.000,-5.436,-3.910,-2.781,-19.173,-4.505,2.614,-15.393
4974693.000,-5.437,-3.914,-2.785,-19.175,-4.503,2.621,-15.393
4974710.000,-5.437,-3.910,-2.784,-19.179,-4.502,2.619,-15.395
4974727.000,-5.440,-3.910,-2.784,-19.178,-4.504,2.613,-15.398
4974745.000,-5.434,-3.909,-2.790,-19.176,-4.500,2.622,-15.393
4974762.000,-5.435,-3.906,-2.782,-19.180,-4.503,2.620,-15.394
4974780.000,-5.436,-3.910,-2.785,-19.180,-4.502,2.619,-15.391
4974798.000,-5.437,-3.909,-2.785,-19.178,-4.499,2.619,-15.392
4974815.000,-5.442,-3.912,-2.786,-19.179,-4.503,2.625,-15.395
4974833.000,-5.440,-3.913,-2.783,-19.184,-4.500,2.616,-15.392
4974850.000,-5.433,-3.911,-2.785,-19.182,-4.502,2.614,-15.398
4974868.000,-5.433,-3.911,-2.785,-19.182,-4.502,2.616,-15.391
4974885.000,-5.435,-3.909,-2.785,-19.179,-4.502,2.618,-15.395
4974903.000,-5.433,-3.911,-2.781,-19.177,-4.507,2.621,-15.393
4974920.000,-5.442,-3.908,-2.769,-19.175,-4.504,2.620,-15.394
4974938.000,-5.437,-3.916,-2.791,-19.176,-4.502,2.616,-15.397
4974955.000,-5.436,-3.913,-2.787,-19.183,-4.504,2.616,-15.397
4974973.000,-5.437,-3.906,-2.782,-19.175,-4.509,2.616,-15.393
4974989.000,-5.436,-3.910,-2.772,-19.176,-4.503,2.620,-15.393
4975007.000,-5.433,-3.909,-2.780,-19.177,-4.506,2.620,-15.395
4975025.000,-5.437,-3.909,-2.784,-19.179,-4.507,2.615,-15.397
4975043.000,-5.431,-3.914,-2.784,-19.180,-4.506,2.617,-15.392
4975060.000,-5.433,-3.909,-2.783,-19.176,-4.498,2.621,-15.393
4975078.000,-5.437,-3.907,-2.781,-19.174,-4.503,2.624,-15.397
4975095.000,-5.434,-3.908,-2.783,-19.178,-4.506,2.621,-15.395
4975112.000,-5.440,-3.910,-2.785,-19.180,-4.502,2.624,-15.393
4975129.000,-5.451,-3.914,-2.784,-19.179,-4.500,2.625,-15.388
4975147.000,-5.439,-3.911,-2.788,-19.180,-4.502,2.618,-15.395
4975164.000,-5.434,-3.909,-2.784,-19.181,-4.504,2.619,-15.390
4975181.000,-5.438,-3.910,-2.785,-19.177,-4.501,2.622,-15.391
4975198.000,-5.440,-3.911,-2.783,-19.179,-4.504,2.619,-15.396
4975215.000,-5.441,-3.914,-2.786,-19.177,-4.503,2.622,-15.393
4975233.000,-5.438,-3.912,-2.789,-19.181,-4.507,2.617,-15.391
4975251.000,-5.433,-3.910,-2.781,-19.181,-4.502,2.621,-15.391
4975270.000,-5.433,-3.910,-2.771,-19.175,-4.509,2.616,-15.397
4975287.000,-5.451,-3.908,-2.784,-19.179,-4.503,2.617,-15.395
4975304.000,-5.439,-3.911,-2.789,-19.179,-4.507,2.621,-15.396
4975321.000,-5.434,-3.910,-2.786,-19.183,-4.504,2.615,-15.394
4975338.000,-5.435,-3.909,-2.785,-19.177,-4.504,2.617,-15.393
4975356.000,-5.438,-3.910,-2.781,-19.177,-4.506,2.619,-15.395
4975373.000,-5.439,-3.909,-2.782,-19.179,-4.509,2.617,-15.392
4975391.000,-5.435,-3.911,-2.782,-19.178,-4.505,2.621,-15.395
4975408.000,-5.434,-3.908,-2.781,-19.179,-4.507,2.618,-15.398
4975425.000,-5.435,-3.908,-2.782,-19.177,-4.503,2.622,-15.396
4975443.000,-5.438,-3.912,-2.771,-19.174,-4.503,2.623,-15.395
4975461.000,-5.436,-3.911,-2.770,-19.178,-4.502,2.620,-15.392
4975478.000,-5.440,-3.913,-2.784,-19.179,-4.505,2.623,-15.392
4975497.000,-5.441,-3.913,-2.787,-19.179,-4.505,2.625,-15.393
4975515.000,-5.438,-3.914,-2.786,-19.184,-4.501,2.621,-15.390
4975533.000,-5.433,-3.911,-2.785,-19.182,-4.506,2.618,-15.395
4975552.000,-5.438,-3.906,-2.782,-19.182,-4.502,2.620,-15.392
4975569.000,-5.452,-3.912,-2.785,-19.178,-4.504,2.621,-15.393
4975585.000,-5.441,-3.912,-2.785,-19.182,-4.499,2.620,-15.396
4975601.000,-5.440,-3.913,-2.788,-19.182,-4.506,2.618,-15.398
4975619.000,-5.431,-3.910,-2.780,-19.179,-4.503,2.621,-15.395
4975636.000,-5.435,-3.913,-2.784,-19.175,-4.505,2.620,-15.392
4975652.000,-5.438,-3.913,-2.787,-19.180,-4.504,2.619,-15.393
4975668.000,-5.439,-3.916,-2.788,-19.179,-4.507,2.616,-15.396
4975686.000,-5.437,-3.907,-2.784,-19.179,-4.504,2.616,-15.393
4975703.000,-5.432,-3.909,-2.780,-19.179,-4.502,2.617,-15.393
4975720.000,-5.434,-3.907,-2.780,-19.175,-4.507,2.626,-15.398
4975738.000,-5.451,-3.908,-2.783,-19.175,-4.507,2.619,-15.395
4975756.000,-5.436,-3.914,-2.787,-19.179,-4.504,2.617,-15.394
4975773.000,-5.435,-3.911,-2.782,-19.181,-4.506,2.619,-15.395
4975793.000,-5.438,-3.907,-2.780,-19.175,-4.508,2.617,-15.399
4975810.000,-5.435,-3.911,-2.785,-19.174,-4.506,2.618,-15.392
4975827.000,-5.438,-3.908,-2.783,-19.176,-4.501,2.624,-15.391
4975844.000,-5.438,-3.913,-2.783,-19.179,-4.506,2.623,-15.395
4975862.000,-5.440,-3.913,-2.771,-19.178,-4.508,2.616,-15.391
4975879.000,-5.435,-3.907,-2.786,-19.181,-4.505,2.627,-15.393
4975897.000,-5.436,-3.909,-2.771,-19.183,-4.505,2.620,-15.391
4975914.000,-5.434,-3.911,-2.783,-19.174,-4.503,2.616,-15.396
4975933.000,-5.440,-3.911,-2.785,-19.178,-4.505,2.618,-15.395
4975951.000,-5.440,-3.917,-2.787,-19.182,-4.503,2.619,-15.397
4975968.000,-5.437,-3.914,-2.790,-19.183,-4.503,2.618,-15.397
4975985.000,-5.433,-3.908,-2.782,-19.180,-4.506,2.618,-15.392
4976003.000,-5.433,-3.908,-2.781,-19.176,-4.504,2.618,-15.391
4976020.000,-5.441,-3.912,-2.771,-19.174,-4.504,2.618,-15.399
4976037.000,-5.438,-3.914,-2.785,-19.182,-4.501,2.621,-15.393
4976054.000,-5.433,-3.915,-2.784,-19.181,-4.503,2.618,-15.394
4976072.000,-5.431,-3.909,-2.782,-19.179,-4.503,2.621,-15.397
4976090.000,-5.434,-3.911,-2.780,-19.176,-4.505,2.621,-15.396
4976107.000,-5.435,-3.911,-2.783,-19.175,-4.506,2.619,-15.400
4976124.000,-5.433,-3.912,-2.784,-19.176,-4.508,2.622,-15.397
4976141.000,-5.429,-3.910,-2.783,-19.177,-4.502,2.626,-15.391
4976158.000,-5.435,-3.908,-2.780,-19.176,-4.501,2.624,-15.393
4976176.000,-5.438,-3.911,-2.781,-19.178,-4.505,2.625,-15.397
4976193.000,-5.435,-3.911,-2.780,-19.175,-4.506,2.625,-15.389
4976210.000,-5.437,-3.910,-2.781,-19.176,-4.500,2.623,-15.395
4976229.000,-5.432,-3.912,-2.780,-19.179,-4.504,2.619,-15.396
4976246.000,-5.438,-3.911,-2.787,-19.183,-4.500,2.624,-15.390
4976263.000,-5.434,-3.911,-2.771,-19.181,-4.500,2.626,-15.394
4976281.000,-5.439,-3.911,-2.784,-19.177,-4.503,2.626,-15.392
4976298.000,-5.441,-3.911,-2.781,-19.180,-4.502,2.624,-15.397
4976315.000,-5.440,-3.916,-2.789,-19.181,-4.502,2.626,-15.391
4976333.000,-5.434,-3.913,-2.786,-19.180,-4.502,2.626,-15.391
4976350.000,-5.437,-3.911,-2.786,-19.180,-4.501,2.624,-15.392
4976368.000,-5.441,-3.910,-2.770,-19.177,-4.502,2.624,-15.393
4976385.000,-5.438,-3.914,-2.785,-19.178,-4.499,2.626,-15.391
4976403.000,-5.437,-3.914,-2.785,-19.183,-4.500,2.627,-15.396
4976420.000,-5.433,-3.910,-2.784,-19.181,-4.504,2.627,-15.395
4976438.000,-5.430,-3.908,-2.783,-19.180,-4.505,2.620,-15.394
4976455.000,-5.438,-3.905,-2.780,-19.178,-4.503,2.624,-15.394
4976473.000,-5.437,-3.912,-2.785,-19.181,-4.506,2.623,-15.397
4976490.000,-5.437,-3.908,-2.787,-19.179,-4.501,2.624,-15.394
4976508.000,-5.437,-3.906,-2.782,-19.179,-4.506,2.624,-15.394
4976525.000,-5.433,-3.907,-2.780,-19.177,-4.502,2.625,-15.397
4976543.000,-5.437,-3.910,-2.785,-19.175,-4.501,2.624,-15.396
4976560.000,-5.435,-3.908,-2.782,-19.178,-4.504,2.622,-15.391
4976578.000,-5.443,-3.909,-2.784,-19.179,-4.500,2.631,-15.392
4976596.000,-5.441,-3.911,-2.785,-19.178,-4.504,2.631,-15.391
4976612.000,-5.432,-3.908,-2.787,-19.183,-4.502,2.627,-15.393
4976630.000,-5.438,-3.914,-2.783,-19.176,-4.502,2.631,-15.389
4976647.000,-5.439,-3.910,-2.785,-19.177,-4.500,2.626,-15.393
4976665.000,-5.442,-3.910,-2.785,-19.180,-4.502,2.629,-15.395
4976682.000,-5.438,-3.912,-2.787,-19.181,-4.505,2.622,-15.396
4976700.000,-5.434,-3.913,-2.785,-19.184,-4.501,2.628,-15.394
4976718.000,-5.437,-3.907,-2.780,-19.179,-4.502,2.623,-15.394
4976736.000,-5.438,-3.908,-2.783,-19.175,-4.505,2.623,-15.394
4976754.000,-5.440,-3.914,-2.781,-19.177,-4.503,2.626,-15.392
4976771.000,-5.439,-3.912,-2.787,-19.179,-4.506,2.624,-15.397
4976789.000,-5.434,-3.911,-2.783,-19.182,-4.508,2.627,-15.393
4976806.000,-5.434,-3.909,-2.780,-19.177,-4.502,2.627,-15.394
4976824.000,-5.430,-3.907,-2.771,-19.172,-4.503,2.624,-15.396
4976841.000,-5.435,-3.911,-2.782,-19.180,-4.502,2.621,-15.394
4976858.000,-5.433,-3.910,-2.783,-19.175,-4.509,2.624,-15.394
4976875.000,-5.430,-3.907,-2.780,-19.179,-4.505,2.628,-15.394
4976892.000,-5.430,-3.906,-2.771,-19.176,-4.503,2.629,-15.395
4976910.000,-5.432,-3.908,-2.781,-19.175,-4.502,2.627,-15.395
4976927.000,-5.434,-3.911,-2.782,-19.175,-4.506,2.627,-15.388
4976944.000,-5.437,-3.915,-2.783,-19.179,-4.501,2.628,-15.394
4976962.000,-5.440,-3.915,-2.788,-19.178,-4.504,2.628,-15.392
4976980.000,-5.433,-3.916,-2.785,-19.183,-4.506,2.625,-15.392
4976998.000,-5.435,-3.910,-2.781,-19.179,-4.505,2.622,-15.392
4977015.000,-5.435,-3.910,-2.787,-19.179,-4.503,2.628,-15.393
4977032.000,-5.442,-3.911,-2.782,-19.178,-4.504,2.622,-15.397
4977050.000,-5.437,-3.913,-2.785,-19.181,-4.508,2.619,-15.392
4977068.000,-5.433,-3.911,-2.785,-19.180,-4.502,2.624,-15.394
4977085.000,-5.431,-3.907,-2.780,-19.180,-4.500,2.629,-15.396
4977102.000,-5.440,-3.914,-2.770,-19.179,-4.504,2.627,-15.396
4977120.000,-5.440,-3.914,-2.786,-19.175,-4.504,2.624,-15.394
4977137.000,-5.437,-3.912,-2.785,-19.184,-4.502,2.627,-15.396
4977154.000,-5.431,-3.907,-2.782,-19.181,-4.506,2.629,-15.398
4977171.000,-5.433,-3.911,-2.781,-19.176,-4.508,2.627,-15.393
4977188.000,-5.437,-3.906,-2.781,-19.176,-4.506,2.628,-15.394
4977208.000,-5.438,-3.910,-2.780,-19.178,-4.503,2.630,-15.396
4977225.000,-5.437,-3.914,-2.784,-19.179,-4.502,2.626,-15.395
4977242.000,-5.430,-3.911,-2.783,-19.180,-4.503,2.628,-15.391
4977260.000,-5.436,-3.908,-2.781,-19.177,-4.506,2.627,-15.392
4977278.000,-5.436,-3.912,-2.782,-19.175,-4.504,2.625,-15.396
4977296.000,-5.436,-3.916,-2.787,-19.182,-4.504,2.625,-15.389
4977314.000,-5.437,-3.911,-2.783,-19.182,-4.502,2.628,-15.392
4977331.000,-5.434,-3.912,-2.788,-19.180,-4.503,2.632,-15.390
4977350.000,-5.441,-3.916,-2.785,-19.180,-4.508,2.626,-15.396
4977367.000,-5.438,-3.914,-2.789,-19.184,-4.504,2.626,-15.392
4977385.000,-5.435,-3.911,-2.786,-19.180,-4.499,2.628,-15.396
4977404.000,-5.436,-3.910,-2.785,-19.180,-4.505,2.627,-15.395
4977422.000,-5.432,-3.909,-2.785,-19.179,-4.502,2.629,-15.391
4977439.000,-5.437,-3.908,-2.772,-19.176,-4.507,2.627,-15.395
4977457.000,-5.440,-3.913,-2.785,-19.180,-4.506,2.627,-15.394
4977475.000,-5.438,-3.911,-2.785,-19.181,-4.506,2.626,-15.390
4977493.000,-5.430,-3.906,-2.785,-19.179,-4.503,2.631,-15.396
4977510.000,-5.437,-3.907,-2.783,-19.182,-4.505,2.625,-15.395
4977529.000,-5.436,-3.910,-2.785,-19.181,-4.500,2.630,-15.393
4977547.000,-5.438,-3.914,-2.786,-19.177,-4.501,2.629,-15.394
4977564.000,-5.440,-3.912,-2.786,-19.179,-4.503,2.626,-15.392
4977582.000,-5.440,-3.913,-2.786,-19.180,-4.506,2.626,-15.394
4977600.000,-5.437,-3.911,-2.788,-19.178,-4.504,2.625,-15.397
4977617.000,-5.434,-3.910,-2.783,-19.180,-4.502,2.632,-15.394
4977635.000,-5.437,-3.910,-2.781,-19.176,-4.508,2.628,-15.394
4977652.000,-5.437,-3.914,-2.782,-19.176,-4.506,2.626,-15.393
4977669.000,-5.439,-3.913,-2.785,-19.182,-4.506,2.626,-15.393
4977687.000,-5.435,-3.913,-2.786,-19.182,-4.503,2.627,-15.398
4977705.000,-5.434,-3.906,-2.784,-19.178,-4.505,2.626,-15.394
4977723.000,-5.433,-3.910,-2.781,-19.176,-4.504,2.626,-15.392
4977740.000,-5.437,-3.911,-2.783,-19.174,-4.506,2.627,-15.396
4977758.000,-5.435,-3.910,-2.786,-19.180,-4.508,2.630,-15.399
4977776.000,-5.432,-3.911,-2.782,-19.179,-4.502,2.632,-15.392
4977795.000,-5.433,-3.913,-2.789,-19.180,-4.505,2.631,-15.392
4977813.000,-5.435,-3.905,-2.786,-19.183,-4.502,2.629,-15.393
4977830.000,-5.438,-3.911,-2.785,-19.181,-4.502,2.631,-15.392
4977848.000,-5.439,-3.910,-2.786,-19.180,-4.504,2.635,-15.392
4977867.000,-5.443,-3.912,-2.787,-19.180,-4.505,2.626,-15.392
4977885.000,-5.436,-3.916,-2.786,-19.180,-4.505,2.629,-15.392
4977903.000,-5.437,-3.910,-2.782,-19.182,-4.503,2.633,-15.392
4977921.000,-5.432,-3.908,-2.785,-19.181,-4.506,2.631,-15.396
4977939.000,-5.435,-3.907,-2.780,-19.176,-4.502,2.629,-15.392
4977957.000,-5.439,-3.911,-2.782,-19.176,-4.501,2.630,-15.394
4977975.000,-5.440,-3.910,-2.780,-19.179,-4.506,2.630,-15.394
4977993.000,-5.438,-3.912,-2.783,-19.180,-4.502,2.631,-15.389
4978012.000,-5.440,-3.913,-2.786,-19.181,-4.501,2.635,-15.392
4978029.000,-5.437,-3.913,-2.787,-19.184,-4.502,2.631,-15.392
4978046.000,-5.435,-3.913,-2.784,-19.176,-4.502,2.631,-15.389
4978064.000,-5.438,-3.913,-2.781,-19.179,-4.504,2.633,-15.392
4978080.000,-5.437,-3.912,-2.786,-19.183,-4.503,2.631,-15.388
4978098.000,-5.440,-3.914,-2.789,-19.181,-4.502,2.631,-15.396
4978116.000,-5.434,-3.910,-2.783,-19.178,-4.505,2.630,-15.393
4978134.000,-5.438,-3.907,-2.783,-19.180,-4.501,2.626,-15.394
4978153.000,-5.436,-3.910,-2.782,-19.175,-4.508,2.627,-15.392
4978170.000,-5.438,-3.907,-2.783,-19.175,-4.503,2.631,-15.394
4978188.000,-5.437,-3.911,-2.785,-19.179,-4.506,2.629,-15.391
4978207.000,-5.433,-3.910,-2.783,-19.179,-4.503,2.628,-15.396
4978226.000,-5.433,-3.910,-2.781,-19.180,-4.504,2.633,-15.392
4978244.000,-5.436,-3.911,-2.781,-19.181,-4.501,2.635,-15.394
4978263.000,-5.439,-3.910,-2.783,-19.182,-4.500,2.634,-15.393
4978281.000,-5.437,-3.908,-2.783,-19.176,-4.505,2.634,-15.390
4978299.000,-5.436,-3.913,-2.789,-19.180,-4.502,2.632,-15.388
4978316.000,-5.441,-3.914,-2.785,-19.179,-4.501,2.636,-15.394
4978334.000,-5.434,-3.912,-2.786,-19.179,-4.504,2.627,-15.392
4978352.000,-5.437,-3.910,-2.782,-19.176,-4.502,2.627,-15.391
4978369.000,-5.440,-3.910,-2.780,-19.180,-4.502,2.627,-15.390
4978385.000,-5.440,-3.919,-2.785,-19.181,-4.502,2.630,-15.391
4978403.000,-5.434,-3.910,-2.789,-19.179,-4.503,2.630,-15.394
4978421.000,-5.437,-3.909,-2.770,-19.183,-4.505,2.626,-15.393
4978439.000,-5.435,-3.911,-2.783,-19.177,-4.502,2.631,-15.393
4978457.000,-5.439,-3.906,-2.770,-19.179,-4.505,2.627,-15.396
4978475.000,-5.435,-3.910,-2.782,-19.178,-4.506,2.634,-15.394
4978492.000,-5.436,-3.913,-2.785,-19.178,-4.502,2.632,-15.393
4978510.000,-5.441,-3.911,-2.786,-19.181,-4.502,2.628,-15.398
4978530.000,-5.438,-3.916,-2.785,-19.181,-4.502,2.632,-15.387
4978547.000,-5.437,-3.909,-2.786,-19.181,-4.499,2.634,-15.390
4978564.000,-5.439,-3.909,-2.784,-19.181,-4.498,2.633,-15.394
4978582.000,-5.442,-3.912,-2.783,-19.181,-4.505,2.627,-15.390
4978600.000,-5.442,-3.912,-2.781,-19.179,-4.500,2.631,-15.390
4978617.000,-5.437,-3.911,-2.785,-19.186,-4.505,2.630,-15.396
4978635.000,-5.435,-3.908,-2.783,-19.182,-4.504,2.631,-15.393
4978652.000,-5.434,-3.906,-2.769,-19.181,-4.502,2.629,-15.391
4978671.000,-5.436,-3.906,-2.783,-19.178,-4.507,2.628,-15.395
4978688.000,-5.440,-3.907,-2.769,-19.176,-4.504,2.633,-15.392
4978706.000,-5.436,-3.910,-2.783,-19.177,-4.507,2.630,-15.393
4978723.000,-5.435,-3.908,-2.783,-19.178,-4.504,2.630,-15.396
4978741.000,-5.435,-3.907,-2.784,-19.176,-4.505,2.631,-15.394
4978758.000,-5.437,-3.909,-2.782,-19.175,-4.506,2.632,-15.390
4978775.000,-5.438,-3.912,-2.786,-19.174,-4.500,2.634,-15.393
4978794.000,-5.439,-3.911,-2.782,-19.177,-4.504,2.637,-15.392
4978812.000,-5.440,-3.911,-2.783,-19.174,-4.508,2.633,-15.388
4978829.000,-5.434,-3.912,-2.785,-19.186,-4.503,2.637,-15.388
4978847.000,-5.435,-3.910,-2.783,-19.180,-4.499,2.635,-15.393
4978865.000,-5.438,-3.911,-2.784,-19.179,-4.503,2.630,-15.389
4978882.000,-5.440,-3.913,-2.785,-19.180,-4.502,2.631,-15.392
4978899.000,-5.440,-3.917,-2.791,-19.181,-4.500,2.632,-15.388
4978918.000,-5.438,-3.911,-2.784,-19.182,-4.507,2.630,-15.392
4978936.000,-5.436,-3.909,-2.786,-19.178,-4.507,2.631,-15.391
4978953.000,-5.433,-3.909,-2.780,-19.176,-4.503,2.633,-15.393
4978970.000,-5.439,-3.908,-2.782,-19.174,-4.505,2.634,-15.395
4978989.000,-5.438,-3.909,-2.782,-19.176,-4.507,2.631,-15.391
4979007.000,-5.434,-3.905,-2.781,-19.179,-4.507,2.635,-15.393
4979024.000,-5.433,-3.906,-2.772,-19.177,-4.502,2.636,-15.390
4979041.000,-5.438,-3.911,-2.770,-19.176,-4.505,2.631,-15.393
4979059.000,-5.434,-3.908,-2.782,-19.176,-4.505,2.638,-15.391
4979077.000,-5.438,-3.911,-2.783,-19.180,-4.502,2.635,-15.387
4979094.000,-5.440,-3.912,-2.789,-19.179,-4.505,2.636,-15.392
4979112.000,-5.440,-3.910,-2.789,-19.179,-4.502,2.633,-15.389
4979130.000,-5.437,-3.908,-2.789,-19.178,-4.504,2.637,-15.390
4979147.000,-5.439,-3.911,-2.782,-19.178,-4.505,2.636,-15.393
4979164.000,-5.438,-3.912,-2.785,-19.179,-4.499,2.632,-15.392
4979181.000,-5.440,-3.912,-2.786,-19.181,-4.506,2.633,-15.391
4979199.000,-5.438,-3.911,-2.789,-19.182,-4.502,2.638,-15.387
4979216.000,-5.435,-3.911,-2.785,-19.180,-4.501,2.633,-15.393
4979234.000,-5.438,-3.910,-2.781,-19.186,-4.509,2.631,-15.388
4979251.000,-5.441,-3.912,-2.781,-19.180,-4.501,2.632,-15.389
4979269.000,-5.441,-3.913,-2.786,-19.176,-4.503,2.634,-15.394
4979287.000,-5.437,-3.911,-2.785,-19.185,-4.506,2.633,-15.389
4979304.000,-5.435,-3.910,-2.780,-19.181,-4.504,2.632,-15.390
4979322.000,-5.437,-3.908,-2.782,-19.176,-4.503,2.637,-15.396
4979340.000,-5.440,-3.910,-2.782,-19.175,-4.507,2.632,-15.395
4979358.000,-5.441,-3.911,-2.780,-19.177,-4.504,2.634,-15.395
4979375.000,-5.437,-3.910,-2.786,-19.177,-4.506,2.635,-15.388
4979393.000,-5.434,-3.908,-2.785,-19.181,-4.504,2.636,-15.393
4979411.000,-5.437,-3.908,-2.789,-19.184,-4.505,2.631,-15.389
4979428.000,-5.437,-3.908,-2.781,-19.177,-4.502,2.638,-15.387
4979446.000,-5.435,-3.908,-2.783,-19.178,-4.500,2.636,-15.385
4979465.000,-5.440,-3.911,-2.783,-19.178,-4.502,2.630,-15.391
4979483.000,-5.439,-3.912,-2.786,-19.181,-4.504,2.633,-15.391
4979501.000,-5.435,-3.912,-2.785,-19.181,-4.506,2.638,-15.392
4979519.000,-5.432,-3.911,-2.785,-19.179,-4.507,2.634,-15.390
4979536.000,-5.435,-3.910,-2.783,-19.176,-4.505,2.630,-15.388
4979553.000,-5.441,-3.911,-2.780,-19.172,-4.503,2.634,-15.393
4979571.000,-5.437,-3.914,-2.771,-19.175,-4.506,2.633,-15.393
4979588.000,-5.432,-3.907,-2.786,-19.182,-4.504,2.633,-15.389
4979606.000,-5.436,-3.906,-2.780,-19.180,-4.508,2.635,-15.388
4979623.000,-5.436,-3.910,-2.770,-19.177,-4.504,2.635,-15.393
4979641.000,-5.437,-3.911,-2.783,-19.177,-4.505,2.631,-15.395
4979660.000,-5.439,-3.910,-2.784,-19.178,-4.509,2.635,-15.388
4979677.000,-5.442,-3.911,-2.782,-19.176,-4.502,2.635,-15.387
4979695.000,-5.440,-3.915,-2.788,-19.179,-4.504,2.633,-15.391
4979712.000,-5.440,-3.915,-2.788,-19.179,-4.502,2.628,-15.388
4979730.000,-5.438,-3.912,-2.784,-19.181,-4.503,2.633,-15.394
4979747.000,-5.435,-3.914,-2.785,-19.180,-4.505,2.639,-15.389
4979765.000,-5.438,-3.910,-2.782,-19.184,-4.504,2.631,-15.391
4979784.000,-5.440,-3.910,-2.782,-19.177,-4.505,2.629,-15.387
4979801.000,-5.441,-3.913,-2.788,-19.177,-4.504,2.631,-15.389
4979818.000,-5.437,-3.916,-2.788,-19.186,-4.506,2.631,-15.389
4979836.000,-5.437,-3.909,-2.781,-19.181,-4.508,2.630,-15.389
4979854.000,-5.434,-3.908,-2.780,-19.178,-4.508,2.629,-15.389
4979872.000,-5.432,-3.910,-2.772,-19.176,-4.504,2.636,-15.390
4979889.000,-5.438,-3.908,-2.784,-19.172,-4.506,2.633,-15.391
4979908.000,-5.436,-3.912,-2.785,-19.176,-4.506,2.633,-15.387
4979925.000,-5.433,-3.908,-2.785,-19.178,-4.502,2.634,-15.396
4979943.000,-5.440,-3.908,-2.781,-19.181,-4.507,2.633,-15.391
4979960.000,-5.436,-3.911,-2.780,-19.176,-4.504,2.631,-15.391
4979978.000,-5.436,-3.909,-2.781,-19.176,-4.499,2.637,-15.391
4979995.000,-5.439,-3.911,-2.783,-19.179,-4.500,2.634,-15.390
4980013.000,-5.453,-3.913,-2.781,-19.178,-4.503,2.636,-15.386
4980030.000,-5.436,-3.915,-2.785,-19.180,-4.505,2.635,-15.390
4980048.000,-5.438,-3.909,-2.785,-19.180,-4.503,2.640,-15.390
4980065.000,-5.438,-3.906,-2.785,-19.180,-4.503,2.637,-15.388
4980083.000,-5.440,-3.910,-2.784,-19.178,-4.505,2.630,-15.389
4980100.000,-5.436,-3.914,-2.785,-19.182,-4.504,2.633,-15.388
4980118.000,-5.439,-3.910,-2.785,-19.182,-4.502,2.633,-15.396
4980135.000,-5.437,-3.911,-2.786,-19.179,-4.505,2.632,-15.390
4980153.000,-5.438,-3.907,-2.780,-19.175,-4.506,2.635,-15.392
4980171.000,-5.438,-3.911,-2.782,-19.176,-4.505,2.636,-15.391
4980189.000,-5.437,-3.909,-2.782,-19.181,-4.506,2.635,-15.391
4980207.000,-5.435,-3.910,-2.783,-19.180,-4.506,2.635,-15.391
4980224.000,-5.435,-3.912,-2.785,-19.177,-4.503,2.641,-15.387
4980241.000,-5.435,-3.908,-2.781,-19.178,-4.506,2.638,-15.392
4980259.000,-5.438,-3.911,-2.782,-19.178,-4.506,2.631,-15.394
4980276.000,-5.440,-3.911,-2.785,-19.177,-4.503,2.637,-15.388
4980293.000,-5.453,-3.913,-2.785,-19.176,-4.504,2.635,-15.387
4980311.000,-5.437,-3.906,-2.785,-19.180,-4.502,2.634,-15.388
4980328.000,-5.441,-3.907,-2.780,-19.181,-4.505,2.637,-15.391
4980345.000,-5.440,-3.911,-2.781,-19.178,-4.503,2.637,-15.389
4980363.000,-5.436,-3.909,-2.783,-19.180,-4.501,2.641,-15.391
4980381.000,-5.443,-3.911,-2.786,-19.179,-4.503,2.637,-15.389
4980398.000,-5.439,-3.912,-2.786,-19.186,-4.504,2.634,-15.391
4980416.000,-5.434,-3.911,-2.783,-19.181,-4.503,2.637,-15.386
4980434.000,-5.431,-3.910,-2.782,-19.179,-4.505,2.632,-15.391
4980455.000,-5.438,-3.909,-2.781,-19.178,-4.507,2.632,-15.388
4980473.000,-5.439,-3.912,-2.785,-19.181,-4.504,2.638,-15.392
4980491.000,-5.438,-3.911,-2.785,-19.180,-4.508,2.634,-15.393
4980509.000,-5.436,-3.911,-2.783,-19.184,-4.506,2.638,-15.387
4980527.000,-5.439,-3.911,-2.788,-19.183,-4.505,2.639,-15.392
4980545.000,-5.439,-3.906,-2.783,-19.184,-4.507,2.629,-15.390
4980563.000,-5.442,-3.909,-2.785,-19.178,-4.506,2.637,-15.390
4980581.000,-5.436,-3.910,-2.782,-19.179,-4.498,2.637,-15.391
4980599.000,-5.441,-3.913,-2.788,-19.184,-4.506,2.625,-15.390
4980616.000,-5.438,-3.914,-2.785,-19.183,-4.503,2.636,-15.385
4980632.000,-5.436,-3.911,-2.783,-19.184,-4.505,2.635,-15.387
4980649.000,-5.439,-3.909,-2.781,-19.178,-4.502,2.635,-15.389
4980666.000,-5.443,-3.912,-2.788,-19.180,-4.508,2.632,-15.389
4980683.000,-5.441,-3.914,-2.788,-19.183,-4.504,2.630,-15.388
4980700.000,-5.438,-3.913,-2.782,-19.184,-4.502,2.632,-15.387
4980717.000,-5.438,-3.907,-2.782,-19.178,-4.502,2.630,-15.390
4980734.000,-5.441,-3.911,-2.783,-19.178,-4.502,2.632,-15.388
4980752.000,-5.439,-3.913,-2.782,-19.177,-4.504,2.629,-15.389
4980770.000,-5.440,-3.912,-2.785,-19.177,-4.506,2.634,-15.391
4980788.000,-5.437,-3.910,-2.770,-19.181,-4.506,2.634,-15.394
4980806.000,-5.434,-3.906,-2.780,-19.178,-4.508,2.634,-15.391
4980823.000,-5.435,-3.910,-2.769,-19.179,-4.505,2.638,-15.390
4980841.000,-5.438,-3.907,-2.783,-19.178,-4.505,2.633,-15.395
4980859.000,-5.436,-3.908,-2.781,-19.181,-4.507,2.630,-15.394
4980876.000,-5.438,-3.914,-2.781,-19.183,-4.504,2.635,-15.388
4980893.000,-5.434,-3.906,-2.783,-19.185,-4.504,2.635,-15.388
4980910.000,-5.437,-3.908,-2.782,-19.178,-4.502,2.637,-15.393
4980928.000,-5.438,-3.908,-2.783,-19.180,-4.506,2.638,-15.391
4980946.000,-5.441,-3.913,-2.786,-19.179,-4.506,2.633,-15.389
4980963.000,-5.440,-3.912,-2.783,-19.179,-4.502,2.641,-15.388
4980980.000,-5.438,-3.914,-2.784,-19.182,-4.501,2.629,-15.389
4980997.000,-5.434,-3.908,-2.782,-19.183,-4.504,2.635,-15.390
4981015.000,-5.438,-3.911,-2.783,-19.179,-4.503,2.636,-15.389
4981032.000,-5.441,-3.911,-2.785,-19.184,-4.502,2.639,-15.391
4981049.000,-5.438,-3.912,-2.787,-19.185,-4.503,2.630,-15.390
4981067.000,-5.436,-3.911,-2.788,-19.184,-4.506,2.629,-15.388
4981084.000,-5.435,-3.908,-2.785,-19.178,-4.506,2.631,-15.389
4981101.000,-5.443,-3.907,-2.771,-19.177,-4.506,2.632,-15.390
4981119.000,-5.441,-3.911,-2.782,-19.178,-4.506,2.630,-15.391
4981136.000,-5.438,-3.912,-2.785,-19.184,-4.506,2.630,-15.390
4981153.000,-5.432,-3.912,-2.783,-19.183,-4.508,2.632,-15.392
4981171.000,-5.437,-3.909,-2.781,-19.180,-4.506,2.631,-15.393
4981187.000,-5.435,-3.910,-2.772,-19.180,-4.509,2.632,-15.392
4981205.000,-5.437,-3.910,-2.783,-19.180,-4.505,2.632,-15.390
4981223.000,-5.435,-3.908,-2.782,-19.182,-4.507,2.630,-15.389
4981240.000,-5.431,-3.907,-2.770,-19.178,-4.508,2.633,-15.392
4981257.000,-5.435,-3.907,-2.780,-19.175,-4.508,2.633,-15.389
4981276.000,-5.440,-3.905,-2.782,-19.178,-4.501,2.636,-15.388
4981294.000,-5.438,-3.908,-2.783,-19.179,-4.504,2.633,-15.392
4981311.000,-5.438,-3.911,-2.785,-19.176,-4.504,2.635,-15.390
4981329.000,-5.440,-3.911,-2.785,-19.183,-4.504,2.638,-15.388
4981347.000,-5.436,-3.908,-2.782,-19.181,-4.502,2.634,-15.389
4981365.000,-5.433,-3.908,-2.784,-19.181,-4.506,2.627,-15.391
4981383.000,-5.434,-3.907,-2.769,-19.179,-4.505,2.627,-15.387
4981402.000,-5.440,-3.906,-2.770,-19.176,-4.509,2.631,-15.388
4981420.000,-5.439,-3.911,-2.772,-19.179,-4.507,2.629,-15.391
4981438.000,-5.438,-3.907,-2.782,-19.182,-4.505,2.633,-15.392
4981457.000,-5.438,-3.909,-2.785,-19.183,-4.504,2.633,-15.391
4981475.000,-5.437,-3.908,-2.780,-19.180,-4.508,2.630,-15.394
4981492.000,-5.438,-3.905,-2.782,-19.179,-4.504,2.636,-15.388
4981510.000,-5.437,-3.908,-2.781,-19.180,-4.506,2.632,-15.390
4981528.000,-5.439,-3.910,-2.785,-19.181,-4.502,2.629,-15.389
4981546.000,-5.442,-3.915,-2.781,-19.181,-4.502,2.638,-15.387
4981563.000,-5.438,-3.911,-2.785,-19.181,-4.506,2.637,-15.388
4981581.000,-5.440,-3.908,-2.781,-19.184,-4.499,2.629,-15.388
4981598.000,-5.442,-3.909,-2.783,-19.179,-4.505,2.629,-15.386
4981616.000,-5.437,-3.911,-2.783,-19.180,-4.504,2.626,-15.389
4981633.000,-5.440,-3.909,-2.790,-19.179,-4.503,2.632,-15.390
4981651.000,-5.432,-3.908,-2.785,-19.182,-4.504,2.630,-15.388
4981668.000,-5.432,-3.911,-2.781,-19.179,-4.505,2.630,-15.393
4981686.000,-5.437,-3.906,-2.771,-19.174,-4.505,2.630,-15.390
4981704.000,-5.438,-3.908,-2.782,-19.178,-4.508,2.630,-15.387
4981721.000,-5.441,-3.912,-2.785,-19.180,-4.508,2.630,-15.390
4981739.000,-5.434,-3.908,-2.781,-19.180,-4.506,2.626,-15.390
4981756.000,-5.432,-3.907,-2.772,-19.178,-4.504,2.630,-15.393
4981774.000,-5.437,-3.905,-2.782,-19.178,-4.506,2.630,-15.395
4981791.000,-5.437,-3.911,-2.783,-19.178,-4.506,2.635,-15.387
4981808.000,-5.437,-3.910,-2.780,-19.180,-4.506,2.631,-15.388
4981826.000,-5.437,-3.906,-2.785,-19.181,-4.504,2.630,-15.387
4981842.000,-5.435,-3.907,-2.782,-19.178,-4.506,2.633,-15.388
