.............
----------------------------------------------------------------------
Ran 13 tests in 0.002s

OK
Name               Stmts   Miss Branch BrPart  Cover   Missing
--------------------------------------------------------------
Diplomacy.py          69      0     44      0   100%
TestDiplomacy.py      75      0      0      0   100%
--------------------------------------------------------------
TOTAL                144      0     44      0   100%
