........
----------------------------------------------------------------------
Ran 8 tests in 0.016s

OK
Name               Stmts   Miss Branch BrPart  Cover   Missing
--------------------------------------------------------------
Diplomacy.py          60      0     36      0   100%
TestDiplomacy.py      46      0      2      1    98%   60->exit
--------------------------------------------------------------
TOTAL                106      0     38      1    99%
