..................
----------------------------------------------------------------------
Ran 18 tests in 0.178s

OK


Name             Stmts   Miss Branch BrPart  Cover   Missing
------------------------------------------------------------
Collatz.py          37      0     16      0   100%
TestCollatz.py      77      0      0      0   100%
------------------------------------------------------------
TOTAL              114      0     16      0   100%

