1 10 20
100 200 125
201 210 89
900 1000 174
1001 10000 262
123 456 144
456 789 171
111 111 70
1 111 119
2 22 21
9 999 179
1 10000 262
9000 9999 260
2628 3670 217
7219 9714 260
3935 8131 262
7267 8944 252
677 3635 217
341 4325 238
5904 9303 262
619 7522 262
7482 9911 260
820 8370 262
2465 6733 262
7970 9485 260
2078 9898 262
8307 9329 260
7803 9117 252
1973 4823 238
3527 8512 262
953 7796 262
7535 8581 252
1877 8408 262
7314 7949 239
4665 6902 262
598 5168 238
6488 7542 257
1681 8589 262
2636 8150 262
2480 7152 262
21 4719 238
2072 5083 238
4084 8075 262
2073 2284 183
465 1255 182
3152 8409 262
9172 9501 260
3036 3976 238
84 7282 262
742 4158 238
7446 8264 252
1704 3983 238
1632 4615 238
4352 6455 262
7347 9698 260
658 7240 262
3412 8730 262
3583 9939 262
2040 8479 262
4156 5697 236
4825 9334 262
2424 8231 262
3923 8310 262
426 6677 262
6158 9657 262
2212 7002 262
537 3980 238
931 1269 182
2520 9578 262
4483 4707 184
596 4063 238
3593 9429 262
9698 9813 198
1153 1239 182
911 6615 262
5214 6280 262
7658 9712 260
1532 4151 238
2055 6459 262
1550 4465 238
3012 9235 262
4151 6334 262
720 3771 238
2292 6046 238
236 8780 262
3627 4766 238
5233 9719 262
1266 3390 217
3049 4686 238
7626 8756 252
2780 4219 238
3071 5600 238
6384 9778 260
857 1050 179
2725 3798 238
1840 3120 217
4965 9167 262
6044 7675 262
372 7093 262
887 8660 262
2695 5240 238
1005 7649 262
447 9090 262
2660 8653 262
1298 5751 238
6535 9681 260
3694 3954 238
5595 8341 262
1518 7051 262
2593 8609 262
1402 4148 238
5782 9411 262
2322 4714 238
8218 9369 260
5771 6915 262
2003 3068 217
1602 4046 238
6076 8904 262
4451 8005 262
246 8999 262
8742 9237 247
1774 5444 238
3324 8484 262
4891 5870 236
9165 9989 260
