{
	"info": {
		"_postman_id": "52e39af5-d494-4b0e-be72-600c312b91ea",
		"name": "s31",
		"schema": "https://schema.getpostman.com/json/collection/v2.1.0/collection.json"
	},
	"item": [
		{
			"name": "CREATE TASK",
			"request": {
				"method": "POST",
				"header": [],
				"body": {
					"mode": "raw",
					"raw": "{\r\n    \"name\": \"sleeping\"\r\n}",
					"options": {
						"raw": {
							"language": "json"
						}
					}
				},
				"url": {
					"raw": "http://localhost:3006/api/tasks",
					"protocol": "http",
					"host": [
						"localhost"
					],
					"port": "3006",
					"path": [
						"api",
						"tasks"
					]
				}
			},
			"response": []
		},
		{
			"name": "GET ALL TASK",
			"request": {
				"method": "GET",
				"header": []
			},
			"response": []
		},
		{
			"name": "UPDATE A TASK",
			"request": {
				"method": "PUT",
				"header": [],
				"body": {
					"mode": "raw",
					"raw": "{\r\n    \"name\":\"sleeping\",\r\n    \"status\":\"completed\"\r\n}",
					"options": {
						"raw": {
							"language": "json"
						}
					}
				},
				"url": {
					"raw": "http://localhost:3006/api/tasks",
					"protocol": "http",
					"host": [
						"localhost"
					],
					"port": "3006",
					"path": [
						"api",
						"tasks"
					]
				}
			},
			"response": []
		},
		{
			"name": "GET SPECIFIC TASK",
			"request": {
				"method": "GET",
				"header": [],
				"url": {
					"raw": "http://localhost:3006/api/tasks/622820548b0735654d58e62c",
					"protocol": "http",
					"host": [
						"localhost"
					],
					"port": "3006",
					"path": [
						"api",
						"tasks",
						"622820548b0735654d58e62c"
					]
				}
			},
			"response": []
		}
	]
}