%!PS-Adobe-3.0 EPSF-3.0
%%Creator: cairo 1.8.8 (http://cairographics.org)
%%CreationDate: Thu Mar 17 17:47:57 2022
%%Pages: 1
%%BoundingBox: 10 0 407 227
%%DocumentData: Clean7Bit
%%LanguageLevel: 2
%%EndComments
%%BeginProlog
/cairo_eps_state save def
/dict_count countdictstack def
/op_count count 1 sub def
userdict begin
/q { gsave } bind def
/Q { grestore } bind def
/cm { 6 array astore concat } bind def
/w { setlinewidth } bind def
/J { setlinecap } bind def
/j { setlinejoin } bind def
/M { setmiterlimit } bind def
/d { setdash } bind def
/m { moveto } bind def
/l { lineto } bind def
/c { curveto } bind def
/h { closepath } bind def
/re { exch dup neg 3 1 roll 5 3 roll moveto 0 rlineto
      0 exch rlineto 0 rlineto closepath } bind def
/S { stroke } bind def
/f { fill } bind def
/f* { eofill } bind def
/B { fill stroke } bind def
/B* { eofill stroke } bind def
/n { newpath } bind def
/W { clip } bind def
/W* { eoclip } bind def
/BT { } bind def
/ET { } bind def
/pdfmark where { pop globaldict /?pdfmark /exec load put }
    { globaldict begin /?pdfmark /pop load def /pdfmark
    /cleartomark load def end } ifelse
/BDC { mark 3 1 roll /BDC pdfmark } bind def
/EMC { mark /EMC pdfmark } bind def
/cairo_store_point { /cairo_point_y exch def /cairo_point_x exch def } def
/Tj { show currentpoint cairo_store_point } bind def
/TJ {
  {
    dup
    type /stringtype eq
    { show } { -0.001 mul 0 cairo_font_matrix dtransform rmoveto } ifelse
  } forall
  currentpoint cairo_store_point
} bind def
/cairo_selectfont { cairo_font_matrix aload pop pop pop 0 0 6 array astore
    cairo_font exch selectfont cairo_point_x cairo_point_y moveto } bind def
/Tf { pop /cairo_font exch def /cairo_font_matrix where
      { pop cairo_selectfont } if } bind def
/Td { matrix translate cairo_font_matrix matrix concatmatrix dup
      /cairo_font_matrix exch def dup 4 get exch 5 get cairo_store_point
      /cairo_font where { pop cairo_selectfont } if } bind def
/Tm { 2 copy 8 2 roll 6 array astore /cairo_font_matrix exch def
      cairo_store_point /cairo_font where { pop cairo_selectfont } if } bind def
/g { setgray } bind def
/rg { setrgbcolor } bind def
/d1 { setcachedevice } bind def
%%EndProlog
%%Page: 1 1
%%BeginPageSetup
%%PageBoundingBox: 10 0 407 227
%%EndPageSetup
q
0.0823529 0.584314 0.639216 rg
98.098 218.309 m 276.789 218.309 l 276.789 39.617 l 98.098 39.617 l 
98.098 218.309 l h
98.098 218.309 m f
0.67451 0.941176 0.94902 rg
98.098 39.617 m 98.098 218.309 l 274.051 218.07 l f
1 g
112.512 203.895 m 259.496 203.895 l 259.496 54.023 l 112.512 54.023 l 
112.512 203.895 l h
112.512 203.895 m f
0.992157 0.698039 0.458824 rg
236.406 137.781 m 236.406 155.039 l 213.52 155.039 l 213.52 177.926 l 
196.258 177.926 l 196.258 155.039 l 178.625 155.039 l 178.625 177.926 l 
161.367 177.926 l 161.367 155.039 l 138.48 155.039 l 138.48 137.781 l 
161.367 137.781 l 161.367 120.148 l 138.48 120.148 l 138.48 102.887 l 
161.367 102.887 l 161.367 80 l 178.625 80 l 178.625 102.887 l 196.258 
102.887 l 196.258 80 l 213.52 80 l 213.52 102.887 l 236.406 102.887 l 
236.406 120.148 l 213.52 120.148 l 213.52 137.781 l 236.406 137.781 l h
196.258 120.148 m 178.625 120.148 l 178.625 137.781 l 196.258 137.781 l 
196.258 120.148 l h
196.258 120.148 m f
0.984314 0.568627 0.219608 rg
161.367 177.926 m 170.371 177.926 l 170.371 152.414 l 161.367 152.414 l 
161.367 177.926 l h
161.367 177.926 m f
196.258 140.406 m 204.512 140.406 l 204.512 117.523 l 196.258 117.523 l 
196.258 140.406 l h
196.258 140.406 m f
161.367 140.406 m 170.371 140.406 l 170.371 117.523 l 161.367 117.523 l 
161.367 140.406 l h
161.367 140.406 m f
196.258 177.926 m 204.512 177.926 l 204.512 152.414 l 196.258 152.414 l 
196.258 177.926 l h
196.258 177.926 m f
196.258 105.516 m 204.512 105.516 l 204.512 80.004 l 196.258 80.004 l 
196.258 105.516 l h
196.258 105.516 m f
161.367 105.516 m 170.371 105.516 l 170.371 80.004 l 161.367 80.004 l 
161.367 105.516 l h
161.367 105.516 m f
138.48 155.039 m 147.109 155.039 l 147.109 137.781 l 138.48 137.781 l 
138.48 155.039 l h
138.48 155.039 m f
138.48 120.148 m 147.109 120.148 l 147.109 102.891 l 138.48 102.891 l 
138.48 120.148 l h
138.48 120.148 m f
0 g
279.605 36.801 m 95.285 36.801 l 95.285 221.121 l 279.605 221.121 l 
279.605 36.801 l h
100.91 42.43 m 273.977 42.43 l 273.977 215.496 l 100.91 215.496 l 
100.91 42.43 l h
100.91 42.43 m f
109.59 206.441 m 115.594 206.441 l 115.594 200.816 l 109.59 200.816 l 
109.59 206.441 l h
109.59 206.441 m f
256.664 206.441 m 262.293 206.441 l 262.293 200.816 l 256.664 200.816 l 
256.664 206.441 l h
256.664 206.441 m f
123.848 206.441 m 248.031 206.441 l 248.031 200.816 l 123.848 200.816 l 
123.848 206.441 l h
123.848 206.441 m f
109.59 57.117 m 115.594 57.117 l 115.594 51.492 l 109.59 51.492 l 
109.59 57.117 l h
109.59 57.117 m f
256.664 57.117 m 262.293 57.117 l 262.293 51.492 l 256.664 51.492 l 
256.664 57.117 l h
256.664 57.117 m f
123.848 57.117 m 248.031 57.117 l 248.031 51.492 l 123.848 51.492 l 
123.848 57.117 l h
123.848 57.117 m f
256.664 192.559 m 262.293 192.559 l 262.293 65.371 l 256.664 65.371 l 
256.664 192.559 l h
256.664 192.559 m f
109.965 192.559 m 115.59 192.559 l 115.59 65.371 l 109.965 65.371 l 
109.965 192.559 l h
109.965 192.559 m f
216.52 77.375 m 193.258 77.375 l 193.258 99.887 l 181.629 99.887 l 
181.629 77.375 l 158.367 77.375 l 158.367 99.887 l 135.855 99.887 l 
135.855 123.148 l 158.367 123.148 l 158.367 134.777 l 135.855 134.777 l 
135.855 158.039 l 158.367 158.039 l 158.367 180.551 l 181.629 180.551 l 
181.629 158.039 l 193.258 158.039 l 193.258 180.551 l 216.52 180.551 l 
216.52 158.039 l 239.031 158.039 l 239.031 134.777 l 216.52 134.777 l 
216.52 123.148 l 239.031 123.148 l 239.031 99.887 l 216.52 99.887 l 
216.52 77.375 l h
198.887 83.004 m 210.891 83.004 l 210.891 105.516 l 233.402 105.516 l 
233.402 117.52 l 210.891 117.52 l 210.891 140.406 l 233.402 140.406 l 
233.402 152.414 l 210.891 152.414 l 210.891 174.926 l 198.887 174.926 l 
198.887 152.414 l 176 152.414 l 176 174.926 l 163.992 174.926 l 163.992 
152.414 l 141.484 152.414 l 141.484 140.406 l 163.992 140.406 l 163.992 
117.52 l 141.484 117.52 l 141.484 105.516 l 163.992 105.516 l 163.992 
83.004 l 176 83.004 l 176 105.516 l 198.887 105.516 l 198.887 83.004 l 
h
198.887 117.52 m 176 117.52 l 176 140.406 l 198.887 140.406 l 198.887 
117.52 l h
181.629 123.148 m 193.258 123.148 l 193.258 134.777 l 181.629 134.777 l 
181.629 123.148 l h
181.629 123.148 m f
0.0980392 0.317647 0.411765 rg
117.086 169.133 m 121.961 196.242 108.352 216.727 81.164 223.758 c 
48.758 232.164 24.305 215.727 14.711 178.68 c 5.43 142.836 18.727 
117.055 50.945 108.711 c 77.305 101.883 99.867 113.43 109.211 138.727 c 
82.227 145.711 l 74.961 132.57 67.914 128.586 57.023 131.414 c 42.742 
135.117 37.414 150.227 42.883 171.383 c 45.555 181.648 50.07 190.805 
55.164 196.352 c 59.961 201.555 67.023 203.164 75.07 201.086 c 86.555 
198.102 90.586 191.258 90.102 176.117 c 117.086 169.133 l h
117.086 169.133 m f
0.831373 g
274.574 47.789 m 272.34 51.227 271.996 53.195 272.84 56.477 c 281.902 
91.508 l 285.23 104.336 278.168 113.164 261.105 117.57 c 244.059 
121.992 233.309 117.039 228.48 102.727 c 244.246 98.633 l 246.746 
104.961 249.98 106.352 258.043 104.258 c 264.34 102.633 266.949 99.727 
265.855 95.523 c 265.324 93.414 263.793 91.82 261.793 91.336 c 259.277 
90.758 259.277 90.758 250.887 91.555 c 244.043 92.086 l 230.996 93.211 
223.262 88.367 220.324 77.039 c 218.934 71.664 219.324 66.836 221.418 
62.914 c 224.059 58.242 228.965 54.602 234.574 53.148 c 241.59 51.336 
248.793 52.711 256.074 57.195 c 255.215 53.93 255.262 52.664 256.293 
50.398 c 274.059 45.805 l 274.574 47.789 l h
260.871 76.242 m 258.418 66.789 252.355 62.633 244.074 64.789 c 238.574 
66.211 235.965 70.008 237.168 74.68 c 238.434 79.57 241.605 81.227 
248.746 80.898 c 254.621 80.492 l 259.152 80.195 259.902 80.242 262.027 
80.695 c 260.871 76.242 l h
260.871 76.242 m f
0.701961 g
296.215 109.375 m 296.09 41.297 l 313.746 41.266 l 313.809 77.453 l 
313.824 87.781 319.012 92.953 329.34 92.922 c 331.246 92.922 332.496 
92.797 334.902 92.422 c 334.934 110.328 l 333.918 110.453 333.293 
110.453 332.777 110.453 c 324.715 110.469 317.637 105.188 313.84 95.984 
c 313.871 109.344 l 296.215 109.375 l h
296.215 109.375 m f
395.719 129.582 m 376.812 129.613 l 376.766 103.145 l 381.875 64.176 l 
390.312 64.16 l 395.672 103.113 l 395.719 129.582 l h
395.594 56.457 m 376.688 56.488 l 376.656 38.082 l 395.562 38.051 l 
395.594 56.457 l h
395.594 56.457 m f
0.0980392 0.317647 0.411765 rg
26.922 17.785 m 26.797 19.395 26.469 20.41 25.672 21.441 c 24.219 
23.348 21.922 24.395 19.125 24.395 c 13.859 24.379 10.594 20.613 10.594 
14.566 c 10.609 8.582 13.859 4.816 19.062 4.832 c 23.688 4.832 26.781 
7.535 27 11.816 c 23.266 11.801 l 23.047 9.426 21.531 8.066 19.156 
8.066 c 16.188 8.066 14.453 10.457 14.438 14.52 c 14.438 18.645 16.25 
21.113 19.266 21.113 c 20.609 21.113 21.703 20.66 22.422 19.754 c 
22.828 19.254 23.031 18.754 23.266 17.77 c 26.922 17.785 l h
26.922 17.785 m f
34.5 19.496 m 30.281 19.48 27.688 16.699 27.688 12.168 c 27.703 7.605 
30.297 4.84 34.547 4.855 c 38.734 4.855 41.375 7.652 41.359 12.074 c 
41.359 16.762 38.828 19.496 34.5 19.496 c h
34.531 16.605 m 36.5 16.605 37.781 14.84 37.781 12.137 c 37.797 9.543 
36.469 7.746 34.547 7.746 c 32.594 7.746 31.297 9.527 31.281 12.168 c 
31.281 14.809 32.578 16.605 34.531 16.605 c h
34.531 16.605 m f
50.055 19.293 m 50.07 5.465 l 53.664 5.465 l 53.648 13.762 l 53.648 
15.449 54.57 16.48 56.102 16.48 c 57.305 16.48 58.039 15.793 58.039 
14.699 c 58.055 5.48 l 61.648 5.48 l 61.633 13.777 l 61.633 15.465 
62.555 16.48 64.086 16.48 c 65.289 16.48 66.023 15.809 66.023 14.715 c 
66.039 5.496 l 69.633 5.496 l 69.617 15.277 l 69.617 17.965 67.977 
19.543 65.211 19.527 c 63.477 19.527 62.242 18.918 61.164 17.48 c 
60.508 18.793 59.117 19.527 57.398 19.527 c 55.82 19.527 54.789 18.996 
53.617 17.574 c 53.617 19.293 l 50.055 19.293 l h
50.055 19.293 m f
71.879 19.32 m 71.895 5.492 l 75.488 5.492 l 75.473 13.789 l 75.473 
15.477 76.395 16.508 77.926 16.508 c 79.129 16.508 79.863 15.82 79.863 
14.727 c 79.879 5.508 l 83.473 5.508 l 83.457 13.805 l 83.457 15.492 
84.379 16.508 85.91 16.508 c 87.113 16.508 87.848 15.836 87.848 14.742 
c 87.863 5.523 l 91.457 5.523 l 91.441 15.305 l 91.441 17.992 89.801 
19.57 87.035 19.555 c 85.301 19.555 84.066 18.945 82.988 17.508 c 
82.332 18.82 80.941 19.555 79.223 19.555 c 77.645 19.555 76.613 19.023 
75.441 17.602 c 75.441 19.32 l 71.879 19.32 l h
71.879 19.32 m f
106.031 5.539 m 106.016 19.367 l 102.438 19.367 l 102.453 10.711 l 
102.453 9.07 101.297 7.992 99.562 7.992 c 98.016 7.992 97.25 8.805 
97.25 10.461 c 97.234 19.352 l 93.656 19.352 l 93.672 9.727 l 93.672 
6.68 95.359 4.93 98.297 4.945 c 100.172 4.945 101.422 5.648 102.453 
7.18 c 102.453 5.539 l 106.031 5.539 l h
106.031 5.539 m f
111.469 19.379 m 111.484 5.551 l 115.078 5.551 l 115.062 13.848 l 
115.062 15.488 116.203 16.566 117.953 16.566 c 119.484 16.566 120.25 
15.723 120.25 14.082 c 120.266 5.566 l 123.844 5.566 l 123.828 14.832 l 
123.828 17.879 122.141 19.613 119.203 19.613 c 117.328 19.613 116.078 
18.926 115.062 17.379 c 115.062 19.379 l 111.469 19.379 l h
111.469 19.379 m f
134.043 19.402 m 130.465 19.402 l 130.48 5.574 l 134.059 5.574 l 
134.043 19.402 l h
134.027 24.23 m 130.449 24.23 l 130.465 21.027 l 134.043 21.027 l 
134.027 24.23 l h
134.027 24.23 m f
143.348 19.148 m 141.348 19.148 l 141.332 22.852 l 137.754 22.836 l 
137.77 19.133 l 136.004 19.133 l 136.004 16.742 l 137.77 16.742 l 
137.785 8.242 l 137.785 6.07 138.941 4.992 141.285 4.992 c 142.082 
5.008 142.723 5.086 143.363 5.289 c 143.363 7.805 l 143.004 7.758 
142.801 7.727 142.551 7.727 c 141.598 7.727 141.363 8.008 141.363 9.242 
c 141.348 16.758 l 143.348 16.758 l 143.348 19.148 l h
143.348 19.148 m f
160.676 19.449 m 157.832 9.387 l 154.77 19.434 l 150.832 19.434 l 
155.988 5.043 l 155.988 5.012 l 155.988 4.934 l 155.988 3.637 155.02 
2.637 153.754 2.637 c 153.473 2.637 153.27 2.668 152.816 2.793 c 
152.816 0.105 l 153.348 0.027 153.66 -0.004 154.098 -0.004 c 154.988 
-0.004 156.066 0.184 156.676 0.449 c 157.676 0.855 158.113 1.449 
158.707 3.09 c 164.363 19.449 l 160.676 19.449 l h
160.676 19.449 m f
f
177.586 24.297 m 177.617 5.641 l 181.195 5.641 l 181.18 13.938 l 181.18 
15.516 182.336 16.656 183.945 16.656 c 184.711 16.656 185.32 16.375 
185.742 15.813 c 186.039 15.359 186.148 15 186.148 14.109 c 186.164 
5.656 l 189.742 5.656 l 189.727 14.922 l 189.727 16.641 189.273 17.859 
188.32 18.656 c 187.523 19.328 186.383 19.703 185.227 19.703 c 183.461 
19.703 182.18 18.984 181.18 17.469 c 181.164 24.297 l 177.586 24.297 l 
h
177.586 24.297 m f
207.219 5.68 m 207.203 19.508 l 203.625 19.508 l 203.641 10.852 l 
203.641 9.211 202.484 8.133 200.75 8.133 c 199.203 8.133 198.438 8.945 
198.438 10.602 c 198.422 19.492 l 194.844 19.492 l 194.859 9.867 l 
194.859 6.82 196.547 5.07 199.484 5.086 c 201.359 5.086 202.609 5.789 
203.641 7.32 c 203.641 5.68 l 207.219 5.68 l h
207.219 5.68 m f
212.543 24.348 m 212.574 5.691 l 216.152 5.691 l 216.152 7.098 l 
217.027 5.754 218.23 5.113 219.965 5.113 c 223.262 5.113 225.777 8.27 
225.762 12.441 c 225.762 14.301 225.199 16.207 224.277 17.535 c 223.324 
18.895 221.637 19.754 219.949 19.754 c 218.23 19.754 217.012 19.113 
216.137 17.723 c 216.121 24.348 l 212.543 24.348 l h
219.152 16.77 m 220.918 16.77 222.184 14.973 222.184 12.41 c 222.199 
9.91 220.934 8.113 219.168 8.113 c 217.355 8.113 216.152 9.832 216.137 
12.473 c 216.137 14.988 217.371 16.77 219.152 16.77 c h
219.152 16.77 m f
239.02 15.102 m 238.973 18.008 236.723 19.773 233.004 19.773 c 229.504 
19.758 227.332 17.992 227.332 15.148 c 227.332 14.227 227.613 13.445 
228.098 12.898 c 228.582 12.414 229.02 12.18 230.348 11.758 c 234.629 
10.43 l 235.535 10.148 235.832 9.867 235.832 9.305 c 235.832 8.461 
234.848 7.961 233.176 7.961 c 232.254 7.961 231.52 8.117 231.051 8.43 c 
230.676 8.711 230.52 8.992 230.363 9.727 c 226.863 9.727 l 226.957 
6.711 229.191 5.117 233.379 5.133 c 235.301 5.133 236.754 5.555 237.785 
6.367 c 238.801 7.18 239.426 8.461 239.426 9.82 c 239.41 11.617 238.504 
12.758 236.691 13.305 c 232.16 14.602 l 231.16 14.898 230.91 15.102 
230.91 15.664 c 230.91 16.43 231.723 16.945 232.988 16.961 c 234.691 
16.961 235.535 16.352 235.566 15.102 c 239.02 15.102 l h
239.02 15.102 m f
f
260.711 6.195 m 260.07 6.789 259.898 7.164 259.898 7.883 c 259.883 
15.555 l 259.883 18.383 257.961 19.805 254.227 19.805 c 250.492 19.789 
248.539 18.211 248.32 15.008 c 251.773 15.008 l 251.945 16.445 252.539 
16.898 254.305 16.914 c 255.68 16.914 256.367 16.461 256.367 15.539 c 
256.367 15.07 256.148 14.664 255.758 14.461 c 255.273 14.211 255.273 
14.211 253.508 13.93 c 252.07 13.648 l 249.336 13.195 248.008 11.789 
248.023 9.305 c 248.023 8.117 248.352 7.148 248.992 6.461 c 249.789 
5.633 250.992 5.148 252.211 5.148 c 253.758 5.164 255.164 5.836 256.414 
7.133 c 256.414 6.43 256.492 6.164 256.82 5.758 c 260.711 5.758 l 
260.711 6.195 l h
256.383 11.305 m 256.383 9.242 255.367 8.055 253.555 8.055 c 252.352 
8.039 251.602 8.68 251.602 9.711 c 251.602 10.789 252.164 11.289 
253.633 11.617 c 254.867 11.852 l 255.805 12.023 255.961 12.086 256.367 
12.289 c 256.383 11.305 l h
256.383 11.305 m f
266.684 19.594 m 266.699 5.766 l 270.293 5.766 l 270.277 14.063 l 
270.277 15.703 271.418 16.781 273.168 16.781 c 274.699 16.781 275.465 
15.938 275.465 14.297 c 275.48 5.781 l 279.059 5.781 l 279.043 15.047 l 
279.043 18.094 277.355 19.828 274.418 19.828 c 272.543 19.828 271.293 
19.141 270.277 17.594 c 270.277 19.594 l 266.684 19.594 l h
266.684 19.594 m f
294.336 5.809 m 297.93 5.809 l 297.898 24.465 l 294.305 24.465 l 294.32 
17.84 l 293.43 19.215 292.227 19.855 290.508 19.855 c 287.211 19.84 
284.711 16.668 284.711 12.496 c 284.727 10.637 285.289 8.73 286.211 
7.402 c 287.148 6.074 288.836 5.199 290.523 5.215 c 292.242 5.215 
293.445 5.855 294.336 7.215 c 294.336 5.809 l h
291.305 16.871 m 293.117 16.871 294.32 15.105 294.32 12.465 c 294.336 
9.949 293.117 8.215 291.32 8.215 c 289.523 8.199 288.305 9.965 288.289 
12.496 c 288.289 15.059 289.508 16.855 291.305 16.871 c h
291.305 16.871 m f
f
310.516 19.656 m 310.531 5.828 l 314.125 5.828 l 314.109 13.172 l 
314.109 15.266 315.156 16.344 317.25 16.344 c 317.641 16.344 317.891 
16.313 318.375 16.234 c 318.375 19.875 l 318.172 19.891 318.047 19.891 
317.938 19.891 c 316.297 19.891 314.875 18.813 314.109 16.938 c 314.109 
19.656 l 310.516 19.656 l h
310.516 19.656 m f
333.012 19.914 m 328.793 19.898 326.199 17.117 326.199 12.586 c 326.215 
8.023 328.809 5.258 333.059 5.273 c 337.246 5.273 339.887 8.07 339.871 
12.492 c 339.871 17.18 337.34 19.914 333.012 19.914 c h
333.043 17.023 m 335.012 17.023 336.293 15.258 336.293 12.555 c 336.309 
9.961 334.98 8.164 333.059 8.164 c 331.105 8.164 329.809 9.945 329.793 
12.586 c 329.793 15.227 331.09 17.023 333.043 17.023 c h
333.043 17.023 m f
360.898 5.895 m 360.883 19.723 l 357.305 19.723 l 357.32 11.066 l 
357.32 9.426 356.164 8.348 354.43 8.348 c 352.883 8.348 352.117 9.16 
352.117 10.816 c 352.102 19.707 l 348.523 19.707 l 348.539 10.082 l 
348.539 7.035 350.227 5.285 353.164 5.301 c 355.039 5.301 356.289 6.004 
357.32 7.535 c 357.32 5.895 l 360.898 5.895 l h
360.898 5.895 m f
372.426 19.469 m 370.426 19.469 l 370.41 23.172 l 366.832 23.156 l 
366.848 19.453 l 365.082 19.453 l 365.082 17.063 l 366.848 17.063 l 
366.863 8.563 l 366.863 6.391 368.02 5.313 370.363 5.313 c 371.16 5.328 
371.801 5.406 372.441 5.609 c 372.441 8.125 l 372.082 8.078 371.879 
8.047 371.629 8.047 c 370.676 8.047 370.441 8.328 370.441 9.563 c 
370.426 17.078 l 372.426 17.078 l 372.426 19.469 l h
372.426 19.469 m f
393.078 11.723 m 393.109 12.035 393.109 12.16 393.109 12.348 c 393.109 
13.723 392.906 15.004 392.578 15.973 c 391.656 18.488 389.422 19.988 
386.641 19.988 c 382.672 19.973 380.234 17.113 380.234 12.473 c 380.25 
8.051 382.656 5.332 386.578 5.348 c 389.672 5.348 392.172 7.113 392.969 
9.832 c 389.438 9.832 l 389 8.738 388 8.098 386.703 8.098 c 385.672 
8.098 384.859 8.504 384.344 9.285 c 384.016 9.785 383.891 10.41 383.812 
11.707 c 393.078 11.723 l h
383.875 14.098 m 384.094 16.191 385 17.238 386.578 17.254 c 387.484 
17.254 388.297 16.816 388.812 16.098 c 389.141 15.598 389.297 15.051 
389.375 14.113 c 383.875 14.098 l h
383.875 14.098 m f
407.48 15.336 m 407.434 18.242 405.184 20.008 401.465 20.008 c 397.965 
19.992 395.793 18.227 395.793 15.383 c 395.793 14.461 396.074 13.68 
396.559 13.133 c 397.043 12.648 397.48 12.414 398.809 11.992 c 403.09 
10.664 l 403.996 10.383 404.293 10.102 404.293 9.539 c 404.293 8.695 
403.309 8.195 401.637 8.195 c 400.715 8.195 399.98 8.352 399.512 8.664 
c 399.137 8.945 398.98 9.227 398.824 9.961 c 395.324 9.961 l 395.418 
6.945 397.652 5.352 401.84 5.367 c 403.762 5.367 405.215 5.789 406.246 
6.602 c 407.262 7.414 407.887 8.695 407.887 10.055 c 407.871 11.852 
406.965 12.992 405.152 13.539 c 400.621 14.836 l 399.621 15.133 399.371 
15.336 399.371 15.898 c 399.371 16.664 400.184 17.18 401.449 17.195 c 
403.152 17.195 403.996 16.586 404.027 15.336 c 407.48 15.336 l h
407.48 15.336 m f
Q
showpage
%%Trailer
count op_count sub {pop} repeat
countdictstack dict_count sub {end} repeat
cairo_eps_state restore
%%EOF
