<?xml version="1.0" encoding="UTF-8" standalone="no" ?>
<!DOCTYPE svg PUBLIC "-//W3C//DTD SVG 1.1//EN" "http://www.w3.org/Graphics/SVG/1.1/DTD/svg11.dtd">
<svg xmlns="http://www.w3.org/2000/svg" xmlns:xlink="http://www.w3.org/1999/xlink" version="1.1" width="518.25" height="424.10208" xml:space="preserve">
<desc>Created with Fabric.js 1.6.0-rc.1</desc>
<defs></defs>
<g style="stroke: none; stroke-width: 1; stroke-dasharray: none; stroke-linecap: butt; stroke-linejoin: miter; stroke-miterlimit: 10; fill: none; fill-rule: nonzero; opacity: 1;" transform="translate(117.68000000000006 119.4) scale(0.45 0.45)" >
  <rect x="7.82" y="7.82" rx="0" ry="0" width="496.36" height="496.36" style="stroke: none; stroke-width: 1; stroke-dasharray: none; stroke-linecap: butt; stroke-linejoin: miter; stroke-miterlimit: 10; fill: #1595A3; fill-rule: nonzero; opacity: 1;" transform=" matrix(1 0 0 1 0 0) "/>
  <polyline points="7.82,504.18 7.82,7.82 496.57,8.48 " style="stroke: none; stroke-width: 1; stroke-dasharray: none; stroke-linecap: butt; stroke-linejoin: miter; stroke-miterlimit: 10; fill: #ACF0F2; fill-rule: nonzero; opacity: 1;" transform="  matrix(1 0 0 1 0 0) "/>
  <rect x="47.85" y="47.85" rx="0" ry="0" width="408.3" height="416.31" style="stroke: none; stroke-width: 1; stroke-dasharray: none; stroke-linecap: butt; stroke-linejoin: miter; stroke-miterlimit: 10; fill: #FFFFFF; fill-rule: nonzero; opacity: 1;" transform=" matrix(1 0 0 1 0 0) "/>
  <path d="M 392.002 231.505 v -47.941 h -63.573 v -63.573 h -47.941 v 63.573 h -48.983 v -63.573 h -47.941 v 63.573 h -63.573 v 47.941 h 63.573 v 48.983 h -63.573 v 47.941 h 63.573 v 63.573 h 47.941 v -63.573 h 48.983 v 63.573 h 47.941 v -63.573 h 63.573 v -47.941 h -63.573 v -48.983 H 392.002 z M 280.488 280.488 h -48.983 v -48.983 h 48.983 V 280.488 z" style="stroke: none; stroke-width: 1; stroke-dasharray: none; stroke-linecap: butt; stroke-linejoin: miter; stroke-miterlimit: 10; fill: #FDB275; fill-rule: nonzero; opacity: 1;" transform=" matrix(1 0 0 1 0 0) " stroke-linecap="round" />
  <rect x="183.56" y="119.99" rx="0" ry="0" width="25.01" height="70.87" style="stroke: none; stroke-width: 1; stroke-dasharray: none; stroke-linecap: butt; stroke-linejoin: miter; stroke-miterlimit: 10; fill: #FB9138; fill-rule: nonzero; opacity: 1;" transform=" matrix(1 0 0 1 0 0) "/>
  <rect x="280.48" y="224.21" rx="0" ry="0" width="22.93" height="63.57" style="stroke: none; stroke-width: 1; stroke-dasharray: none; stroke-linecap: butt; stroke-linejoin: miter; stroke-miterlimit: 10; fill: #FB9138; fill-rule: nonzero; opacity: 1;" transform=" matrix(1 0 0 1 0 0) "/>
  <rect x="183.56" y="224.21" rx="0" ry="0" width="25.01" height="63.57" style="stroke: none; stroke-width: 1; stroke-dasharray: none; stroke-linecap: butt; stroke-linejoin: miter; stroke-miterlimit: 10; fill: #FB9138; fill-rule: nonzero; opacity: 1;" transform=" matrix(1 0 0 1 0 0) "/>
  <rect x="280.48" y="119.99" rx="0" ry="0" width="22.93" height="70.87" style="stroke: none; stroke-width: 1; stroke-dasharray: none; stroke-linecap: butt; stroke-linejoin: miter; stroke-miterlimit: 10; fill: #FB9138; fill-rule: nonzero; opacity: 1;" transform=" matrix(1 0 0 1 0 0) "/>
  <rect x="280.48" y="321.13" rx="0" ry="0" width="22.93" height="70.87" style="stroke: none; stroke-width: 1; stroke-dasharray: none; stroke-linecap: butt; stroke-linejoin: miter; stroke-miterlimit: 10; fill: #FB9138; fill-rule: nonzero; opacity: 1;" transform=" matrix(1 0 0 1 0 0) "/>
  <rect x="183.56" y="321.13" rx="0" ry="0" width="25.01" height="70.87" style="stroke: none; stroke-width: 1; stroke-dasharray: none; stroke-linecap: butt; stroke-linejoin: miter; stroke-miterlimit: 10; fill: #FB9138; fill-rule: nonzero; opacity: 1;" transform=" matrix(1 0 0 1 0 0) "/>
  <rect x="119.99" y="183.56" rx="0" ry="0" width="23.97" height="47.94" style="stroke: none; stroke-width: 1; stroke-dasharray: none; stroke-linecap: butt; stroke-linejoin: miter; stroke-miterlimit: 10; fill: #FB9138; fill-rule: nonzero; opacity: 1;" transform=" matrix(1 0 0 1 0 0) "/>
  <rect x="119.99" y="280.48" rx="0" ry="0" width="23.97" height="47.94" style="stroke: none; stroke-width: 1; stroke-dasharray: none; stroke-linecap: butt; stroke-linejoin: miter; stroke-miterlimit: 10; fill: #FB9138; fill-rule: nonzero; opacity: 1;" transform=" matrix(1 0 0 1 0 0) "/>
  <path d="M 512 512 H 0 V 0 h 512 V 512 z M 15.633 496.367 h 480.734 V 15.633 H 15.633 V 496.367 z" style="stroke: none; stroke-width: 1; stroke-dasharray: none; stroke-linecap: butt; stroke-linejoin: miter; stroke-miterlimit: 10; fill: rgb(0,0,0); fill-rule: nonzero; opacity: 1;" transform=" matrix(1 0 0 1 0 0) " stroke-linecap="round" />
  <rect x="39.74" y="40.78" rx="0" ry="0" width="16.68" height="15.63" style="stroke: none; stroke-width: 1; stroke-dasharray: none; stroke-linecap: butt; stroke-linejoin: miter; stroke-miterlimit: 10; fill: rgb(0,0,0); fill-rule: nonzero; opacity: 1;" transform=" matrix(1 0 0 1 0 0) "/>
  <rect x="448.28" y="40.78" rx="0" ry="0" width="15.63" height="15.63" style="stroke: none; stroke-width: 1; stroke-dasharray: none; stroke-linecap: butt; stroke-linejoin: miter; stroke-miterlimit: 10; fill: rgb(0,0,0); fill-rule: nonzero; opacity: 1;" transform=" matrix(1 0 0 1 0 0) "/>
  <rect x="79.34" y="40.78" rx="0" ry="0" width="344.96" height="15.63" style="stroke: none; stroke-width: 1; stroke-dasharray: none; stroke-linecap: butt; stroke-linejoin: miter; stroke-miterlimit: 10; fill: rgb(0,0,0); fill-rule: nonzero; opacity: 1;" transform=" matrix(1 0 0 1 0 0) "/>
  <rect x="39.74" y="455.57" rx="0" ry="0" width="16.68" height="15.63" style="stroke: none; stroke-width: 1; stroke-dasharray: none; stroke-linecap: butt; stroke-linejoin: miter; stroke-miterlimit: 10; fill: rgb(0,0,0); fill-rule: nonzero; opacity: 1;" transform=" matrix(1 0 0 1 0 0) "/>
  <rect x="448.28" y="455.57" rx="0" ry="0" width="15.63" height="15.63" style="stroke: none; stroke-width: 1; stroke-dasharray: none; stroke-linecap: butt; stroke-linejoin: miter; stroke-miterlimit: 10; fill: rgb(0,0,0); fill-rule: nonzero; opacity: 1;" transform=" matrix(1 0 0 1 0 0) "/>
  <rect x="79.34" y="455.57" rx="0" ry="0" width="344.96" height="15.63" style="stroke: none; stroke-width: 1; stroke-dasharray: none; stroke-linecap: butt; stroke-linejoin: miter; stroke-miterlimit: 10; fill: rgb(0,0,0); fill-rule: nonzero; opacity: 1;" transform=" matrix(1 0 0 1 0 0) "/>
  <rect x="448.28" y="79.34" rx="0" ry="0" width="15.63" height="353.3" style="stroke: none; stroke-width: 1; stroke-dasharray: none; stroke-linecap: butt; stroke-linejoin: miter; stroke-miterlimit: 10; fill: rgb(0,0,0); fill-rule: nonzero; opacity: 1;" transform=" matrix(1 0 0 1 0 0) "/>
  <rect x="40.78" y="79.34" rx="0" ry="0" width="15.63" height="353.3" style="stroke: none; stroke-width: 1; stroke-dasharray: none; stroke-linecap: butt; stroke-linejoin: miter; stroke-miterlimit: 10; fill: rgb(0,0,0); fill-rule: nonzero; opacity: 1;" transform=" matrix(1 0 0 1 0 0) "/>
  <path d="M 336.766 399.298 h -64.616 v -62.531 h -32.308 v 62.531 h -64.616 v -62.531 h -62.531 v -64.616 h 62.531 v -32.308 h -62.531 v -64.616 h 62.531 v -62.531 h 64.616 v 62.531 h 32.308 v -62.531 h 64.616 v 62.531 h 62.531 v 64.616 h -62.531 v 32.308 h 62.531 v 64.616 h -62.531 V 399.298 z M 287.784 383.665 h 33.35 v -62.531 h 62.531 v -33.35 h -62.531 V 224.21 h 62.531 v -33.35 h -62.531 v -62.531 h -33.35 v 62.531 H 224.21 v -62.531 h -33.35 v 62.531 h -62.531 v 33.35 h 62.531 v 63.573 h -62.531 v 33.35 h 62.531 v 62.531 h 33.35 v -62.531 h 63.573 V 383.665 z M 287.784 287.784 H 224.21 V 224.21 h 63.573 V 287.784 z M 239.843 272.151 h 32.308 v -32.308 h -32.308 V 272.151 z" style="stroke: none; stroke-width: 1; stroke-dasharray: none; stroke-linecap: butt; stroke-linejoin: miter; stroke-miterlimit: 10; fill: rgb(0,0,0); fill-rule: nonzero; opacity: 1;" transform=" matrix(1 0 0 1 0 0) " stroke-linecap="round" />
</g>
  <g transform="translate(91.35 200.98) rotate(14.52) scale(6.5 6.5)">
   <text font-family="ADAMCG PRO" font-size="40" font-weight="bold" style="stroke: none; stroke-width: 1; stroke-dasharray: none; stroke-linecap: butt; stroke-linejoin: miter; stroke-miterlimit: 10; fill: #195169; fill-rule: nonzero; opacity: 1;" ><tspan x="-13.54" y="8.98" style="stroke: none; stroke-width: 0; stroke-dasharray: none; stroke-linecap: butt; stroke-linejoin: miter; stroke-miterlimit: 4; fill: #195169; fill-rule: ; opacity: 1;">c</tspan></text>
 </g>
  <g transform="translate(323.86 299.11) rotate(14.52) scale(3.77 3.77)">
   <text font-family="ADAMCG PRO" font-size="40" font-weight="bold" style="stroke: none; stroke-width: 1; stroke-dasharray: none; stroke-linecap: butt; stroke-linejoin: miter; stroke-miterlimit: 10; fill: #d4d4d4; fill-rule: nonzero; opacity: 1;" ><tspan x="-13.9" y="8.98" style="stroke: none; stroke-width: 0; stroke-dasharray: none; stroke-linecap: butt; stroke-linejoin: miter; stroke-miterlimit: 4; fill: #d4d4d4; fill-rule: ; opacity: 1;">a</tspan></text>
 </g>
  <g transform="translate(409.3 308.87) rotate(0.1) scale(3.94 3.94)">
   <text font-family="ADAMCG PRO" font-size="40" font-weight="bold" style="stroke: none; stroke-width: 1; stroke-dasharray: none; stroke-linecap: butt; stroke-linejoin: miter; stroke-miterlimit: 10; fill: #b3b3b3; fill-rule: nonzero; opacity: 1;" ><tspan x="-12.81" y="8.98" style="stroke: none; stroke-width: 0; stroke-dasharray: none; stroke-linecap: butt; stroke-linejoin: miter; stroke-miterlimit: 4; fill: #b3b3b3; fill-rule: ; opacity: 1;">r</tspan></text>
 </g>
  <g transform="translate(473.63 312.82) rotate(0.1) scale(3.94 3.94)">
   <text font-family="ADAMCG PRO" font-size="40" font-weight="bold" style="stroke: none; stroke-width: 1; stroke-dasharray: none; stroke-linecap: butt; stroke-linejoin: miter; stroke-miterlimit: 10; fill: #b3b3b3; fill-rule: nonzero; opacity: 1;" ><tspan x="-5.54" y="8.98" style="stroke: none; stroke-width: 0; stroke-dasharray: none; stroke-linecap: butt; stroke-linejoin: miter; stroke-miterlimit: 4; fill: #b3b3b3; fill-rule: ; opacity: 1;">!</tspan></text>
 </g>
  <g transform="translate(259.55 381.51) rotate(359.92) scale(0.8 0.8)">
   <text font-family="ADAMCG PRO" font-size="40" font-weight="bold" style="stroke: none; stroke-width: 1; stroke-dasharray: none; stroke-linecap: butt; stroke-linejoin: miter; stroke-miterlimit: 10; fill: #195169; fill-rule: nonzero; opacity: 1;" ><tspan x="-311.41" y="8.98" style="stroke: none; stroke-width: 0; stroke-dasharray: none; stroke-linecap: butt; stroke-linejoin: miter; stroke-miterlimit: 4; fill: #195169; fill-rule: ; opacity: 1;">C</tspan><tspan x="-284.34" y="8.98" style="stroke: none; stroke-width: 0; stroke-dasharray: none; stroke-linecap: butt; stroke-linejoin: miter; stroke-miterlimit: 4; fill: #195169; fill-rule: ; opacity: 1;">o</tspan><tspan x="-250.39" y="8.98" style="stroke: none; stroke-width: 0; stroke-dasharray: none; stroke-linecap: butt; stroke-linejoin: miter; stroke-miterlimit: 4; fill: #195169; fill-rule: ; opacity: 1;">m</tspan><tspan x="-216.29" y="8.98" style="stroke: none; stroke-width: 0; stroke-dasharray: none; stroke-linecap: butt; stroke-linejoin: miter; stroke-miterlimit: 4; fill: #195169; fill-rule: ; opacity: 1;">m</tspan><tspan x="-182.19" y="8.98" style="stroke: none; stroke-width: 0; stroke-dasharray: none; stroke-linecap: butt; stroke-linejoin: miter; stroke-miterlimit: 4; fill: #195169; fill-rule: ; opacity: 1;">u</tspan><tspan x="-154.55" y="8.98" style="stroke: none; stroke-width: 0; stroke-dasharray: none; stroke-linecap: butt; stroke-linejoin: miter; stroke-miterlimit: 4; fill: #195169; fill-rule: ; opacity: 1;">n</tspan><tspan x="-125.04" y="8.98" style="stroke: none; stroke-width: 0; stroke-dasharray: none; stroke-linecap: butt; stroke-linejoin: miter; stroke-miterlimit: 4; fill: #195169; fill-rule: ; opacity: 1;">i</tspan><tspan x="-114.26" y="8.98" style="stroke: none; stroke-width: 0; stroke-dasharray: none; stroke-linecap: butt; stroke-linejoin: miter; stroke-miterlimit: 4; fill: #195169; fill-rule: ; opacity: 1;">t</tspan><tspan x="-90.9" y="8.98" style="stroke: none; stroke-width: 0; stroke-dasharray: none; stroke-linecap: butt; stroke-linejoin: miter; stroke-miterlimit: 4; fill: #195169; fill-rule: ; opacity: 1;">y</tspan><tspan x="-63.38" y="8.98" style="stroke: none; stroke-width: 0; stroke-dasharray: none; stroke-linecap: butt; stroke-linejoin: miter; stroke-miterlimit: 4; fill: #195169; fill-rule: ; opacity: 1;"> </tspan><tspan x="-51.39" y="8.98" style="stroke: none; stroke-width: 0; stroke-dasharray: none; stroke-linecap: butt; stroke-linejoin: miter; stroke-miterlimit: 4; fill: #195169; fill-rule: ; opacity: 1;">h</tspan><tspan x="-24.08" y="8.98" style="stroke: none; stroke-width: 0; stroke-dasharray: none; stroke-linecap: butt; stroke-linejoin: miter; stroke-miterlimit: 4; fill: #195169; fill-rule: ; opacity: 1;">u</tspan><tspan x="3.55" y="8.98" style="stroke: none; stroke-width: 0; stroke-dasharray: none; stroke-linecap: butt; stroke-linejoin: miter; stroke-miterlimit: 4; fill: #195169; fill-rule: ; opacity: 1;">b</tspan><tspan x="27.07" y="8.98" style="stroke: none; stroke-width: 0; stroke-dasharray: none; stroke-linecap: butt; stroke-linejoin: miter; stroke-miterlimit: 4; fill: #195169; fill-rule: ; opacity: 1;">s</tspan><tspan x="48.18" y="8.98" style="stroke: none; stroke-width: 0; stroke-dasharray: none; stroke-linecap: butt; stroke-linejoin: miter; stroke-miterlimit: 4; fill: #195169; fill-rule: ; opacity: 1;"> </tspan><tspan x="60.18" y="8.98" style="stroke: none; stroke-width: 0; stroke-dasharray: none; stroke-linecap: butt; stroke-linejoin: miter; stroke-miterlimit: 4; fill: #195169; fill-rule: ; opacity: 1;">a</tspan><tspan x="87.97" y="8.98" style="stroke: none; stroke-width: 0; stroke-dasharray: none; stroke-linecap: butt; stroke-linejoin: miter; stroke-miterlimit: 4; fill: #195169; fill-rule: ; opacity: 1;">n</tspan><tspan x="117.48" y="8.98" style="stroke: none; stroke-width: 0; stroke-dasharray: none; stroke-linecap: butt; stroke-linejoin: miter; stroke-miterlimit: 4; fill: #195169; fill-rule: ; opacity: 1;">d</tspan><tspan x="144.47" y="8.98" style="stroke: none; stroke-width: 0; stroke-dasharray: none; stroke-linecap: butt; stroke-linejoin: miter; stroke-miterlimit: 4; fill: #195169; fill-rule: ; opacity: 1;"> </tspan><tspan x="156.46" y="8.98" style="stroke: none; stroke-width: 0; stroke-dasharray: none; stroke-linecap: butt; stroke-linejoin: miter; stroke-miterlimit: 4; fill: #195169; fill-rule: ; opacity: 1;">r</tspan><tspan x="182.09" y="8.98" style="stroke: none; stroke-width: 0; stroke-dasharray: none; stroke-linecap: butt; stroke-linejoin: miter; stroke-miterlimit: 4; fill: #195169; fill-rule: ; opacity: 1;">o</tspan><tspan x="216.04" y="8.98" style="stroke: none; stroke-width: 0; stroke-dasharray: none; stroke-linecap: butt; stroke-linejoin: miter; stroke-miterlimit: 4; fill: #195169; fill-rule: ; opacity: 1;">u</tspan><tspan x="243.67" y="8.98" style="stroke: none; stroke-width: 0; stroke-dasharray: none; stroke-linecap: butt; stroke-linejoin: miter; stroke-miterlimit: 4; fill: #195169; fill-rule: ; opacity: 1;">t</tspan><tspan x="267.03" y="8.98" style="stroke: none; stroke-width: 0; stroke-dasharray: none; stroke-linecap: butt; stroke-linejoin: miter; stroke-miterlimit: 4; fill: #195169; fill-rule: ; opacity: 1;">e</tspan><tspan x="290.29" y="8.98" style="stroke: none; stroke-width: 0; stroke-dasharray: none; stroke-linecap: butt; stroke-linejoin: miter; stroke-miterlimit: 4; fill: #195169; fill-rule: ; opacity: 1;">s</tspan></text>
 </g>
</svg>