<svg width="1116" height="2936" viewBox="0 0 1116 2936" class="keymap" xmlns="http://www.w3.org/2000/svg" xmlns:xlink="http://www.w3.org/1999/xlink">
<style>/* inherit to force styles through use tags */
svg path {
    fill: inherit;
}

/* font and background color specifications */
svg.keymap {
    font-family: SFMono-Regular,Consolas,Liberation Mono,Menlo,monospace;
    font-size: 16px;
    font-kerning: normal;
    text-rendering: optimizeLegibility;
    fill: #24292e;
}

/* default key styling */
rect.key {
    fill: #f6f8fa;
    stroke: #000000;
    stroke-width: 0.2;
}

/* default key side styling, only used is draw_key_sides is set */
rect.side {
    filter: brightness(90%);
}

/* layer hold key */
rect.layer-hold {
  filter: brightness(50%);
}
rect.layer-hold.side {
  filter: brightness(40%);
}

/* color accent for combo boxes */
rect.combo, rect.combo-separate {
    fill: #cdf;
}

/* color accent for held keys */
rect.held, rect.combo.held {
    fill: #fdd;
}

/* color accent for ghost (optional) keys */
rect.ghost, rect.combo.ghost {
    stroke-dasharray: 4, 4;
    stroke-width: 2;
}

text {
    text-anchor: middle;
    dominant-baseline: middle;
}

/* styling for layer labels */
text.label {
    font-weight: bold;
    text-anchor: start;
    stroke: white;
    stroke-width: 2;
    paint-order: stroke;
}

/* styling for combo tap, and key hold/shifted label text */
text.combo, text.hold, text.shifted {
    font-size: 11px;
}

text.hold {
    text-anchor: middle;
    dominant-baseline: auto;
}

text.shifted {
    text-anchor: middle;
    dominant-baseline: hanging;
}

/* styling for hold/shifted label text in combo box */
text.combo.hold, text.combo.shifted {
    font-size: 8px;
}

/* lighter symbol for transparent keys */
text.trans {
    fill: #7b7e81;
}

/* styling for combo dendrons */
path.combo {
    stroke-width: 1;
    stroke: gray;
    fill: none;
}

/* Start Tabler Icons Cleanup */
/* cannot use height/width with glyphs */
.icon-tabler > path {
    fill: inherit;
    stroke: inherit;
    stroke-width: 2;
}
/* hide tabler's default box */
.icon-tabler > path[stroke="none"][fill="none"] {
    visibility: hidden;
}
/* End Tabler Icons Cleanup */

/* Start Layers Colors */
.layer-QWERTY rect.key, 
.layer-CLMK rect.key, 
.layer-CLMK-DH rect.key, 
rect.key.layer-hold {
    fill: #b5b5b5;
}
.layer-NAV rect.key, .layer-NAV rect.key-side,
rect.key.hold-NAV, rect.key-side.hold-NAV, .hold-NAV.hold {
    fill: #ffd966;
}
.layer-MOUSE rect.key, .layer-MOUSE rect.key-side,
rect.key.hold-MOUSE, rect.key-side.hold-MOUSE, .hold-MOUSE.hold {
    fill: #93c47d;
}
.layer-SYM rect.key, .layer-SYM rect.key-side,
rect.key.hold-SYM, rect.key-side.hold-SYM, .hold-SYM.hold {
    fill: #76a5af;
}
.layer-NUM rect.key, .layer-NUM rect.key-side,
rect.key.hold-NUM, rect.key-side.hold-NUM, .hold-NUM.hold {
    fill: #67a0d6;
}
.layer-FUNC rect.key, .layer-FUNC rect.key-side,
rect.key.hold-FUN, rect.key-side.hold-FUN, .hold-FUN.hold {
    fill: #8e7cc3;
}
.layer-ADJ rect.key, .layer-ADJ rect.key-side,
rect.key.hold-ADJ, rect.key-side.hold-ADJ, .hold-ADJ.hold {
    fill: #e06666;
}
/* End Layers Colors */
</style>
<g transform="translate(30, 0)" class="layer-QWERTY">
<text x="0" y="28" class="label">QWERTY:</text>
<g transform="translate(0, 56)">
<g transform="translate(33, 33)" class="key hold-ADJ keypos-0">
<rect rx="6" ry="6" x="-33" y="-33" width="66" height="66" class="key hold-ADJ side"/>
<rect rx="4" ry="4" x="-27" y="-31" width="54" height="54" class="key hold-ADJ"/>
<text x="0" y="-4" class="key hold-ADJ tap">Q</text>
<text x="0" y="18" class="key hold-ADJ hold">ADJ</text>
</g>
<g transform="translate(99, 33)" class="key keypos-1">
<rect rx="6" ry="6" x="-33" y="-33" width="66" height="66" class="key side"/>
<rect rx="4" ry="4" x="-27" y="-31" width="54" height="54" class="key"/>
<text x="0" y="-4" class="key tap">W</text>
</g>
<g transform="translate(165, 33)" class="key keypos-2">
<rect rx="6" ry="6" x="-33" y="-33" width="66" height="66" class="key side"/>
<rect rx="4" ry="4" x="-27" y="-31" width="54" height="54" class="key"/>
<text x="0" y="-4" class="key tap">E</text>
</g>
<g transform="translate(231, 33)" class="key keypos-3">
<rect rx="6" ry="6" x="-33" y="-33" width="66" height="66" class="key side"/>
<rect rx="4" ry="4" x="-27" y="-31" width="54" height="54" class="key"/>
<text x="0" y="-4" class="key tap">R</text>
</g>
<g transform="translate(297, 33)" class="key keypos-4">
<rect rx="6" ry="6" x="-33" y="-33" width="66" height="66" class="key side"/>
<rect rx="4" ry="4" x="-27" y="-31" width="54" height="54" class="key"/>
<text x="0" y="-4" class="key tap">T</text>
</g>
<g transform="translate(759, 33)" class="key keypos-5">
<rect rx="6" ry="6" x="-33" y="-33" width="66" height="66" class="key side"/>
<rect rx="4" ry="4" x="-27" y="-31" width="54" height="54" class="key"/>
<text x="0" y="-4" class="key tap">Y</text>
</g>
<g transform="translate(825, 33)" class="key keypos-6">
<rect rx="6" ry="6" x="-33" y="-33" width="66" height="66" class="key side"/>
<rect rx="4" ry="4" x="-27" y="-31" width="54" height="54" class="key"/>
<text x="0" y="-4" class="key tap">U</text>
</g>
<g transform="translate(891, 33)" class="key keypos-7">
<rect rx="6" ry="6" x="-33" y="-33" width="66" height="66" class="key side"/>
<rect rx="4" ry="4" x="-27" y="-31" width="54" height="54" class="key"/>
<text x="0" y="-4" class="key tap">I</text>
</g>
<g transform="translate(957, 33)" class="key keypos-8">
<rect rx="6" ry="6" x="-33" y="-33" width="66" height="66" class="key side"/>
<rect rx="4" ry="4" x="-27" y="-31" width="54" height="54" class="key"/>
<text x="0" y="-4" class="key tap">O</text>
</g>
<g transform="translate(1023, 33)" class="key hold-ADJ keypos-9">
<rect rx="6" ry="6" x="-33" y="-33" width="66" height="66" class="key hold-ADJ side"/>
<rect rx="4" ry="4" x="-27" y="-31" width="54" height="54" class="key hold-ADJ"/>
<text x="0" y="-4" class="key hold-ADJ tap">P</text>
<text x="0" y="18" class="key hold-ADJ hold">ADJ</text>
</g>
<g transform="translate(33, 99)" class="key keypos-10">
<rect rx="6" ry="6" x="-33" y="-33" width="66" height="66" class="key side"/>
<rect rx="4" ry="4" x="-27" y="-31" width="54" height="54" class="key"/>
<text x="0" y="-4" class="key tap">A</text>
<text x="0" y="18" class="key hold">⌘</text>
</g>
<g transform="translate(99, 99)" class="key keypos-11">
<rect rx="6" ry="6" x="-33" y="-33" width="66" height="66" class="key side"/>
<rect rx="4" ry="4" x="-27" y="-31" width="54" height="54" class="key"/>
<text x="0" y="-4" class="key tap">S</text>
<text x="0" y="18" class="key hold">⌥</text>
</g>
<g transform="translate(165, 99)" class="key keypos-12">
<rect rx="6" ry="6" x="-33" y="-33" width="66" height="66" class="key side"/>
<rect rx="4" ry="4" x="-27" y="-31" width="54" height="54" class="key"/>
<text x="0" y="-4" class="key tap">D</text>
<text x="0" y="18" class="key hold">CTRL</text>
</g>
<g transform="translate(231, 99)" class="key keypos-13">
<rect rx="6" ry="6" x="-33" y="-33" width="66" height="66" class="key side"/>
<rect rx="4" ry="4" x="-27" y="-31" width="54" height="54" class="key"/>
<text x="0" y="-4" class="key tap">F</text>
<text x="0" y="18" class="key hold">⇧</text>
</g>
<g transform="translate(297, 99)" class="key keypos-14">
<rect rx="6" ry="6" x="-33" y="-33" width="66" height="66" class="key side"/>
<rect rx="4" ry="4" x="-27" y="-31" width="54" height="54" class="key"/>
<text x="0" y="-4" class="key tap">G</text>
</g>
<g transform="translate(759, 99)" class="key keypos-15">
<rect rx="6" ry="6" x="-33" y="-33" width="66" height="66" class="key side"/>
<rect rx="4" ry="4" x="-27" y="-31" width="54" height="54" class="key"/>
<text x="0" y="-4" class="key tap">H</text>
</g>
<g transform="translate(825, 99)" class="key keypos-16">
<rect rx="6" ry="6" x="-33" y="-33" width="66" height="66" class="key side"/>
<rect rx="4" ry="4" x="-27" y="-31" width="54" height="54" class="key"/>
<text x="0" y="-4" class="key tap">J</text>
<text x="0" y="18" class="key hold">⇧</text>
</g>
<g transform="translate(891, 99)" class="key keypos-17">
<rect rx="6" ry="6" x="-33" y="-33" width="66" height="66" class="key side"/>
<rect rx="4" ry="4" x="-27" y="-31" width="54" height="54" class="key"/>
<text x="0" y="-4" class="key tap">K</text>
<text x="0" y="18" class="key hold">CTRL</text>
</g>
<g transform="translate(957, 99)" class="key keypos-18">
<rect rx="6" ry="6" x="-33" y="-33" width="66" height="66" class="key side"/>
<rect rx="4" ry="4" x="-27" y="-31" width="54" height="54" class="key"/>
<text x="0" y="-4" class="key tap">L</text>
<text x="0" y="18" class="key hold">⌥</text>
</g>
<g transform="translate(1023, 99)" class="key keypos-19">
<rect rx="6" ry="6" x="-33" y="-33" width="66" height="66" class="key side"/>
<rect rx="4" ry="4" x="-27" y="-31" width="54" height="54" class="key"/>
<text x="0" y="-4" class="key tap">;</text>
<text x="0" y="18" class="key hold">⌘</text>
</g>
<g transform="translate(33, 165)" class="key keypos-20">
<rect rx="6" ry="6" x="-33" y="-33" width="66" height="66" class="key side"/>
<rect rx="4" ry="4" x="-27" y="-31" width="54" height="54" class="key"/>
<text x="0" y="-4" class="key tap">Z</text>
</g>
<g transform="translate(99, 165)" class="key keypos-21">
<rect rx="6" ry="6" x="-33" y="-33" width="66" height="66" class="key side"/>
<rect rx="4" ry="4" x="-27" y="-31" width="54" height="54" class="key"/>
<text x="0" y="-4" class="key tap">X</text>
</g>
<g transform="translate(165, 165)" class="key keypos-22">
<rect rx="6" ry="6" x="-33" y="-33" width="66" height="66" class="key side"/>
<rect rx="4" ry="4" x="-27" y="-31" width="54" height="54" class="key"/>
<text x="0" y="-4" class="key tap">C</text>
</g>
<g transform="translate(231, 165)" class="key keypos-23">
<rect rx="6" ry="6" x="-33" y="-33" width="66" height="66" class="key side"/>
<rect rx="4" ry="4" x="-27" y="-31" width="54" height="54" class="key"/>
<text x="0" y="-4" class="key tap">V</text>
</g>
<g transform="translate(297, 165)" class="key keypos-24">
<rect rx="6" ry="6" x="-33" y="-33" width="66" height="66" class="key side"/>
<rect rx="4" ry="4" x="-27" y="-31" width="54" height="54" class="key"/>
<text x="0" y="-4" class="key tap">B</text>
</g>
<g transform="translate(759, 165)" class="key keypos-25">
<rect rx="6" ry="6" x="-33" y="-33" width="66" height="66" class="key side"/>
<rect rx="4" ry="4" x="-27" y="-31" width="54" height="54" class="key"/>
<text x="0" y="-4" class="key tap">N</text>
</g>
<g transform="translate(825, 165)" class="key keypos-26">
<rect rx="6" ry="6" x="-33" y="-33" width="66" height="66" class="key side"/>
<rect rx="4" ry="4" x="-27" y="-31" width="54" height="54" class="key"/>
<text x="0" y="-4" class="key tap">M</text>
</g>
<g transform="translate(891, 165)" class="key keypos-27">
<rect rx="6" ry="6" x="-33" y="-33" width="66" height="66" class="key side"/>
<rect rx="4" ry="4" x="-27" y="-31" width="54" height="54" class="key"/>
<text x="0" y="-4" class="key tap">,</text>
</g>
<g transform="translate(957, 165)" class="key keypos-28">
<rect rx="6" ry="6" x="-33" y="-33" width="66" height="66" class="key side"/>
<rect rx="4" ry="4" x="-27" y="-31" width="54" height="54" class="key"/>
<text x="0" y="-4" class="key tap">.</text>
</g>
<g transform="translate(1023, 165)" class="key keypos-29">
<rect rx="6" ry="6" x="-33" y="-33" width="66" height="66" class="key side"/>
<rect rx="4" ry="4" x="-27" y="-31" width="54" height="54" class="key"/>
<text x="0" y="-4" class="key tap">/</text>
</g>
<g transform="translate(297, 231)" class="key hold-FUN keypos-30">
<rect rx="6" ry="6" x="-33" y="-33" width="66" height="66" class="key hold-FUN side"/>
<rect rx="4" ry="4" x="-27" y="-31" width="54" height="54" class="key hold-FUN"/>
<text x="0" y="-4" class="key hold-FUN tap">⌦</text>
<text x="0" y="18" class="key hold-FUN hold">FUNC</text>
</g>
<g transform="translate(363, 231)" class="key hold-SYM keypos-31">
<rect rx="6" ry="6" x="-33" y="-33" width="66" height="66" class="key hold-SYM side"/>
<rect rx="4" ry="4" x="-27" y="-31" width="54" height="54" class="key hold-SYM"/>
<text x="0" y="-4" class="key hold-SYM tap">⌫</text>
<text x="0" y="18" class="key hold-SYM hold">SYM</text>
</g>
<g transform="translate(429, 231)" class="key hold-NUM keypos-32">
<rect rx="6" ry="6" x="-33" y="-33" width="66" height="66" class="key hold-NUM side"/>
<rect rx="4" ry="4" x="-27" y="-31" width="54" height="54" class="key hold-NUM"/>
<text x="0" y="-4" class="key hold-NUM tap">ESC</text>
<text x="0" y="18" class="key hold-NUM hold">NUM</text>
</g>
<g transform="translate(627, 231)" class="key hold-NAV keypos-33">
<rect rx="6" ry="6" x="-33" y="-33" width="66" height="66" class="key hold-NAV side"/>
<rect rx="4" ry="4" x="-27" y="-31" width="54" height="54" class="key hold-NAV"/>
<text x="0" y="-4" class="key hold-NAV tap">⭾</text>
<text x="0" y="18" class="key hold-NAV hold">NAV</text>
</g>
<g transform="translate(693, 231)" class="key hold-MOUSE keypos-34">
<rect rx="6" ry="6" x="-33" y="-33" width="66" height="66" class="key hold-MOUSE side"/>
<rect rx="4" ry="4" x="-27" y="-31" width="54" height="54" class="key hold-MOUSE"/>
<text x="0" y="-4" class="key hold-MOUSE tap">⏎</text>
<text x="0" y="18" class="key hold-MOUSE hold">MOUSE</text>
</g>
<g transform="translate(759, 231)" class="key keypos-35">
<rect rx="6" ry="6" x="-33" y="-33" width="66" height="66" class="key side"/>
<rect rx="4" ry="4" x="-27" y="-31" width="54" height="54" class="key"/>
<text x="0" y="-4" class="key tap">␣</text>
</g>
<g class="combo combopos-0">
<path d="M528,50 h-291 a6.0,6.0 0 0 0 -6.0,6.0 v22" class="combo"/>
<path d="M528,50 h291 a6.0,6.0 0 0 1 6.0,6.0 v22" class="combo"/>
<rect rx="6" ry="6" x="503" y="26" width="50" height="46" class="combo"/>
<text x="528" y="50" class="combo tap">
<tspan x="528" dy="-0.425em">Caps</tspan><tspan x="528" dy="0.85em">Wrd</tspan>
</text>
</g>
</g>
</g>
<g transform="translate(30, 320)" class="layer-NAV">
<text x="0" y="28" class="label">NAV:</text>
<g transform="translate(0, 56)">
<g transform="translate(33, 33)" class="key keypos-0">
<rect rx="6" ry="6" x="-33" y="-33" width="66" height="66" class="key side"/>
<rect rx="4" ry="4" x="-27" y="-31" width="54" height="54" class="key"/>
<text x="0" y="-4" class="key tap">↷</text>
</g>
<g transform="translate(99, 33)" class="key keypos-1">
<rect rx="6" ry="6" x="-33" y="-33" width="66" height="66" class="key side"/>
<rect rx="4" ry="4" x="-27" y="-31" width="54" height="54" class="key"/>
<text x="0" y="-4" class="key tap">HOME</text>
</g>
<g transform="translate(165, 33)" class="key keypos-2">
<rect rx="6" ry="6" x="-33" y="-33" width="66" height="66" class="key side"/>
<rect rx="4" ry="4" x="-27" y="-31" width="54" height="54" class="key"/>
<text x="0" y="-4" class="key tap">↑</text>
</g>
<g transform="translate(231, 33)" class="key keypos-3">
<rect rx="6" ry="6" x="-33" y="-33" width="66" height="66" class="key side"/>
<rect rx="4" ry="4" x="-27" y="-31" width="54" height="54" class="key"/>
<text x="0" y="-4" class="key tap">END</text>
</g>
<g transform="translate(297, 33)" class="key keypos-4">
<rect rx="6" ry="6" x="-33" y="-33" width="66" height="66" class="key side"/>
<rect rx="4" ry="4" x="-27" y="-31" width="54" height="54" class="key"/>
<text x="0" y="-4" class="key tap">PAG▲</text>
</g>
<g transform="translate(759, 33)" class="key keypos-5">
<rect rx="6" ry="6" x="-33" y="-33" width="66" height="66" class="key side"/>
<rect rx="4" ry="4" x="-27" y="-31" width="54" height="54" class="key"/>
</g>
<g transform="translate(825, 33)" class="key keypos-6">
<rect rx="6" ry="6" x="-33" y="-33" width="66" height="66" class="key side"/>
<rect rx="4" ry="4" x="-27" y="-31" width="54" height="54" class="key"/>
<text x="0" y="-4" class="key tap">🄰CAPS</text>
</g>
<g transform="translate(891, 33)" class="key keypos-7">
<rect rx="6" ry="6" x="-33" y="-33" width="66" height="66" class="key side"/>
<rect rx="4" ry="4" x="-27" y="-31" width="54" height="54" class="key"/>
<text x="0" y="-4" class="key tap">NUM</text>
</g>
<g transform="translate(957, 33)" class="key keypos-8">
<rect rx="6" ry="6" x="-33" y="-33" width="66" height="66" class="key side"/>
<rect rx="4" ry="4" x="-27" y="-31" width="54" height="54" class="key"/>
<text x="0" y="-4" class="key tap">⎀INS</text>
</g>
<g transform="translate(1023, 33)" class="key keypos-9">
<rect rx="6" ry="6" x="-33" y="-33" width="66" height="66" class="key side"/>
<rect rx="4" ry="4" x="-27" y="-31" width="54" height="54" class="key"/>
</g>
<g transform="translate(33, 99)" class="key keypos-10">
<rect rx="6" ry="6" x="-33" y="-33" width="66" height="66" class="key side"/>
<rect rx="4" ry="4" x="-27" y="-31" width="54" height="54" class="key"/>
<text x="0" y="-4" class="key tap">
<tspan x="0" dy="-0.425em">CTRL</tspan><tspan x="0" dy="0.85em">⌥⭾</tspan>
</text>
</g>
<g transform="translate(99, 99)" class="key keypos-11">
<rect rx="6" ry="6" x="-33" y="-33" width="66" height="66" class="key side"/>
<rect rx="4" ry="4" x="-27" y="-31" width="54" height="54" class="key"/>
<text x="0" y="-4" class="key tap">←</text>
</g>
<g transform="translate(165, 99)" class="key keypos-12">
<rect rx="6" ry="6" x="-33" y="-33" width="66" height="66" class="key side"/>
<rect rx="4" ry="4" x="-27" y="-31" width="54" height="54" class="key"/>
<text x="0" y="-4" class="key tap">↓</text>
</g>
<g transform="translate(231, 99)" class="key keypos-13">
<rect rx="6" ry="6" x="-33" y="-33" width="66" height="66" class="key side"/>
<rect rx="4" ry="4" x="-27" y="-31" width="54" height="54" class="key"/>
<text x="0" y="-4" class="key tap">→</text>
</g>
<g transform="translate(297, 99)" class="key keypos-14">
<rect rx="6" ry="6" x="-33" y="-33" width="66" height="66" class="key side"/>
<rect rx="4" ry="4" x="-27" y="-31" width="54" height="54" class="key"/>
<text x="0" y="-4" class="key tap">PAG▼</text>
</g>
<g transform="translate(759, 99)" class="key keypos-15">
<rect rx="6" ry="6" x="-33" y="-33" width="66" height="66" class="key side"/>
<rect rx="4" ry="4" x="-27" y="-31" width="54" height="54" class="key"/>
<text x="0" y="-4" class="key tap">☰</text>
</g>
<g transform="translate(825, 99)" class="key keypos-16">
<rect rx="6" ry="6" x="-33" y="-33" width="66" height="66" class="key side"/>
<rect rx="4" ry="4" x="-27" y="-31" width="54" height="54" class="key"/>
<text x="0" y="-4" class="key tap">⇧</text>
</g>
<g transform="translate(891, 99)" class="key keypos-17">
<rect rx="6" ry="6" x="-33" y="-33" width="66" height="66" class="key side"/>
<rect rx="4" ry="4" x="-27" y="-31" width="54" height="54" class="key"/>
<text x="0" y="-4" class="key tap">CTRL</text>
</g>
<g transform="translate(957, 99)" class="key keypos-18">
<rect rx="6" ry="6" x="-33" y="-33" width="66" height="66" class="key side"/>
<rect rx="4" ry="4" x="-27" y="-31" width="54" height="54" class="key"/>
<text x="0" y="-4" class="key tap">⌥</text>
</g>
<g transform="translate(1023, 99)" class="key keypos-19">
<rect rx="6" ry="6" x="-33" y="-33" width="66" height="66" class="key side"/>
<rect rx="4" ry="4" x="-27" y="-31" width="54" height="54" class="key"/>
<text x="0" y="-4" class="key tap">⌘</text>
</g>
<g transform="translate(33, 165)" class="key keypos-20">
<rect rx="6" ry="6" x="-33" y="-33" width="66" height="66" class="key side"/>
<rect rx="4" ry="4" x="-27" y="-31" width="54" height="54" class="key"/>
<text x="0" y="-4" class="key tap">↶</text>
</g>
<g transform="translate(99, 165)" class="key keypos-21">
<rect rx="6" ry="6" x="-33" y="-33" width="66" height="66" class="key side"/>
<rect rx="4" ry="4" x="-27" y="-31" width="54" height="54" class="key"/>
<text x="0" y="-4" class="key tap">✂</text>
</g>
<g transform="translate(165, 165)" class="key keypos-22">
<rect rx="6" ry="6" x="-33" y="-33" width="66" height="66" class="key side"/>
<rect rx="4" ry="4" x="-27" y="-31" width="54" height="54" class="key"/>
<text x="0" y="-4" class="key tap">
<tspan x="0" dy="-0.425em">CTRL</tspan><tspan x="0" dy="0.85em">C</tspan>
</text>
</g>
<g transform="translate(231, 165)" class="key keypos-23">
<rect rx="6" ry="6" x="-33" y="-33" width="66" height="66" class="key side"/>
<rect rx="4" ry="4" x="-27" y="-31" width="54" height="54" class="key"/>
<text x="0" y="-4" class="key tap">
<tspan x="0" dy="-0.425em">CTRL</tspan><tspan x="0" dy="0.85em">V</tspan>
</text>
</g>
<g transform="translate(297, 165)" class="key keypos-24">
<rect rx="6" ry="6" x="-33" y="-33" width="66" height="66" class="key side"/>
<rect rx="4" ry="4" x="-27" y="-31" width="54" height="54" class="key"/>
</g>
<g transform="translate(759, 165)" class="key keypos-25">
<rect rx="6" ry="6" x="-33" y="-33" width="66" height="66" class="key side"/>
<rect rx="4" ry="4" x="-27" y="-31" width="54" height="54" class="key"/>
</g>
<g transform="translate(825, 165)" class="key keypos-26">
<rect rx="6" ry="6" x="-33" y="-33" width="66" height="66" class="key side"/>
<rect rx="4" ry="4" x="-27" y="-31" width="54" height="54" class="key"/>
</g>
<g transform="translate(891, 165)" class="key keypos-27">
<rect rx="6" ry="6" x="-33" y="-33" width="66" height="66" class="key side"/>
<rect rx="4" ry="4" x="-27" y="-31" width="54" height="54" class="key"/>
</g>
<g transform="translate(957, 165)" class="key keypos-28">
<rect rx="6" ry="6" x="-33" y="-33" width="66" height="66" class="key side"/>
<rect rx="4" ry="4" x="-27" y="-31" width="54" height="54" class="key"/>
</g>
<g transform="translate(1023, 165)" class="key keypos-29">
<rect rx="6" ry="6" x="-33" y="-33" width="66" height="66" class="key side"/>
<rect rx="4" ry="4" x="-27" y="-31" width="54" height="54" class="key"/>
</g>
<g transform="translate(297, 231)" class="key keypos-30">
<rect rx="6" ry="6" x="-33" y="-33" width="66" height="66" class="key side"/>
<rect rx="4" ry="4" x="-27" y="-31" width="54" height="54" class="key"/>
<text x="0" y="-4" class="key tap">▽</text>
</g>
<g transform="translate(363, 231)" class="key keypos-31">
<rect rx="6" ry="6" x="-33" y="-33" width="66" height="66" class="key side"/>
<rect rx="4" ry="4" x="-27" y="-31" width="54" height="54" class="key"/>
<text x="0" y="-4" class="key tap">▽</text>
</g>
<g transform="translate(429, 231)" class="key keypos-32">
<rect rx="6" ry="6" x="-33" y="-33" width="66" height="66" class="key side"/>
<rect rx="4" ry="4" x="-27" y="-31" width="54" height="54" class="key"/>
<text x="0" y="-4" class="key tap">▽</text>
</g>
<g transform="translate(627, 231)" class="key layer-hold keypos-33">
<rect rx="6" ry="6" x="-33" y="-33" width="66" height="66" class="key layer-hold side"/>
<rect rx="4" ry="4" x="-27" y="-31" width="54" height="54" class="key layer-hold"/>
<text x="0" y="-4" class="key layer-hold tap">◆</text>
</g>
<g transform="translate(693, 231)" class="key keypos-34">
<rect rx="6" ry="6" x="-33" y="-33" width="66" height="66" class="key side"/>
<rect rx="4" ry="4" x="-27" y="-31" width="54" height="54" class="key"/>
<text x="0" y="-4" class="key tap">▽</text>
</g>
<g transform="translate(759, 231)" class="key keypos-35">
<rect rx="6" ry="6" x="-33" y="-33" width="66" height="66" class="key side"/>
<rect rx="4" ry="4" x="-27" y="-31" width="54" height="54" class="key"/>
<text x="0" y="-4" class="key tap">▽</text>
</g>
</g>
</g>
<g transform="translate(30, 640)" class="layer-MOUSE">
<text x="0" y="28" class="label">MOUSE:</text>
<g transform="translate(0, 56)">
<g transform="translate(33, 33)" class="key keypos-0">
<rect rx="6" ry="6" x="-33" y="-33" width="66" height="66" class="key side"/>
<rect rx="4" ry="4" x="-27" y="-31" width="54" height="54" class="key"/>
<text x="0" y="-4" class="key tap">↷</text>
</g>
<g transform="translate(99, 33)" class="key keypos-1">
<rect rx="6" ry="6" x="-33" y="-33" width="66" height="66" class="key side"/>
<rect rx="4" ry="4" x="-27" y="-31" width="54" height="54" class="key"/>
<text x="0" y="-4" class="key tap">
<tspan x="0" dy="-0.425em">RIGHT</tspan><tspan x="0" dy="0.85em">CLICK</tspan>
</text>
</g>
<g transform="translate(165, 33)" class="key keypos-2">
<rect rx="6" ry="6" x="-33" y="-33" width="66" height="66" class="key side"/>
<rect rx="4" ry="4" x="-27" y="-31" width="54" height="54" class="key"/>
<text x="0" y="-4" class="key tap">
<tspan x="0" dy="-0.425em">▲</tspan><tspan x="0" dy="0.85em">MOUSE</tspan>
</text>
</g>
<g transform="translate(231, 33)" class="key keypos-3">
<rect rx="6" ry="6" x="-33" y="-33" width="66" height="66" class="key side"/>
<rect rx="4" ry="4" x="-27" y="-31" width="54" height="54" class="key"/>
<text x="0" y="-4" class="key tap">
<tspan x="0" dy="-0.425em">LEFT</tspan><tspan x="0" dy="0.85em">CLICK</tspan>
</text>
</g>
<g transform="translate(297, 33)" class="key keypos-4">
<rect rx="6" ry="6" x="-33" y="-33" width="66" height="66" class="key side"/>
<rect rx="4" ry="4" x="-27" y="-31" width="54" height="54" class="key"/>
<text x="0" y="-4" class="key tap">
<tspan x="0" dy="-0.425em">△</tspan><tspan x="0" dy="0.85em">SCROLL</tspan>
</text>
</g>
<g transform="translate(759, 33)" class="key keypos-5">
<rect rx="6" ry="6" x="-33" y="-33" width="66" height="66" class="key side"/>
<rect rx="4" ry="4" x="-27" y="-31" width="54" height="54" class="key"/>
<text x="0" y="-4" class="key tap">
<tspan x="0" dy="-0.425em">MIDDLE</tspan><tspan x="0" dy="0.85em">CLICK</tspan>
</text>
</g>
<g transform="translate(825, 33)" class="key keypos-6">
<rect rx="6" ry="6" x="-33" y="-33" width="66" height="66" class="key side"/>
<rect rx="4" ry="4" x="-27" y="-31" width="54" height="54" class="key"/>
<text x="0" y="-4" class="key tap">
<tspan x="0" dy="-0.425em">LEFT</tspan><tspan x="0" dy="0.85em">CLICK</tspan>
</text>
</g>
<g transform="translate(891, 33)" class="key keypos-7">
<rect rx="6" ry="6" x="-33" y="-33" width="66" height="66" class="key side"/>
<rect rx="4" ry="4" x="-27" y="-31" width="54" height="54" class="key"/>
<text x="0" y="-4" class="key tap">
<tspan x="0" dy="-0.425em">△</tspan><tspan x="0" dy="0.85em">SCROLL</tspan>
</text>
</g>
<g transform="translate(957, 33)" class="key keypos-8">
<rect rx="6" ry="6" x="-33" y="-33" width="66" height="66" class="key side"/>
<rect rx="4" ry="4" x="-27" y="-31" width="54" height="54" class="key"/>
<text x="0" y="-4" class="key tap">
<tspan x="0" dy="-0.425em">RIGHT</tspan><tspan x="0" dy="0.85em">CLICK</tspan>
</text>
</g>
<g transform="translate(1023, 33)" class="key keypos-9">
<rect rx="6" ry="6" x="-33" y="-33" width="66" height="66" class="key side"/>
<rect rx="4" ry="4" x="-27" y="-31" width="54" height="54" class="key"/>
<text x="0" y="-4" class="key tap">
<tspan x="0" dy="-0.425em">SCROLL</tspan><tspan x="0" dy="0.85em">LOCK</tspan>
</text>
</g>
<g transform="translate(33, 99)" class="key keypos-10">
<rect rx="6" ry="6" x="-33" y="-33" width="66" height="66" class="key side"/>
<rect rx="4" ry="4" x="-27" y="-31" width="54" height="54" class="key"/>
<text x="0" y="-4" class="key tap">⎙</text>
</g>
<g transform="translate(99, 99)" class="key keypos-11">
<rect rx="6" ry="6" x="-33" y="-33" width="66" height="66" class="key side"/>
<rect rx="4" ry="4" x="-27" y="-31" width="54" height="54" class="key"/>
<text x="0" y="-4" class="key tap">
<tspan x="0" dy="-0.425em">◀</tspan><tspan x="0" dy="0.85em">MOUSE</tspan>
</text>
</g>
<g transform="translate(165, 99)" class="key keypos-12">
<rect rx="6" ry="6" x="-33" y="-33" width="66" height="66" class="key side"/>
<rect rx="4" ry="4" x="-27" y="-31" width="54" height="54" class="key"/>
<text x="0" y="-4" class="key tap">
<tspan x="0" dy="-0.425em">▼</tspan><tspan x="0" dy="0.85em">MOUSE</tspan>
</text>
</g>
<g transform="translate(231, 99)" class="key keypos-13">
<rect rx="6" ry="6" x="-33" y="-33" width="66" height="66" class="key side"/>
<rect rx="4" ry="4" x="-27" y="-31" width="54" height="54" class="key"/>
<text x="0" y="-4" class="key tap">
<tspan x="0" dy="-0.425em">▶</tspan><tspan x="0" dy="0.85em">MOUSE</tspan>
</text>
</g>
<g transform="translate(297, 99)" class="key keypos-14">
<rect rx="6" ry="6" x="-33" y="-33" width="66" height="66" class="key side"/>
<rect rx="4" ry="4" x="-27" y="-31" width="54" height="54" class="key"/>
<text x="0" y="-4" class="key tap">
<tspan x="0" dy="-0.425em">▽</tspan><tspan x="0" dy="0.85em">SCROLL</tspan>
</text>
</g>
<g transform="translate(759, 99)" class="key keypos-15">
<rect rx="6" ry="6" x="-33" y="-33" width="66" height="66" class="key side"/>
<rect rx="4" ry="4" x="-27" y="-31" width="54" height="54" class="key"/>
<text x="0" y="-4" class="key tap">⎗</text>
</g>
<g transform="translate(825, 99)" class="key keypos-16">
<rect rx="6" ry="6" x="-33" y="-33" width="66" height="66" class="key side"/>
<rect rx="4" ry="4" x="-27" y="-31" width="54" height="54" class="key"/>
<text x="0" y="-4" class="key tap">
<tspan x="0" dy="-0.425em">◁</tspan><tspan x="0" dy="0.85em">SCROLL</tspan>
</text>
</g>
<g transform="translate(891, 99)" class="key keypos-17">
<rect rx="6" ry="6" x="-33" y="-33" width="66" height="66" class="key side"/>
<rect rx="4" ry="4" x="-27" y="-31" width="54" height="54" class="key"/>
<text x="0" y="-4" class="key tap">
<tspan x="0" dy="-0.425em">▽</tspan><tspan x="0" dy="0.85em">SCROLL</tspan>
</text>
</g>
<g transform="translate(957, 99)" class="key keypos-18">
<rect rx="6" ry="6" x="-33" y="-33" width="66" height="66" class="key side"/>
<rect rx="4" ry="4" x="-27" y="-31" width="54" height="54" class="key"/>
<text x="0" y="-4" class="key tap">
<tspan x="0" dy="-0.425em">▷</tspan><tspan x="0" dy="0.85em">SCROLL</tspan>
</text>
</g>
<g transform="translate(1023, 99)" class="key keypos-19">
<rect rx="6" ry="6" x="-33" y="-33" width="66" height="66" class="key side"/>
<rect rx="4" ry="4" x="-27" y="-31" width="54" height="54" class="key"/>
</g>
<g transform="translate(33, 165)" class="key keypos-20">
<rect rx="6" ry="6" x="-33" y="-33" width="66" height="66" class="key side"/>
<rect rx="4" ry="4" x="-27" y="-31" width="54" height="54" class="key"/>
<text x="0" y="-4" class="key tap">↶</text>
</g>
<g transform="translate(99, 165)" class="key keypos-21">
<rect rx="6" ry="6" x="-33" y="-33" width="66" height="66" class="key side"/>
<rect rx="4" ry="4" x="-27" y="-31" width="54" height="54" class="key"/>
<text x="0" y="-4" class="key tap">✂</text>
</g>
<g transform="translate(165, 165)" class="key keypos-22">
<rect rx="6" ry="6" x="-33" y="-33" width="66" height="66" class="key side"/>
<rect rx="4" ry="4" x="-27" y="-31" width="54" height="54" class="key"/>
<text x="0" y="-4" class="key tap">
<tspan x="0" dy="-0.425em">CTRL</tspan><tspan x="0" dy="0.85em">C</tspan>
</text>
</g>
<g transform="translate(231, 165)" class="key keypos-23">
<rect rx="6" ry="6" x="-33" y="-33" width="66" height="66" class="key side"/>
<rect rx="4" ry="4" x="-27" y="-31" width="54" height="54" class="key"/>
<text x="0" y="-4" class="key tap">
<tspan x="0" dy="-0.425em">CTRL</tspan><tspan x="0" dy="0.85em">V</tspan>
</text>
</g>
<g transform="translate(297, 165)" class="key keypos-24">
<rect rx="6" ry="6" x="-33" y="-33" width="66" height="66" class="key side"/>
<rect rx="4" ry="4" x="-27" y="-31" width="54" height="54" class="key"/>
</g>
<g transform="translate(759, 165)" class="key keypos-25">
<rect rx="6" ry="6" x="-33" y="-33" width="66" height="66" class="key side"/>
<rect rx="4" ry="4" x="-27" y="-31" width="54" height="54" class="key"/>
<text x="0" y="-4" class="key tap">⎘</text>
</g>
<g transform="translate(825, 165)" class="key keypos-26">
<rect rx="6" ry="6" x="-33" y="-33" width="66" height="66" class="key side"/>
<rect rx="4" ry="4" x="-27" y="-31" width="54" height="54" class="key"/>
<text x="0" y="-4" class="key tap">
<tspan x="0" dy="-0.85em">MOUSE</tspan><tspan x="0" dy="0.85em">ACCEL</tspan>
<tspan x="0" dy="0.85em">1</tspan>
</text>
</g>
<g transform="translate(891, 165)" class="key keypos-27">
<rect rx="6" ry="6" x="-33" y="-33" width="66" height="66" class="key side"/>
<rect rx="4" ry="4" x="-27" y="-31" width="54" height="54" class="key"/>
<text x="0" y="-4" class="key tap">
<tspan x="0" dy="-0.85em">MOUSE</tspan><tspan x="0" dy="0.85em">ACCEL</tspan>
<tspan x="0" dy="0.85em">2</tspan>
</text>
</g>
<g transform="translate(957, 165)" class="key keypos-28">
<rect rx="6" ry="6" x="-33" y="-33" width="66" height="66" class="key side"/>
<rect rx="4" ry="4" x="-27" y="-31" width="54" height="54" class="key"/>
<text x="0" y="-4" class="key tap">
<tspan x="0" dy="-0.85em">MOUSE</tspan><tspan x="0" dy="0.85em">ACCEL</tspan>
<tspan x="0" dy="0.85em">3</tspan>
</text>
</g>
<g transform="translate(1023, 165)" class="key keypos-29">
<rect rx="6" ry="6" x="-33" y="-33" width="66" height="66" class="key side"/>
<rect rx="4" ry="4" x="-27" y="-31" width="54" height="54" class="key"/>
</g>
<g transform="translate(297, 231)" class="key keypos-30">
<rect rx="6" ry="6" x="-33" y="-33" width="66" height="66" class="key side"/>
<rect rx="4" ry="4" x="-27" y="-31" width="54" height="54" class="key"/>
<text x="0" y="-4" class="key tap">
<tspan x="0" dy="-0.425em">LEFT</tspan><tspan x="0" dy="0.85em">CLICK</tspan>
</text>
</g>
<g transform="translate(363, 231)" class="key keypos-31">
<rect rx="6" ry="6" x="-33" y="-33" width="66" height="66" class="key side"/>
<rect rx="4" ry="4" x="-27" y="-31" width="54" height="54" class="key"/>
<text x="0" y="-4" class="key tap">
<tspan x="0" dy="-0.425em">RIGHT</tspan><tspan x="0" dy="0.85em">CLICK</tspan>
</text>
</g>
<g transform="translate(429, 231)" class="key keypos-32">
<rect rx="6" ry="6" x="-33" y="-33" width="66" height="66" class="key side"/>
<rect rx="4" ry="4" x="-27" y="-31" width="54" height="54" class="key"/>
<text x="0" y="-4" class="key tap">▽</text>
</g>
<g transform="translate(627, 231)" class="key keypos-33">
<rect rx="6" ry="6" x="-33" y="-33" width="66" height="66" class="key side"/>
<rect rx="4" ry="4" x="-27" y="-31" width="54" height="54" class="key"/>
<text x="0" y="-4" class="key tap">▽</text>
</g>
<g transform="translate(693, 231)" class="key layer-hold keypos-34">
<rect rx="6" ry="6" x="-33" y="-33" width="66" height="66" class="key layer-hold side"/>
<rect rx="4" ry="4" x="-27" y="-31" width="54" height="54" class="key layer-hold"/>
<text x="0" y="-4" class="key layer-hold tap">◆</text>
</g>
<g transform="translate(759, 231)" class="key keypos-35">
<rect rx="6" ry="6" x="-33" y="-33" width="66" height="66" class="key side"/>
<rect rx="4" ry="4" x="-27" y="-31" width="54" height="54" class="key"/>
<text x="0" y="-4" class="key tap">▽</text>
</g>
</g>
</g>
<g transform="translate(30, 960)" class="layer-SYM">
<text x="0" y="28" class="label">SYM:</text>
<g transform="translate(0, 56)">
<g transform="translate(33, 33)" class="key keypos-0">
<rect rx="6" ry="6" x="-33" y="-33" width="66" height="66" class="key side"/>
<rect rx="4" ry="4" x="-27" y="-31" width="54" height="54" class="key"/>
</g>
<g transform="translate(99, 33)" class="key keypos-1">
<rect rx="6" ry="6" x="-33" y="-33" width="66" height="66" class="key side"/>
<rect rx="4" ry="4" x="-27" y="-31" width="54" height="54" class="key"/>
<text x="0" y="-4" class="key tap">`</text>
</g>
<g transform="translate(165, 33)" class="key keypos-2">
<rect rx="6" ry="6" x="-33" y="-33" width="66" height="66" class="key side"/>
<rect rx="4" ry="4" x="-27" y="-31" width="54" height="54" class="key"/>
<text x="0" y="-4" class="key tap">&#x27;</text>
</g>
<g transform="translate(231, 33)" class="key keypos-3">
<rect rx="6" ry="6" x="-33" y="-33" width="66" height="66" class="key side"/>
<rect rx="4" ry="4" x="-27" y="-31" width="54" height="54" class="key"/>
<text x="0" y="-4" class="key tap">&quot;</text>
</g>
<g transform="translate(297, 33)" class="key keypos-4">
<rect rx="6" ry="6" x="-33" y="-33" width="66" height="66" class="key side"/>
<rect rx="4" ry="4" x="-27" y="-31" width="54" height="54" class="key"/>
</g>
<g transform="translate(759, 33)" class="key keypos-5">
<rect rx="6" ry="6" x="-33" y="-33" width="66" height="66" class="key side"/>
<rect rx="4" ry="4" x="-27" y="-31" width="54" height="54" class="key"/>
</g>
<g transform="translate(825, 33)" class="key keypos-6">
<rect rx="6" ry="6" x="-33" y="-33" width="66" height="66" class="key side"/>
<rect rx="4" ry="4" x="-27" y="-31" width="54" height="54" class="key"/>
<text x="0" y="-4" class="key tap">{</text>
</g>
<g transform="translate(891, 33)" class="key keypos-7">
<rect rx="6" ry="6" x="-33" y="-33" width="66" height="66" class="key side"/>
<rect rx="4" ry="4" x="-27" y="-31" width="54" height="54" class="key"/>
<text x="0" y="-4" class="key tap">}</text>
</g>
<g transform="translate(957, 33)" class="key keypos-8">
<rect rx="6" ry="6" x="-33" y="-33" width="66" height="66" class="key side"/>
<rect rx="4" ry="4" x="-27" y="-31" width="54" height="54" class="key"/>
<text x="0" y="-4" class="key tap">@</text>
</g>
<g transform="translate(1023, 33)" class="key keypos-9">
<rect rx="6" ry="6" x="-33" y="-33" width="66" height="66" class="key side"/>
<rect rx="4" ry="4" x="-27" y="-31" width="54" height="54" class="key"/>
</g>
<g transform="translate(33, 99)" class="key keypos-10">
<rect rx="6" ry="6" x="-33" y="-33" width="66" height="66" class="key side"/>
<rect rx="4" ry="4" x="-27" y="-31" width="54" height="54" class="key"/>
<text x="0" y="-4" class="key tap">
<tspan x="0" dy="-0.425em">~</tspan><tspan x="0" dy="0.85em">INTL.</tspan>
</text>
</g>
<g transform="translate(99, 99)" class="key keypos-11">
<rect rx="6" ry="6" x="-33" y="-33" width="66" height="66" class="key side"/>
<rect rx="4" ry="4" x="-27" y="-31" width="54" height="54" class="key"/>
<text x="0" y="-4" class="key tap">&amp;</text>
</g>
<g transform="translate(165, 99)" class="key keypos-12">
<rect rx="6" ry="6" x="-33" y="-33" width="66" height="66" class="key side"/>
<rect rx="4" ry="4" x="-27" y="-31" width="54" height="54" class="key"/>
<text x="0" y="-4" class="key tap">!</text>
</g>
<g transform="translate(231, 99)" class="key keypos-13">
<rect rx="6" ry="6" x="-33" y="-33" width="66" height="66" class="key side"/>
<rect rx="4" ry="4" x="-27" y="-31" width="54" height="54" class="key"/>
<text x="0" y="-4" class="key tap">|</text>
</g>
<g transform="translate(297, 99)" class="key keypos-14">
<rect rx="6" ry="6" x="-33" y="-33" width="66" height="66" class="key side"/>
<rect rx="4" ry="4" x="-27" y="-31" width="54" height="54" class="key"/>
<text x="0" y="-4" class="key tap">%</text>
</g>
<g transform="translate(759, 99)" class="key keypos-15">
<rect rx="6" ry="6" x="-33" y="-33" width="66" height="66" class="key side"/>
<rect rx="4" ry="4" x="-27" y="-31" width="54" height="54" class="key"/>
<text x="0" y="-4" class="key tap">$</text>
</g>
<g transform="translate(825, 99)" class="key keypos-16">
<rect rx="6" ry="6" x="-33" y="-33" width="66" height="66" class="key side"/>
<rect rx="4" ry="4" x="-27" y="-31" width="54" height="54" class="key"/>
<text x="0" y="-4" class="key tap">(</text>
</g>
<g transform="translate(891, 99)" class="key keypos-17">
<rect rx="6" ry="6" x="-33" y="-33" width="66" height="66" class="key side"/>
<rect rx="4" ry="4" x="-27" y="-31" width="54" height="54" class="key"/>
<text x="0" y="-4" class="key tap">)</text>
</g>
<g transform="translate(957, 99)" class="key keypos-18">
<rect rx="6" ry="6" x="-33" y="-33" width="66" height="66" class="key side"/>
<rect rx="4" ry="4" x="-27" y="-31" width="54" height="54" class="key"/>
<text x="0" y="-4" class="key tap">_</text>
</g>
<g transform="translate(1023, 99)" class="key keypos-19">
<rect rx="6" ry="6" x="-33" y="-33" width="66" height="66" class="key side"/>
<rect rx="4" ry="4" x="-27" y="-31" width="54" height="54" class="key"/>
<text x="0" y="-4" class="key tap">#</text>
</g>
<g transform="translate(33, 165)" class="key keypos-20">
<rect rx="6" ry="6" x="-33" y="-33" width="66" height="66" class="key side"/>
<rect rx="4" ry="4" x="-27" y="-31" width="54" height="54" class="key"/>
<text x="0" y="-4" class="key tap">
<tspan x="0" dy="-0.425em">^</tspan><tspan x="0" dy="0.85em">INTL.</tspan>
</text>
</g>
<g transform="translate(99, 165)" class="key keypos-21">
<rect rx="6" ry="6" x="-33" y="-33" width="66" height="66" class="key side"/>
<rect rx="4" ry="4" x="-27" y="-31" width="54" height="54" class="key"/>
<text x="0" y="-4" class="key tap">&lt;</text>
</g>
<g transform="translate(165, 165)" class="key keypos-22">
<rect rx="6" ry="6" x="-33" y="-33" width="66" height="66" class="key side"/>
<rect rx="4" ry="4" x="-27" y="-31" width="54" height="54" class="key"/>
<text x="0" y="-4" class="key tap">&gt;</text>
</g>
<g transform="translate(231, 165)" class="key keypos-23">
<rect rx="6" ry="6" x="-33" y="-33" width="66" height="66" class="key side"/>
<rect rx="4" ry="4" x="-27" y="-31" width="54" height="54" class="key"/>
<text x="0" y="-4" class="key tap">=</text>
</g>
<g transform="translate(297, 165)" class="key keypos-24">
<rect rx="6" ry="6" x="-33" y="-33" width="66" height="66" class="key side"/>
<rect rx="4" ry="4" x="-27" y="-31" width="54" height="54" class="key"/>
</g>
<g transform="translate(759, 165)" class="key keypos-25">
<rect rx="6" ry="6" x="-33" y="-33" width="66" height="66" class="key side"/>
<rect rx="4" ry="4" x="-27" y="-31" width="54" height="54" class="key"/>
</g>
<g transform="translate(825, 165)" class="key keypos-26">
<rect rx="6" ry="6" x="-33" y="-33" width="66" height="66" class="key side"/>
<rect rx="4" ry="4" x="-27" y="-31" width="54" height="54" class="key"/>
<text x="0" y="-4" class="key tap">[</text>
</g>
<g transform="translate(891, 165)" class="key keypos-27">
<rect rx="6" ry="6" x="-33" y="-33" width="66" height="66" class="key side"/>
<rect rx="4" ry="4" x="-27" y="-31" width="54" height="54" class="key"/>
<text x="0" y="-4" class="key tap">]</text>
</g>
<g transform="translate(957, 165)" class="key keypos-28">
<rect rx="6" ry="6" x="-33" y="-33" width="66" height="66" class="key side"/>
<rect rx="4" ry="4" x="-27" y="-31" width="54" height="54" class="key"/>
</g>
<g transform="translate(1023, 165)" class="key keypos-29">
<rect rx="6" ry="6" x="-33" y="-33" width="66" height="66" class="key side"/>
<rect rx="4" ry="4" x="-27" y="-31" width="54" height="54" class="key"/>
</g>
<g transform="translate(297, 231)" class="key keypos-30">
<rect rx="6" ry="6" x="-33" y="-33" width="66" height="66" class="key side"/>
<rect rx="4" ry="4" x="-27" y="-31" width="54" height="54" class="key"/>
<text x="0" y="-4" class="key tap">▽</text>
</g>
<g transform="translate(363, 231)" class="key layer-hold keypos-31">
<rect rx="6" ry="6" x="-33" y="-33" width="66" height="66" class="key layer-hold side"/>
<rect rx="4" ry="4" x="-27" y="-31" width="54" height="54" class="key layer-hold"/>
<text x="0" y="-4" class="key layer-hold tap">◆</text>
</g>
<g transform="translate(429, 231)" class="key keypos-32">
<rect rx="6" ry="6" x="-33" y="-33" width="66" height="66" class="key side"/>
<rect rx="4" ry="4" x="-27" y="-31" width="54" height="54" class="key"/>
<text x="0" y="-4" class="key tap">▽</text>
</g>
<g transform="translate(627, 231)" class="key keypos-33">
<rect rx="6" ry="6" x="-33" y="-33" width="66" height="66" class="key side"/>
<rect rx="4" ry="4" x="-27" y="-31" width="54" height="54" class="key"/>
<text x="0" y="-4" class="key tap">▽</text>
</g>
<g transform="translate(693, 231)" class="key keypos-34">
<rect rx="6" ry="6" x="-33" y="-33" width="66" height="66" class="key side"/>
<rect rx="4" ry="4" x="-27" y="-31" width="54" height="54" class="key"/>
<text x="0" y="-4" class="key tap">▽</text>
</g>
<g transform="translate(759, 231)" class="key keypos-35">
<rect rx="6" ry="6" x="-33" y="-33" width="66" height="66" class="key side"/>
<rect rx="4" ry="4" x="-27" y="-31" width="54" height="54" class="key"/>
<text x="0" y="-4" class="key tap">▽</text>
</g>
</g>
</g>
<g transform="translate(30, 1280)" class="layer-NUM">
<text x="0" y="28" class="label">NUM:</text>
<g transform="translate(0, 56)">
<g transform="translate(33, 33)" class="key keypos-0">
<rect rx="6" ry="6" x="-33" y="-33" width="66" height="66" class="key side"/>
<rect rx="4" ry="4" x="-27" y="-31" width="54" height="54" class="key"/>
</g>
<g transform="translate(99, 33)" class="key keypos-1">
<rect rx="6" ry="6" x="-33" y="-33" width="66" height="66" class="key side"/>
<rect rx="4" ry="4" x="-27" y="-31" width="54" height="54" class="key"/>
<text x="0" y="-4" class="key tap">
<tspan x="0" dy="-0.425em">`</tspan><tspan x="0" dy="0.85em">INTL.</tspan>
</text>
</g>
<g transform="translate(165, 33)" class="key keypos-2">
<rect rx="6" ry="6" x="-33" y="-33" width="66" height="66" class="key side"/>
<rect rx="4" ry="4" x="-27" y="-31" width="54" height="54" class="key"/>
<text x="0" y="-4" class="key tap">
<tspan x="0" dy="-0.425em">&#x27;</tspan><tspan x="0" dy="0.85em">INTL.</tspan>
</text>
</g>
<g transform="translate(231, 33)" class="key keypos-3">
<rect rx="6" ry="6" x="-33" y="-33" width="66" height="66" class="key side"/>
<rect rx="4" ry="4" x="-27" y="-31" width="54" height="54" class="key"/>
<text x="0" y="-4" class="key tap">
<tspan x="0" dy="-0.425em">&quot;</tspan><tspan x="0" dy="0.85em">INTL.</tspan>
</text>
</g>
<g transform="translate(297, 33)" class="key keypos-4">
<rect rx="6" ry="6" x="-33" y="-33" width="66" height="66" class="key side"/>
<rect rx="4" ry="4" x="-27" y="-31" width="54" height="54" class="key"/>
</g>
<g transform="translate(759, 33)" class="key keypos-5">
<rect rx="6" ry="6" x="-33" y="-33" width="66" height="66" class="key side"/>
<rect rx="4" ry="4" x="-27" y="-31" width="54" height="54" class="key"/>
</g>
<g transform="translate(825, 33)" class="key keypos-6">
<rect rx="6" ry="6" x="-33" y="-33" width="66" height="66" class="key side"/>
<rect rx="4" ry="4" x="-27" y="-31" width="54" height="54" class="key"/>
<text x="0" y="-4" class="key tap">7</text>
</g>
<g transform="translate(891, 33)" class="key keypos-7">
<rect rx="6" ry="6" x="-33" y="-33" width="66" height="66" class="key side"/>
<rect rx="4" ry="4" x="-27" y="-31" width="54" height="54" class="key"/>
<text x="0" y="-4" class="key tap">8</text>
</g>
<g transform="translate(957, 33)" class="key keypos-8">
<rect rx="6" ry="6" x="-33" y="-33" width="66" height="66" class="key side"/>
<rect rx="4" ry="4" x="-27" y="-31" width="54" height="54" class="key"/>
<text x="0" y="-4" class="key tap">9</text>
</g>
<g transform="translate(1023, 33)" class="key keypos-9">
<rect rx="6" ry="6" x="-33" y="-33" width="66" height="66" class="key side"/>
<rect rx="4" ry="4" x="-27" y="-31" width="54" height="54" class="key"/>
<text x="0" y="-4" class="key tap">,</text>
</g>
<g transform="translate(33, 99)" class="key keypos-10">
<rect rx="6" ry="6" x="-33" y="-33" width="66" height="66" class="key side"/>
<rect rx="4" ry="4" x="-27" y="-31" width="54" height="54" class="key"/>
<text x="0" y="-4" class="key tap">PSLS</text>
</g>
<g transform="translate(99, 99)" class="key keypos-11">
<rect rx="6" ry="6" x="-33" y="-33" width="66" height="66" class="key side"/>
<rect rx="4" ry="4" x="-27" y="-31" width="54" height="54" class="key"/>
<text x="0" y="-4" class="key tap">PAST</text>
</g>
<g transform="translate(165, 99)" class="key keypos-12">
<rect rx="6" ry="6" x="-33" y="-33" width="66" height="66" class="key side"/>
<rect rx="4" ry="4" x="-27" y="-31" width="54" height="54" class="key"/>
<text x="0" y="-4" class="key tap">PMNS</text>
</g>
<g transform="translate(231, 99)" class="key keypos-13">
<rect rx="6" ry="6" x="-33" y="-33" width="66" height="66" class="key side"/>
<rect rx="4" ry="4" x="-27" y="-31" width="54" height="54" class="key"/>
<text x="0" y="-4" class="key tap">+</text>
</g>
<g transform="translate(297, 99)" class="key keypos-14">
<rect rx="6" ry="6" x="-33" y="-33" width="66" height="66" class="key side"/>
<rect rx="4" ry="4" x="-27" y="-31" width="54" height="54" class="key"/>
<text x="0" y="-4" class="key tap">%</text>
</g>
<g transform="translate(759, 99)" class="key keypos-15">
<rect rx="6" ry="6" x="-33" y="-33" width="66" height="66" class="key side"/>
<rect rx="4" ry="4" x="-27" y="-31" width="54" height="54" class="key"/>
<text x="0" y="-4" class="key tap">0</text>
</g>
<g transform="translate(825, 99)" class="key keypos-16">
<rect rx="6" ry="6" x="-33" y="-33" width="66" height="66" class="key side"/>
<rect rx="4" ry="4" x="-27" y="-31" width="54" height="54" class="key"/>
<text x="0" y="-4" class="key tap">4</text>
</g>
<g transform="translate(891, 99)" class="key keypos-17">
<rect rx="6" ry="6" x="-33" y="-33" width="66" height="66" class="key side"/>
<rect rx="4" ry="4" x="-27" y="-31" width="54" height="54" class="key"/>
<text x="0" y="-4" class="key tap">5</text>
</g>
<g transform="translate(957, 99)" class="key keypos-18">
<rect rx="6" ry="6" x="-33" y="-33" width="66" height="66" class="key side"/>
<rect rx="4" ry="4" x="-27" y="-31" width="54" height="54" class="key"/>
<text x="0" y="-4" class="key tap">6</text>
</g>
<g transform="translate(1023, 99)" class="key keypos-19">
<rect rx="6" ry="6" x="-33" y="-33" width="66" height="66" class="key side"/>
<rect rx="4" ry="4" x="-27" y="-31" width="54" height="54" class="key"/>
<text x="0" y="-4" class="key tap">=</text>
</g>
<g transform="translate(33, 165)" class="key keypos-20">
<rect rx="6" ry="6" x="-33" y="-33" width="66" height="66" class="key side"/>
<rect rx="4" ry="4" x="-27" y="-31" width="54" height="54" class="key"/>
<text x="0" y="-4" class="key tap">\</text>
</g>
<g transform="translate(99, 165)" class="key keypos-21">
<rect rx="6" ry="6" x="-33" y="-33" width="66" height="66" class="key side"/>
<rect rx="4" ry="4" x="-27" y="-31" width="54" height="54" class="key"/>
<text x="0" y="-4" class="key tap">&lt;</text>
</g>
<g transform="translate(165, 165)" class="key keypos-22">
<rect rx="6" ry="6" x="-33" y="-33" width="66" height="66" class="key side"/>
<rect rx="4" ry="4" x="-27" y="-31" width="54" height="54" class="key"/>
<text x="0" y="-4" class="key tap">&gt;</text>
</g>
<g transform="translate(231, 165)" class="key keypos-23">
<rect rx="6" ry="6" x="-33" y="-33" width="66" height="66" class="key side"/>
<rect rx="4" ry="4" x="-27" y="-31" width="54" height="54" class="key"/>
<text x="0" y="-4" class="key tap">=</text>
</g>
<g transform="translate(297, 165)" class="key keypos-24">
<rect rx="6" ry="6" x="-33" y="-33" width="66" height="66" class="key side"/>
<rect rx="4" ry="4" x="-27" y="-31" width="54" height="54" class="key"/>
</g>
<g transform="translate(759, 165)" class="key keypos-25">
<rect rx="6" ry="6" x="-33" y="-33" width="66" height="66" class="key side"/>
<rect rx="4" ry="4" x="-27" y="-31" width="54" height="54" class="key"/>
<text x="0" y="-4" class="key tap">0</text>
</g>
<g transform="translate(825, 165)" class="key keypos-26">
<rect rx="6" ry="6" x="-33" y="-33" width="66" height="66" class="key side"/>
<rect rx="4" ry="4" x="-27" y="-31" width="54" height="54" class="key"/>
<text x="0" y="-4" class="key tap">1</text>
</g>
<g transform="translate(891, 165)" class="key keypos-27">
<rect rx="6" ry="6" x="-33" y="-33" width="66" height="66" class="key side"/>
<rect rx="4" ry="4" x="-27" y="-31" width="54" height="54" class="key"/>
<text x="0" y="-4" class="key tap">2</text>
</g>
<g transform="translate(957, 165)" class="key keypos-28">
<rect rx="6" ry="6" x="-33" y="-33" width="66" height="66" class="key side"/>
<rect rx="4" ry="4" x="-27" y="-31" width="54" height="54" class="key"/>
<text x="0" y="-4" class="key tap">3</text>
</g>
<g transform="translate(1023, 165)" class="key keypos-29">
<rect rx="6" ry="6" x="-33" y="-33" width="66" height="66" class="key side"/>
<rect rx="4" ry="4" x="-27" y="-31" width="54" height="54" class="key"/>
<text x="0" y="-4" class="key tap">.</text>
</g>
<g transform="translate(297, 231)" class="key keypos-30">
<rect rx="6" ry="6" x="-33" y="-33" width="66" height="66" class="key side"/>
<rect rx="4" ry="4" x="-27" y="-31" width="54" height="54" class="key"/>
<text x="0" y="-4" class="key tap">▽</text>
</g>
<g transform="translate(363, 231)" class="key keypos-31">
<rect rx="6" ry="6" x="-33" y="-33" width="66" height="66" class="key side"/>
<rect rx="4" ry="4" x="-27" y="-31" width="54" height="54" class="key"/>
<text x="0" y="-4" class="key tap">▽</text>
</g>
<g transform="translate(429, 231)" class="key layer-hold keypos-32">
<rect rx="6" ry="6" x="-33" y="-33" width="66" height="66" class="key layer-hold side"/>
<rect rx="4" ry="4" x="-27" y="-31" width="54" height="54" class="key layer-hold"/>
<text x="0" y="-4" class="key layer-hold tap">◆</text>
</g>
<g transform="translate(627, 231)" class="key keypos-33">
<rect rx="6" ry="6" x="-33" y="-33" width="66" height="66" class="key side"/>
<rect rx="4" ry="4" x="-27" y="-31" width="54" height="54" class="key"/>
<text x="0" y="-4" class="key tap">▽</text>
</g>
<g transform="translate(693, 231)" class="key keypos-34">
<rect rx="6" ry="6" x="-33" y="-33" width="66" height="66" class="key side"/>
<rect rx="4" ry="4" x="-27" y="-31" width="54" height="54" class="key"/>
<text x="0" y="-4" class="key tap">▽</text>
</g>
<g transform="translate(759, 231)" class="key keypos-35">
<rect rx="6" ry="6" x="-33" y="-33" width="66" height="66" class="key side"/>
<rect rx="4" ry="4" x="-27" y="-31" width="54" height="54" class="key"/>
<text x="0" y="-4" class="key tap">▽</text>
</g>
</g>
</g>
<g transform="translate(30, 1600)" class="layer-FUNC">
<text x="0" y="28" class="label">FUNC:</text>
<g transform="translate(0, 56)">
<g transform="translate(33, 33)" class="key keypos-0">
<rect rx="6" ry="6" x="-33" y="-33" width="66" height="66" class="key side"/>
<rect rx="4" ry="4" x="-27" y="-31" width="54" height="54" class="key"/>
</g>
<g transform="translate(99, 33)" class="key keypos-1">
<rect rx="6" ry="6" x="-33" y="-33" width="66" height="66" class="key side"/>
<rect rx="4" ry="4" x="-27" y="-31" width="54" height="54" class="key"/>
<text x="0" y="-4" class="key tap">REWIND</text>
</g>
<g transform="translate(165, 33)" class="key keypos-2">
<rect rx="6" ry="6" x="-33" y="-33" width="66" height="66" class="key side"/>
<rect rx="4" ry="4" x="-27" y="-31" width="54" height="54" class="key"/>
<text x="0" y="-4" class="key tap">PAUSE</text>
</g>
<g transform="translate(231, 33)" class="key keypos-3">
<rect rx="6" ry="6" x="-33" y="-33" width="66" height="66" class="key side"/>
<rect rx="4" ry="4" x="-27" y="-31" width="54" height="54" class="key"/>
<text x="0" y="-4" class="key tap">
<tspan x="0" dy="-0.425em">FAST</tspan><tspan x="0" dy="0.85em">FORW</tspan>
</text>
</g>
<g transform="translate(297, 33)" class="key keypos-4">
<rect rx="6" ry="6" x="-33" y="-33" width="66" height="66" class="key side"/>
<rect rx="4" ry="4" x="-27" y="-31" width="54" height="54" class="key"/>
<text x="0" y="-4" class="key tap">🕪</text>
</g>
<g transform="translate(759, 33)" class="key keypos-5">
<rect rx="6" ry="6" x="-33" y="-33" width="66" height="66" class="key side"/>
<rect rx="4" ry="4" x="-27" y="-31" width="54" height="54" class="key"/>
</g>
<g transform="translate(825, 33)" class="key keypos-6">
<rect rx="6" ry="6" x="-33" y="-33" width="66" height="66" class="key side"/>
<rect rx="4" ry="4" x="-27" y="-31" width="54" height="54" class="key"/>
<text x="0" y="-4" class="key tap">F7</text>
</g>
<g transform="translate(891, 33)" class="key keypos-7">
<rect rx="6" ry="6" x="-33" y="-33" width="66" height="66" class="key side"/>
<rect rx="4" ry="4" x="-27" y="-31" width="54" height="54" class="key"/>
<text x="0" y="-4" class="key tap">F8</text>
</g>
<g transform="translate(957, 33)" class="key keypos-8">
<rect rx="6" ry="6" x="-33" y="-33" width="66" height="66" class="key side"/>
<rect rx="4" ry="4" x="-27" y="-31" width="54" height="54" class="key"/>
<text x="0" y="-4" class="key tap">F9</text>
</g>
<g transform="translate(1023, 33)" class="key keypos-9">
<rect rx="6" ry="6" x="-33" y="-33" width="66" height="66" class="key side"/>
<rect rx="4" ry="4" x="-27" y="-31" width="54" height="54" class="key"/>
<text x="0" y="-4" class="key tap">F10</text>
</g>
<g transform="translate(33, 99)" class="key keypos-10">
<rect rx="6" ry="6" x="-33" y="-33" width="66" height="66" class="key side"/>
<rect rx="4" ry="4" x="-27" y="-31" width="54" height="54" class="key"/>
<text x="0" y="-4" class="key tap">⌘</text>
</g>
<g transform="translate(99, 99)" class="key keypos-11">
<rect rx="6" ry="6" x="-33" y="-33" width="66" height="66" class="key side"/>
<rect rx="4" ry="4" x="-27" y="-31" width="54" height="54" class="key"/>
<text x="0" y="-4" class="key tap">⌥</text>
</g>
<g transform="translate(165, 99)" class="key keypos-12">
<rect rx="6" ry="6" x="-33" y="-33" width="66" height="66" class="key side"/>
<rect rx="4" ry="4" x="-27" y="-31" width="54" height="54" class="key"/>
<text x="0" y="-4" class="key tap">CTRL</text>
</g>
<g transform="translate(231, 99)" class="key keypos-13">
<rect rx="6" ry="6" x="-33" y="-33" width="66" height="66" class="key side"/>
<rect rx="4" ry="4" x="-27" y="-31" width="54" height="54" class="key"/>
<text x="0" y="-4" class="key tap">⇧</text>
</g>
<g transform="translate(297, 99)" class="key keypos-14">
<rect rx="6" ry="6" x="-33" y="-33" width="66" height="66" class="key side"/>
<rect rx="4" ry="4" x="-27" y="-31" width="54" height="54" class="key"/>
<text x="0" y="-4" class="key tap">🕩</text>
</g>
<g transform="translate(759, 99)" class="key keypos-15">
<rect rx="6" ry="6" x="-33" y="-33" width="66" height="66" class="key side"/>
<rect rx="4" ry="4" x="-27" y="-31" width="54" height="54" class="key"/>
</g>
<g transform="translate(825, 99)" class="key keypos-16">
<rect rx="6" ry="6" x="-33" y="-33" width="66" height="66" class="key side"/>
<rect rx="4" ry="4" x="-27" y="-31" width="54" height="54" class="key"/>
<text x="0" y="-4" class="key tap">F4</text>
</g>
<g transform="translate(891, 99)" class="key keypos-17">
<rect rx="6" ry="6" x="-33" y="-33" width="66" height="66" class="key side"/>
<rect rx="4" ry="4" x="-27" y="-31" width="54" height="54" class="key"/>
<text x="0" y="-4" class="key tap">F5</text>
</g>
<g transform="translate(957, 99)" class="key keypos-18">
<rect rx="6" ry="6" x="-33" y="-33" width="66" height="66" class="key side"/>
<rect rx="4" ry="4" x="-27" y="-31" width="54" height="54" class="key"/>
<text x="0" y="-4" class="key tap">F6</text>
</g>
<g transform="translate(1023, 99)" class="key keypos-19">
<rect rx="6" ry="6" x="-33" y="-33" width="66" height="66" class="key side"/>
<rect rx="4" ry="4" x="-27" y="-31" width="54" height="54" class="key"/>
<text x="0" y="-4" class="key tap">F11</text>
</g>
<g transform="translate(33, 165)" class="key keypos-20">
<rect rx="6" ry="6" x="-33" y="-33" width="66" height="66" class="key side"/>
<rect rx="4" ry="4" x="-27" y="-31" width="54" height="54" class="key"/>
</g>
<g transform="translate(99, 165)" class="key keypos-21">
<rect rx="6" ry="6" x="-33" y="-33" width="66" height="66" class="key side"/>
<rect rx="4" ry="4" x="-27" y="-31" width="54" height="54" class="key"/>
<text x="0" y="-4" class="key tap">⏭</text>
</g>
<g transform="translate(165, 165)" class="key keypos-22">
<rect rx="6" ry="6" x="-33" y="-33" width="66" height="66" class="key side"/>
<rect rx="4" ry="4" x="-27" y="-31" width="54" height="54" class="key"/>
<text x="0" y="-4" class="key tap">⏯</text>
</g>
<g transform="translate(231, 165)" class="key keypos-23">
<rect rx="6" ry="6" x="-33" y="-33" width="66" height="66" class="key side"/>
<rect rx="4" ry="4" x="-27" y="-31" width="54" height="54" class="key"/>
<text x="0" y="-4" class="key tap">⏮</text>
</g>
<g transform="translate(297, 165)" class="key keypos-24">
<rect rx="6" ry="6" x="-33" y="-33" width="66" height="66" class="key side"/>
<rect rx="4" ry="4" x="-27" y="-31" width="54" height="54" class="key"/>
<text x="0" y="-4" class="key tap">🕨</text>
</g>
<g transform="translate(759, 165)" class="key keypos-25">
<rect rx="6" ry="6" x="-33" y="-33" width="66" height="66" class="key side"/>
<rect rx="4" ry="4" x="-27" y="-31" width="54" height="54" class="key"/>
</g>
<g transform="translate(825, 165)" class="key keypos-26">
<rect rx="6" ry="6" x="-33" y="-33" width="66" height="66" class="key side"/>
<rect rx="4" ry="4" x="-27" y="-31" width="54" height="54" class="key"/>
<text x="0" y="-4" class="key tap">F1</text>
</g>
<g transform="translate(891, 165)" class="key keypos-27">
<rect rx="6" ry="6" x="-33" y="-33" width="66" height="66" class="key side"/>
<rect rx="4" ry="4" x="-27" y="-31" width="54" height="54" class="key"/>
<text x="0" y="-4" class="key tap">F2</text>
</g>
<g transform="translate(957, 165)" class="key keypos-28">
<rect rx="6" ry="6" x="-33" y="-33" width="66" height="66" class="key side"/>
<rect rx="4" ry="4" x="-27" y="-31" width="54" height="54" class="key"/>
<text x="0" y="-4" class="key tap">F3</text>
</g>
<g transform="translate(1023, 165)" class="key keypos-29">
<rect rx="6" ry="6" x="-33" y="-33" width="66" height="66" class="key side"/>
<rect rx="4" ry="4" x="-27" y="-31" width="54" height="54" class="key"/>
<text x="0" y="-4" class="key tap">F12</text>
</g>
<g transform="translate(297, 231)" class="key layer-hold keypos-30">
<rect rx="6" ry="6" x="-33" y="-33" width="66" height="66" class="key layer-hold side"/>
<rect rx="4" ry="4" x="-27" y="-31" width="54" height="54" class="key layer-hold"/>
<text x="0" y="-4" class="key layer-hold tap">◆</text>
</g>
<g transform="translate(363, 231)" class="key keypos-31">
<rect rx="6" ry="6" x="-33" y="-33" width="66" height="66" class="key side"/>
<rect rx="4" ry="4" x="-27" y="-31" width="54" height="54" class="key"/>
<text x="0" y="-4" class="key tap">▽</text>
</g>
<g transform="translate(429, 231)" class="key keypos-32">
<rect rx="6" ry="6" x="-33" y="-33" width="66" height="66" class="key side"/>
<rect rx="4" ry="4" x="-27" y="-31" width="54" height="54" class="key"/>
<text x="0" y="-4" class="key tap">▽</text>
</g>
<g transform="translate(627, 231)" class="key keypos-33">
<rect rx="6" ry="6" x="-33" y="-33" width="66" height="66" class="key side"/>
<rect rx="4" ry="4" x="-27" y="-31" width="54" height="54" class="key"/>
<text x="0" y="-4" class="key tap">▽</text>
</g>
<g transform="translate(693, 231)" class="key keypos-34">
<rect rx="6" ry="6" x="-33" y="-33" width="66" height="66" class="key side"/>
<rect rx="4" ry="4" x="-27" y="-31" width="54" height="54" class="key"/>
<text x="0" y="-4" class="key tap">▽</text>
</g>
<g transform="translate(759, 231)" class="key keypos-35">
<rect rx="6" ry="6" x="-33" y="-33" width="66" height="66" class="key side"/>
<rect rx="4" ry="4" x="-27" y="-31" width="54" height="54" class="key"/>
<text x="0" y="-4" class="key tap">▽</text>
</g>
</g>
</g>
<g transform="translate(30, 1920)" class="layer-ADJ">
<text x="0" y="28" class="label">ADJ:</text>
<g transform="translate(0, 56)">
<g transform="translate(33, 33)" class="key layer-hold keypos-0">
<rect rx="6" ry="6" x="-33" y="-33" width="66" height="66" class="key layer-hold side"/>
<rect rx="4" ry="4" x="-27" y="-31" width="54" height="54" class="key layer-hold"/>
<text x="0" y="-4" class="key layer-hold tap">◆</text>
</g>
<g transform="translate(99, 33)" class="key keypos-1">
<rect rx="6" ry="6" x="-33" y="-33" width="66" height="66" class="key side"/>
<rect rx="4" ry="4" x="-27" y="-31" width="54" height="54" class="key"/>
<text x="0" y="-4" class="key tap">
<tspan x="0" dy="-0.425em">CLMK</tspan><tspan x="0" dy="0.85em">DH</tspan>
</text>
</g>
<g transform="translate(165, 33)" class="key keypos-2">
<rect rx="6" ry="6" x="-33" y="-33" width="66" height="66" class="key side"/>
<rect rx="4" ry="4" x="-27" y="-31" width="54" height="54" class="key"/>
<text x="0" y="-4" class="key tap">CLMK</text>
</g>
<g transform="translate(231, 33)" class="key keypos-3">
<rect rx="6" ry="6" x="-33" y="-33" width="66" height="66" class="key side"/>
<rect rx="4" ry="4" x="-27" y="-31" width="54" height="54" class="key"/>
<text x="0" y="-4" class="key tap">QWERTY</text>
</g>
<g transform="translate(297, 33)" class="key keypos-4">
<rect rx="6" ry="6" x="-33" y="-33" width="66" height="66" class="key side"/>
<rect rx="4" ry="4" x="-27" y="-31" width="54" height="54" class="key"/>
<text x="0" y="-4" class="key tap">
<tspan x="0" dy="-0.425em">TD</tspan><tspan x="0" dy="0.85em">BOTAP</tspan>
</text>
</g>
<g transform="translate(759, 33)" class="key keypos-5">
<rect rx="6" ry="6" x="-33" y="-33" width="66" height="66" class="key side"/>
<rect rx="4" ry="4" x="-27" y="-31" width="54" height="54" class="key"/>
<text x="0" y="-4" class="key tap">
<tspan x="0" dy="-0.425em">TD</tspan><tspan x="0" dy="0.85em">BOTAP</tspan>
</text>
</g>
<g transform="translate(825, 33)" class="key keypos-6">
<rect rx="6" ry="6" x="-33" y="-33" width="66" height="66" class="key side"/>
<rect rx="4" ry="4" x="-27" y="-31" width="54" height="54" class="key"/>
</g>
<g transform="translate(891, 33)" class="key keypos-7">
<rect rx="6" ry="6" x="-33" y="-33" width="66" height="66" class="key side"/>
<rect rx="4" ry="4" x="-27" y="-31" width="54" height="54" class="key"/>
</g>
<g transform="translate(957, 33)" class="key keypos-8">
<rect rx="6" ry="6" x="-33" y="-33" width="66" height="66" class="key side"/>
<rect rx="4" ry="4" x="-27" y="-31" width="54" height="54" class="key"/>
</g>
<g transform="translate(1023, 33)" class="key layer-hold keypos-9">
<rect rx="6" ry="6" x="-33" y="-33" width="66" height="66" class="key layer-hold side"/>
<rect rx="4" ry="4" x="-27" y="-31" width="54" height="54" class="key layer-hold"/>
<text x="0" y="-4" class="key layer-hold tap">◆</text>
</g>
<g transform="translate(33, 99)" class="key keypos-10">
<rect rx="6" ry="6" x="-33" y="-33" width="66" height="66" class="key side"/>
<rect rx="4" ry="4" x="-27" y="-31" width="54" height="54" class="key"/>
<text x="0" y="-4" class="key tap">
<tspan x="0" dy="-0.425em">FADE</tspan><tspan x="0" dy="0.85em">TIME</tspan>
</text>
</g>
<g transform="translate(99, 99)" class="key keypos-11">
<rect rx="6" ry="6" x="-33" y="-33" width="66" height="66" class="key side"/>
<rect rx="4" ry="4" x="-27" y="-31" width="54" height="54" class="key"/>
<text x="0" y="-4" class="key tap">
<tspan x="0" dy="-0.425em">FADE</tspan><tspan x="0" dy="0.85em">HUE</tspan>
</text>
</g>
<g transform="translate(165, 99)" class="key keypos-12">
<rect rx="6" ry="6" x="-33" y="-33" width="66" height="66" class="key side"/>
<rect rx="4" ry="4" x="-27" y="-31" width="54" height="54" class="key"/>
<text x="0" y="-4" class="key tap">
<tspan x="0" dy="-0.425em">FADE</tspan><tspan x="0" dy="0.85em">SAT</tspan>
</text>
</g>
<g transform="translate(231, 99)" class="key keypos-13">
<rect rx="6" ry="6" x="-33" y="-33" width="66" height="66" class="key side"/>
<rect rx="4" ry="4" x="-27" y="-31" width="54" height="54" class="key"/>
<text x="0" y="-4" class="key tap">
<tspan x="0" dy="-0.425em">FADE</tspan><tspan x="0" dy="0.85em">VAL</tspan>
</text>
</g>
<g transform="translate(297, 99)" class="key keypos-14">
<rect rx="6" ry="6" x="-33" y="-33" width="66" height="66" class="key side"/>
<rect rx="4" ry="4" x="-27" y="-31" width="54" height="54" class="key"/>
</g>
<g transform="translate(759, 99)" class="key keypos-15">
<rect rx="6" ry="6" x="-33" y="-33" width="66" height="66" class="key side"/>
<rect rx="4" ry="4" x="-27" y="-31" width="54" height="54" class="key"/>
<text x="0" y="-4" class="key tap">
<tspan x="0" dy="-0.425em">RGB</tspan><tspan x="0" dy="0.85em">SPEED+</tspan>
</text>
</g>
<g transform="translate(825, 99)" class="key keypos-16">
<rect rx="6" ry="6" x="-33" y="-33" width="66" height="66" class="key side"/>
<rect rx="4" ry="4" x="-27" y="-31" width="54" height="54" class="key"/>
<text x="0" y="-4" class="key tap">
<tspan x="0" dy="-0.425em">RGB</tspan><tspan x="0" dy="0.85em">HUE+</tspan>
</text>
</g>
<g transform="translate(891, 99)" class="key keypos-17">
<rect rx="6" ry="6" x="-33" y="-33" width="66" height="66" class="key side"/>
<rect rx="4" ry="4" x="-27" y="-31" width="54" height="54" class="key"/>
<text x="0" y="-4" class="key tap">
<tspan x="0" dy="-0.425em">RGB</tspan><tspan x="0" dy="0.85em">SAT+</tspan>
</text>
</g>
<g transform="translate(957, 99)" class="key keypos-18">
<rect rx="6" ry="6" x="-33" y="-33" width="66" height="66" class="key side"/>
<rect rx="4" ry="4" x="-27" y="-31" width="54" height="54" class="key"/>
<text x="0" y="-4" class="key tap">
<tspan x="0" dy="-0.425em">RGB</tspan><tspan x="0" dy="0.85em">VAL+</tspan>
</text>
</g>
<g transform="translate(1023, 99)" class="key keypos-19">
<rect rx="6" ry="6" x="-33" y="-33" width="66" height="66" class="key side"/>
<rect rx="4" ry="4" x="-27" y="-31" width="54" height="54" class="key"/>
<text x="0" y="-4" class="key tap">
<tspan x="0" dy="-0.425em">RGB</tspan><tspan x="0" dy="0.85em">MODE-</tspan>
</text>
</g>
<g transform="translate(33, 165)" class="key keypos-20">
<rect rx="6" ry="6" x="-33" y="-33" width="66" height="66" class="key side"/>
<rect rx="4" ry="4" x="-27" y="-31" width="54" height="54" class="key"/>
</g>
<g transform="translate(99, 165)" class="key keypos-21">
<rect rx="6" ry="6" x="-33" y="-33" width="66" height="66" class="key side"/>
<rect rx="4" ry="4" x="-27" y="-31" width="54" height="54" class="key"/>
</g>
<g transform="translate(165, 165)" class="key keypos-22">
<rect rx="6" ry="6" x="-33" y="-33" width="66" height="66" class="key side"/>
<rect rx="4" ry="4" x="-27" y="-31" width="54" height="54" class="key"/>
</g>
<g transform="translate(231, 165)" class="key keypos-23">
<rect rx="6" ry="6" x="-33" y="-33" width="66" height="66" class="key side"/>
<rect rx="4" ry="4" x="-27" y="-31" width="54" height="54" class="key"/>
<text x="0" y="-4" class="key tap">
<tspan x="0" dy="-0.425em">FADE</tspan><tspan x="0" dy="0.85em">MIN</tspan>
</text>
</g>
<g transform="translate(297, 165)" class="key keypos-24">
<rect rx="6" ry="6" x="-33" y="-33" width="66" height="66" class="key side"/>
<rect rx="4" ry="4" x="-27" y="-31" width="54" height="54" class="key"/>
</g>
<g transform="translate(759, 165)" class="key keypos-25">
<rect rx="6" ry="6" x="-33" y="-33" width="66" height="66" class="key side"/>
<rect rx="4" ry="4" x="-27" y="-31" width="54" height="54" class="key"/>
<text x="0" y="-4" class="key tap">
<tspan x="0" dy="-0.425em">RGB</tspan><tspan x="0" dy="0.85em">SPEED-</tspan>
</text>
</g>
<g transform="translate(825, 165)" class="key keypos-26">
<rect rx="6" ry="6" x="-33" y="-33" width="66" height="66" class="key side"/>
<rect rx="4" ry="4" x="-27" y="-31" width="54" height="54" class="key"/>
<text x="0" y="-4" class="key tap">
<tspan x="0" dy="-0.425em">RGB</tspan><tspan x="0" dy="0.85em">HUD-</tspan>
</text>
</g>
<g transform="translate(891, 165)" class="key keypos-27">
<rect rx="6" ry="6" x="-33" y="-33" width="66" height="66" class="key side"/>
<rect rx="4" ry="4" x="-27" y="-31" width="54" height="54" class="key"/>
<text x="0" y="-4" class="key tap">
<tspan x="0" dy="-0.425em">RGB</tspan><tspan x="0" dy="0.85em">SAT-</tspan>
</text>
</g>
<g transform="translate(957, 165)" class="key keypos-28">
<rect rx="6" ry="6" x="-33" y="-33" width="66" height="66" class="key side"/>
<rect rx="4" ry="4" x="-27" y="-31" width="54" height="54" class="key"/>
<text x="0" y="-4" class="key tap">
<tspan x="0" dy="-0.425em">RGB</tspan><tspan x="0" dy="0.85em">VAL-</tspan>
</text>
</g>
<g transform="translate(1023, 165)" class="key keypos-29">
<rect rx="6" ry="6" x="-33" y="-33" width="66" height="66" class="key side"/>
<rect rx="4" ry="4" x="-27" y="-31" width="54" height="54" class="key"/>
<text x="0" y="-4" class="key tap">
<tspan x="0" dy="-0.425em">RGB</tspan><tspan x="0" dy="0.85em">RMOD</tspan>
</text>
</g>
<g transform="translate(297, 231)" class="key keypos-30">
<rect rx="6" ry="6" x="-33" y="-33" width="66" height="66" class="key side"/>
<rect rx="4" ry="4" x="-27" y="-31" width="54" height="54" class="key"/>
<text x="0" y="-4" class="key tap">
<tspan x="0" dy="-0.425em">TD</tspan><tspan x="0" dy="0.85em">BOTAP</tspan>
</text>
</g>
<g transform="translate(363, 231)" class="key keypos-31">
<rect rx="6" ry="6" x="-33" y="-33" width="66" height="66" class="key side"/>
<rect rx="4" ry="4" x="-27" y="-31" width="54" height="54" class="key"/>
<text x="0" y="-4" class="key tap">▽</text>
</g>
<g transform="translate(429, 231)" class="key keypos-32">
<rect rx="6" ry="6" x="-33" y="-33" width="66" height="66" class="key side"/>
<rect rx="4" ry="4" x="-27" y="-31" width="54" height="54" class="key"/>
<text x="0" y="-4" class="key tap">▽</text>
</g>
<g transform="translate(627, 231)" class="key keypos-33">
<rect rx="6" ry="6" x="-33" y="-33" width="66" height="66" class="key side"/>
<rect rx="4" ry="4" x="-27" y="-31" width="54" height="54" class="key"/>
<text x="0" y="-4" class="key tap">
<tspan x="0" dy="-0.425em">RGB</tspan><tspan x="0" dy="0.85em">TOGGLE</tspan>
</text>
</g>
<g transform="translate(693, 231)" class="key keypos-34">
<rect rx="6" ry="6" x="-33" y="-33" width="66" height="66" class="key side"/>
<rect rx="4" ry="4" x="-27" y="-31" width="54" height="54" class="key"/>
<text x="0" y="-4" class="key tap">▽</text>
</g>
<g transform="translate(759, 231)" class="key keypos-35">
<rect rx="6" ry="6" x="-33" y="-33" width="66" height="66" class="key side"/>
<rect rx="4" ry="4" x="-27" y="-31" width="54" height="54" class="key"/>
<text x="0" y="-4" class="key tap">
<tspan x="0" dy="-0.425em">TD</tspan><tspan x="0" dy="0.85em">BOTAP</tspan>
</text>
</g>
</g>
</g>
<g transform="translate(30, 2240)" class="layer-CLMK">
<text x="0" y="28" class="label">CLMK:</text>
<g transform="translate(0, 56)">
<g transform="translate(33, 33)" class="key hold-ADJ keypos-0">
<rect rx="6" ry="6" x="-33" y="-33" width="66" height="66" class="key hold-ADJ side"/>
<rect rx="4" ry="4" x="-27" y="-31" width="54" height="54" class="key hold-ADJ"/>
<text x="0" y="-4" class="key hold-ADJ tap">Q</text>
<text x="0" y="18" class="key hold-ADJ hold">ADJ</text>
</g>
<g transform="translate(99, 33)" class="key keypos-1">
<rect rx="6" ry="6" x="-33" y="-33" width="66" height="66" class="key side"/>
<rect rx="4" ry="4" x="-27" y="-31" width="54" height="54" class="key"/>
<text x="0" y="-4" class="key tap">W</text>
</g>
<g transform="translate(165, 33)" class="key keypos-2">
<rect rx="6" ry="6" x="-33" y="-33" width="66" height="66" class="key side"/>
<rect rx="4" ry="4" x="-27" y="-31" width="54" height="54" class="key"/>
<text x="0" y="-4" class="key tap">F</text>
</g>
<g transform="translate(231, 33)" class="key keypos-3">
<rect rx="6" ry="6" x="-33" y="-33" width="66" height="66" class="key side"/>
<rect rx="4" ry="4" x="-27" y="-31" width="54" height="54" class="key"/>
<text x="0" y="-4" class="key tap">P</text>
</g>
<g transform="translate(297, 33)" class="key keypos-4">
<rect rx="6" ry="6" x="-33" y="-33" width="66" height="66" class="key side"/>
<rect rx="4" ry="4" x="-27" y="-31" width="54" height="54" class="key"/>
<text x="0" y="-4" class="key tap">G</text>
</g>
<g transform="translate(759, 33)" class="key keypos-5">
<rect rx="6" ry="6" x="-33" y="-33" width="66" height="66" class="key side"/>
<rect rx="4" ry="4" x="-27" y="-31" width="54" height="54" class="key"/>
<text x="0" y="-4" class="key tap">J</text>
</g>
<g transform="translate(825, 33)" class="key keypos-6">
<rect rx="6" ry="6" x="-33" y="-33" width="66" height="66" class="key side"/>
<rect rx="4" ry="4" x="-27" y="-31" width="54" height="54" class="key"/>
<text x="0" y="-4" class="key tap">L</text>
</g>
<g transform="translate(891, 33)" class="key keypos-7">
<rect rx="6" ry="6" x="-33" y="-33" width="66" height="66" class="key side"/>
<rect rx="4" ry="4" x="-27" y="-31" width="54" height="54" class="key"/>
<text x="0" y="-4" class="key tap">U</text>
</g>
<g transform="translate(957, 33)" class="key keypos-8">
<rect rx="6" ry="6" x="-33" y="-33" width="66" height="66" class="key side"/>
<rect rx="4" ry="4" x="-27" y="-31" width="54" height="54" class="key"/>
<text x="0" y="-4" class="key tap">Y</text>
</g>
<g transform="translate(1023, 33)" class="key hold-ADJ keypos-9">
<rect rx="6" ry="6" x="-33" y="-33" width="66" height="66" class="key hold-ADJ side"/>
<rect rx="4" ry="4" x="-27" y="-31" width="54" height="54" class="key hold-ADJ"/>
<text x="0" y="-4" class="key hold-ADJ tap">;</text>
<text x="0" y="18" class="key hold-ADJ hold">ADJ</text>
</g>
<g transform="translate(33, 99)" class="key keypos-10">
<rect rx="6" ry="6" x="-33" y="-33" width="66" height="66" class="key side"/>
<rect rx="4" ry="4" x="-27" y="-31" width="54" height="54" class="key"/>
<text x="0" y="-4" class="key tap">A</text>
<text x="0" y="18" class="key hold">⌘</text>
</g>
<g transform="translate(99, 99)" class="key keypos-11">
<rect rx="6" ry="6" x="-33" y="-33" width="66" height="66" class="key side"/>
<rect rx="4" ry="4" x="-27" y="-31" width="54" height="54" class="key"/>
<text x="0" y="-4" class="key tap">R</text>
<text x="0" y="18" class="key hold">⌥</text>
</g>
<g transform="translate(165, 99)" class="key keypos-12">
<rect rx="6" ry="6" x="-33" y="-33" width="66" height="66" class="key side"/>
<rect rx="4" ry="4" x="-27" y="-31" width="54" height="54" class="key"/>
<text x="0" y="-4" class="key tap">S</text>
<text x="0" y="18" class="key hold">CTRL</text>
</g>
<g transform="translate(231, 99)" class="key keypos-13">
<rect rx="6" ry="6" x="-33" y="-33" width="66" height="66" class="key side"/>
<rect rx="4" ry="4" x="-27" y="-31" width="54" height="54" class="key"/>
<text x="0" y="-4" class="key tap">T</text>
<text x="0" y="18" class="key hold">⇧</text>
</g>
<g transform="translate(297, 99)" class="key keypos-14">
<rect rx="6" ry="6" x="-33" y="-33" width="66" height="66" class="key side"/>
<rect rx="4" ry="4" x="-27" y="-31" width="54" height="54" class="key"/>
<text x="0" y="-4" class="key tap">D</text>
</g>
<g transform="translate(759, 99)" class="key keypos-15">
<rect rx="6" ry="6" x="-33" y="-33" width="66" height="66" class="key side"/>
<rect rx="4" ry="4" x="-27" y="-31" width="54" height="54" class="key"/>
<text x="0" y="-4" class="key tap">H</text>
</g>
<g transform="translate(825, 99)" class="key keypos-16">
<rect rx="6" ry="6" x="-33" y="-33" width="66" height="66" class="key side"/>
<rect rx="4" ry="4" x="-27" y="-31" width="54" height="54" class="key"/>
<text x="0" y="-4" class="key tap">N</text>
<text x="0" y="18" class="key hold">⇧</text>
</g>
<g transform="translate(891, 99)" class="key keypos-17">
<rect rx="6" ry="6" x="-33" y="-33" width="66" height="66" class="key side"/>
<rect rx="4" ry="4" x="-27" y="-31" width="54" height="54" class="key"/>
<text x="0" y="-4" class="key tap">E</text>
<text x="0" y="18" class="key hold">CTRL</text>
</g>
<g transform="translate(957, 99)" class="key keypos-18">
<rect rx="6" ry="6" x="-33" y="-33" width="66" height="66" class="key side"/>
<rect rx="4" ry="4" x="-27" y="-31" width="54" height="54" class="key"/>
<text x="0" y="-4" class="key tap">I</text>
<text x="0" y="18" class="key hold">⌥</text>
</g>
<g transform="translate(1023, 99)" class="key keypos-19">
<rect rx="6" ry="6" x="-33" y="-33" width="66" height="66" class="key side"/>
<rect rx="4" ry="4" x="-27" y="-31" width="54" height="54" class="key"/>
<text x="0" y="-4" class="key tap">O</text>
<text x="0" y="18" class="key hold">⌘</text>
</g>
<g transform="translate(33, 165)" class="key keypos-20">
<rect rx="6" ry="6" x="-33" y="-33" width="66" height="66" class="key side"/>
<rect rx="4" ry="4" x="-27" y="-31" width="54" height="54" class="key"/>
<text x="0" y="-4" class="key tap">Z</text>
</g>
<g transform="translate(99, 165)" class="key keypos-21">
<rect rx="6" ry="6" x="-33" y="-33" width="66" height="66" class="key side"/>
<rect rx="4" ry="4" x="-27" y="-31" width="54" height="54" class="key"/>
<text x="0" y="-4" class="key tap">X</text>
</g>
<g transform="translate(165, 165)" class="key keypos-22">
<rect rx="6" ry="6" x="-33" y="-33" width="66" height="66" class="key side"/>
<rect rx="4" ry="4" x="-27" y="-31" width="54" height="54" class="key"/>
<text x="0" y="-4" class="key tap">C</text>
</g>
<g transform="translate(231, 165)" class="key keypos-23">
<rect rx="6" ry="6" x="-33" y="-33" width="66" height="66" class="key side"/>
<rect rx="4" ry="4" x="-27" y="-31" width="54" height="54" class="key"/>
<text x="0" y="-4" class="key tap">V</text>
</g>
<g transform="translate(297, 165)" class="key keypos-24">
<rect rx="6" ry="6" x="-33" y="-33" width="66" height="66" class="key side"/>
<rect rx="4" ry="4" x="-27" y="-31" width="54" height="54" class="key"/>
<text x="0" y="-4" class="key tap">B</text>
</g>
<g transform="translate(759, 165)" class="key keypos-25">
<rect rx="6" ry="6" x="-33" y="-33" width="66" height="66" class="key side"/>
<rect rx="4" ry="4" x="-27" y="-31" width="54" height="54" class="key"/>
<text x="0" y="-4" class="key tap">K</text>
</g>
<g transform="translate(825, 165)" class="key keypos-26">
<rect rx="6" ry="6" x="-33" y="-33" width="66" height="66" class="key side"/>
<rect rx="4" ry="4" x="-27" y="-31" width="54" height="54" class="key"/>
<text x="0" y="-4" class="key tap">M</text>
</g>
<g transform="translate(891, 165)" class="key keypos-27">
<rect rx="6" ry="6" x="-33" y="-33" width="66" height="66" class="key side"/>
<rect rx="4" ry="4" x="-27" y="-31" width="54" height="54" class="key"/>
<text x="0" y="-4" class="key tap">,</text>
</g>
<g transform="translate(957, 165)" class="key keypos-28">
<rect rx="6" ry="6" x="-33" y="-33" width="66" height="66" class="key side"/>
<rect rx="4" ry="4" x="-27" y="-31" width="54" height="54" class="key"/>
<text x="0" y="-4" class="key tap">.</text>
</g>
<g transform="translate(1023, 165)" class="key keypos-29">
<rect rx="6" ry="6" x="-33" y="-33" width="66" height="66" class="key side"/>
<rect rx="4" ry="4" x="-27" y="-31" width="54" height="54" class="key"/>
<text x="0" y="-4" class="key tap">/</text>
</g>
<g transform="translate(297, 231)" class="key hold-FUN keypos-30">
<rect rx="6" ry="6" x="-33" y="-33" width="66" height="66" class="key hold-FUN side"/>
<rect rx="4" ry="4" x="-27" y="-31" width="54" height="54" class="key hold-FUN"/>
<text x="0" y="-4" class="key hold-FUN tap">⌦</text>
<text x="0" y="18" class="key hold-FUN hold">FUNC</text>
</g>
<g transform="translate(363, 231)" class="key hold-SYM keypos-31">
<rect rx="6" ry="6" x="-33" y="-33" width="66" height="66" class="key hold-SYM side"/>
<rect rx="4" ry="4" x="-27" y="-31" width="54" height="54" class="key hold-SYM"/>
<text x="0" y="-4" class="key hold-SYM tap">⌫</text>
<text x="0" y="18" class="key hold-SYM hold">SYM</text>
</g>
<g transform="translate(429, 231)" class="key hold-NUM keypos-32">
<rect rx="6" ry="6" x="-33" y="-33" width="66" height="66" class="key hold-NUM side"/>
<rect rx="4" ry="4" x="-27" y="-31" width="54" height="54" class="key hold-NUM"/>
<text x="0" y="-4" class="key hold-NUM tap">ESC</text>
<text x="0" y="18" class="key hold-NUM hold">NUM</text>
</g>
<g transform="translate(627, 231)" class="key hold-NAV keypos-33">
<rect rx="6" ry="6" x="-33" y="-33" width="66" height="66" class="key hold-NAV side"/>
<rect rx="4" ry="4" x="-27" y="-31" width="54" height="54" class="key hold-NAV"/>
<text x="0" y="-4" class="key hold-NAV tap">⭾</text>
<text x="0" y="18" class="key hold-NAV hold">NAV</text>
</g>
<g transform="translate(693, 231)" class="key hold-MOUSE keypos-34">
<rect rx="6" ry="6" x="-33" y="-33" width="66" height="66" class="key hold-MOUSE side"/>
<rect rx="4" ry="4" x="-27" y="-31" width="54" height="54" class="key hold-MOUSE"/>
<text x="0" y="-4" class="key hold-MOUSE tap">⏎</text>
<text x="0" y="18" class="key hold-MOUSE hold">MOUSE</text>
</g>
<g transform="translate(759, 231)" class="key keypos-35">
<rect rx="6" ry="6" x="-33" y="-33" width="66" height="66" class="key side"/>
<rect rx="4" ry="4" x="-27" y="-31" width="54" height="54" class="key"/>
<text x="0" y="-4" class="key tap">␣</text>
</g>
<g class="combo combopos-0">
<path d="M528,50 h-291 a6.0,6.0 0 0 0 -6.0,6.0 v22" class="combo"/>
<path d="M528,50 h291 a6.0,6.0 0 0 1 6.0,6.0 v22" class="combo"/>
<rect rx="6" ry="6" x="503" y="26" width="50" height="46" class="combo"/>
<text x="528" y="50" class="combo tap">
<tspan x="528" dy="-0.425em">Caps</tspan><tspan x="528" dy="0.85em">Wrd</tspan>
</text>
</g>
</g>
</g>
<g transform="translate(30, 2560)" class="layer-CLMK-DH">
<text x="0" y="28" class="label">CLMK-DH:</text>
<g transform="translate(0, 56)">
<g transform="translate(33, 33)" class="key hold-ADJ keypos-0">
<rect rx="6" ry="6" x="-33" y="-33" width="66" height="66" class="key hold-ADJ side"/>
<rect rx="4" ry="4" x="-27" y="-31" width="54" height="54" class="key hold-ADJ"/>
<text x="0" y="-4" class="key hold-ADJ tap">Q</text>
<text x="0" y="18" class="key hold-ADJ hold">ADJ</text>
</g>
<g transform="translate(99, 33)" class="key keypos-1">
<rect rx="6" ry="6" x="-33" y="-33" width="66" height="66" class="key side"/>
<rect rx="4" ry="4" x="-27" y="-31" width="54" height="54" class="key"/>
<text x="0" y="-4" class="key tap">W</text>
</g>
<g transform="translate(165, 33)" class="key keypos-2">
<rect rx="6" ry="6" x="-33" y="-33" width="66" height="66" class="key side"/>
<rect rx="4" ry="4" x="-27" y="-31" width="54" height="54" class="key"/>
<text x="0" y="-4" class="key tap">F</text>
</g>
<g transform="translate(231, 33)" class="key keypos-3">
<rect rx="6" ry="6" x="-33" y="-33" width="66" height="66" class="key side"/>
<rect rx="4" ry="4" x="-27" y="-31" width="54" height="54" class="key"/>
<text x="0" y="-4" class="key tap">P</text>
</g>
<g transform="translate(297, 33)" class="key keypos-4">
<rect rx="6" ry="6" x="-33" y="-33" width="66" height="66" class="key side"/>
<rect rx="4" ry="4" x="-27" y="-31" width="54" height="54" class="key"/>
<text x="0" y="-4" class="key tap">B</text>
</g>
<g transform="translate(759, 33)" class="key keypos-5">
<rect rx="6" ry="6" x="-33" y="-33" width="66" height="66" class="key side"/>
<rect rx="4" ry="4" x="-27" y="-31" width="54" height="54" class="key"/>
<text x="0" y="-4" class="key tap">J</text>
</g>
<g transform="translate(825, 33)" class="key keypos-6">
<rect rx="6" ry="6" x="-33" y="-33" width="66" height="66" class="key side"/>
<rect rx="4" ry="4" x="-27" y="-31" width="54" height="54" class="key"/>
<text x="0" y="-4" class="key tap">L</text>
</g>
<g transform="translate(891, 33)" class="key keypos-7">
<rect rx="6" ry="6" x="-33" y="-33" width="66" height="66" class="key side"/>
<rect rx="4" ry="4" x="-27" y="-31" width="54" height="54" class="key"/>
<text x="0" y="-4" class="key tap">U</text>
</g>
<g transform="translate(957, 33)" class="key keypos-8">
<rect rx="6" ry="6" x="-33" y="-33" width="66" height="66" class="key side"/>
<rect rx="4" ry="4" x="-27" y="-31" width="54" height="54" class="key"/>
<text x="0" y="-4" class="key tap">Y</text>
</g>
<g transform="translate(1023, 33)" class="key hold-ADJ keypos-9">
<rect rx="6" ry="6" x="-33" y="-33" width="66" height="66" class="key hold-ADJ side"/>
<rect rx="4" ry="4" x="-27" y="-31" width="54" height="54" class="key hold-ADJ"/>
<text x="0" y="-4" class="key hold-ADJ tap">;</text>
<text x="0" y="18" class="key hold-ADJ hold">ADJ</text>
</g>
<g transform="translate(33, 99)" class="key keypos-10">
<rect rx="6" ry="6" x="-33" y="-33" width="66" height="66" class="key side"/>
<rect rx="4" ry="4" x="-27" y="-31" width="54" height="54" class="key"/>
<text x="0" y="-4" class="key tap">A</text>
<text x="0" y="18" class="key hold">⌘</text>
</g>
<g transform="translate(99, 99)" class="key keypos-11">
<rect rx="6" ry="6" x="-33" y="-33" width="66" height="66" class="key side"/>
<rect rx="4" ry="4" x="-27" y="-31" width="54" height="54" class="key"/>
<text x="0" y="-4" class="key tap">R</text>
<text x="0" y="18" class="key hold">⌥</text>
</g>
<g transform="translate(165, 99)" class="key keypos-12">
<rect rx="6" ry="6" x="-33" y="-33" width="66" height="66" class="key side"/>
<rect rx="4" ry="4" x="-27" y="-31" width="54" height="54" class="key"/>
<text x="0" y="-4" class="key tap">S</text>
<text x="0" y="18" class="key hold">CTRL</text>
</g>
<g transform="translate(231, 99)" class="key keypos-13">
<rect rx="6" ry="6" x="-33" y="-33" width="66" height="66" class="key side"/>
<rect rx="4" ry="4" x="-27" y="-31" width="54" height="54" class="key"/>
<text x="0" y="-4" class="key tap">T</text>
<text x="0" y="18" class="key hold">⇧</text>
</g>
<g transform="translate(297, 99)" class="key keypos-14">
<rect rx="6" ry="6" x="-33" y="-33" width="66" height="66" class="key side"/>
<rect rx="4" ry="4" x="-27" y="-31" width="54" height="54" class="key"/>
<text x="0" y="-4" class="key tap">G</text>
</g>
<g transform="translate(759, 99)" class="key keypos-15">
<rect rx="6" ry="6" x="-33" y="-33" width="66" height="66" class="key side"/>
<rect rx="4" ry="4" x="-27" y="-31" width="54" height="54" class="key"/>
<text x="0" y="-4" class="key tap">M</text>
</g>
<g transform="translate(825, 99)" class="key keypos-16">
<rect rx="6" ry="6" x="-33" y="-33" width="66" height="66" class="key side"/>
<rect rx="4" ry="4" x="-27" y="-31" width="54" height="54" class="key"/>
<text x="0" y="-4" class="key tap">N</text>
<text x="0" y="18" class="key hold">⇧</text>
</g>
<g transform="translate(891, 99)" class="key keypos-17">
<rect rx="6" ry="6" x="-33" y="-33" width="66" height="66" class="key side"/>
<rect rx="4" ry="4" x="-27" y="-31" width="54" height="54" class="key"/>
<text x="0" y="-4" class="key tap">E</text>
<text x="0" y="18" class="key hold">CTRL</text>
</g>
<g transform="translate(957, 99)" class="key keypos-18">
<rect rx="6" ry="6" x="-33" y="-33" width="66" height="66" class="key side"/>
<rect rx="4" ry="4" x="-27" y="-31" width="54" height="54" class="key"/>
<text x="0" y="-4" class="key tap">I</text>
<text x="0" y="18" class="key hold">⌥</text>
</g>
<g transform="translate(1023, 99)" class="key keypos-19">
<rect rx="6" ry="6" x="-33" y="-33" width="66" height="66" class="key side"/>
<rect rx="4" ry="4" x="-27" y="-31" width="54" height="54" class="key"/>
<text x="0" y="-4" class="key tap">O</text>
<text x="0" y="18" class="key hold">⌘</text>
</g>
<g transform="translate(33, 165)" class="key keypos-20">
<rect rx="6" ry="6" x="-33" y="-33" width="66" height="66" class="key side"/>
<rect rx="4" ry="4" x="-27" y="-31" width="54" height="54" class="key"/>
<text x="0" y="-4" class="key tap">Z</text>
</g>
<g transform="translate(99, 165)" class="key keypos-21">
<rect rx="6" ry="6" x="-33" y="-33" width="66" height="66" class="key side"/>
<rect rx="4" ry="4" x="-27" y="-31" width="54" height="54" class="key"/>
<text x="0" y="-4" class="key tap">X</text>
</g>
<g transform="translate(165, 165)" class="key keypos-22">
<rect rx="6" ry="6" x="-33" y="-33" width="66" height="66" class="key side"/>
<rect rx="4" ry="4" x="-27" y="-31" width="54" height="54" class="key"/>
<text x="0" y="-4" class="key tap">C</text>
</g>
<g transform="translate(231, 165)" class="key keypos-23">
<rect rx="6" ry="6" x="-33" y="-33" width="66" height="66" class="key side"/>
<rect rx="4" ry="4" x="-27" y="-31" width="54" height="54" class="key"/>
<text x="0" y="-4" class="key tap">D</text>
</g>
<g transform="translate(297, 165)" class="key keypos-24">
<rect rx="6" ry="6" x="-33" y="-33" width="66" height="66" class="key side"/>
<rect rx="4" ry="4" x="-27" y="-31" width="54" height="54" class="key"/>
<text x="0" y="-4" class="key tap">V</text>
</g>
<g transform="translate(759, 165)" class="key keypos-25">
<rect rx="6" ry="6" x="-33" y="-33" width="66" height="66" class="key side"/>
<rect rx="4" ry="4" x="-27" y="-31" width="54" height="54" class="key"/>
<text x="0" y="-4" class="key tap">K</text>
</g>
<g transform="translate(825, 165)" class="key keypos-26">
<rect rx="6" ry="6" x="-33" y="-33" width="66" height="66" class="key side"/>
<rect rx="4" ry="4" x="-27" y="-31" width="54" height="54" class="key"/>
<text x="0" y="-4" class="key tap">H</text>
</g>
<g transform="translate(891, 165)" class="key keypos-27">
<rect rx="6" ry="6" x="-33" y="-33" width="66" height="66" class="key side"/>
<rect rx="4" ry="4" x="-27" y="-31" width="54" height="54" class="key"/>
<text x="0" y="-4" class="key tap">,</text>
</g>
<g transform="translate(957, 165)" class="key keypos-28">
<rect rx="6" ry="6" x="-33" y="-33" width="66" height="66" class="key side"/>
<rect rx="4" ry="4" x="-27" y="-31" width="54" height="54" class="key"/>
<text x="0" y="-4" class="key tap">.</text>
</g>
<g transform="translate(1023, 165)" class="key keypos-29">
<rect rx="6" ry="6" x="-33" y="-33" width="66" height="66" class="key side"/>
<rect rx="4" ry="4" x="-27" y="-31" width="54" height="54" class="key"/>
<text x="0" y="-4" class="key tap">/</text>
</g>
<g transform="translate(297, 231)" class="key hold-FUN keypos-30">
<rect rx="6" ry="6" x="-33" y="-33" width="66" height="66" class="key hold-FUN side"/>
<rect rx="4" ry="4" x="-27" y="-31" width="54" height="54" class="key hold-FUN"/>
<text x="0" y="-4" class="key hold-FUN tap">⌦</text>
<text x="0" y="18" class="key hold-FUN hold">FUNC</text>
</g>
<g transform="translate(363, 231)" class="key hold-SYM keypos-31">
<rect rx="6" ry="6" x="-33" y="-33" width="66" height="66" class="key hold-SYM side"/>
<rect rx="4" ry="4" x="-27" y="-31" width="54" height="54" class="key hold-SYM"/>
<text x="0" y="-4" class="key hold-SYM tap">⌫</text>
<text x="0" y="18" class="key hold-SYM hold">SYM</text>
</g>
<g transform="translate(429, 231)" class="key hold-NUM keypos-32">
<rect rx="6" ry="6" x="-33" y="-33" width="66" height="66" class="key hold-NUM side"/>
<rect rx="4" ry="4" x="-27" y="-31" width="54" height="54" class="key hold-NUM"/>
<text x="0" y="-4" class="key hold-NUM tap">ESC</text>
<text x="0" y="18" class="key hold-NUM hold">NUM</text>
</g>
<g transform="translate(627, 231)" class="key hold-NAV keypos-33">
<rect rx="6" ry="6" x="-33" y="-33" width="66" height="66" class="key hold-NAV side"/>
<rect rx="4" ry="4" x="-27" y="-31" width="54" height="54" class="key hold-NAV"/>
<text x="0" y="-4" class="key hold-NAV tap">⭾</text>
<text x="0" y="18" class="key hold-NAV hold">NAV</text>
</g>
<g transform="translate(693, 231)" class="key hold-MOUSE keypos-34">
<rect rx="6" ry="6" x="-33" y="-33" width="66" height="66" class="key hold-MOUSE side"/>
<rect rx="4" ry="4" x="-27" y="-31" width="54" height="54" class="key hold-MOUSE"/>
<text x="0" y="-4" class="key hold-MOUSE tap">⏎</text>
<text x="0" y="18" class="key hold-MOUSE hold">MOUSE</text>
</g>
<g transform="translate(759, 231)" class="key keypos-35">
<rect rx="6" ry="6" x="-33" y="-33" width="66" height="66" class="key side"/>
<rect rx="4" ry="4" x="-27" y="-31" width="54" height="54" class="key"/>
<text x="0" y="-4" class="key tap">␣</text>
</g>
<g class="combo combopos-0">
<path d="M528,50 h-291 a6.0,6.0 0 0 0 -6.0,6.0 v22" class="combo"/>
<path d="M528,50 h291 a6.0,6.0 0 0 1 6.0,6.0 v22" class="combo"/>
<rect rx="6" ry="6" x="503" y="26" width="50" height="46" class="combo"/>
<text x="528" y="50" class="combo tap">
<tspan x="528" dy="-0.425em">Caps</tspan><tspan x="528" dy="0.85em">Wrd</tspan>
</text>
</g>
</g>
</g>
</svg>
