subject_id;lh_bankssts_thickness;lh_caudalanteriorcingulate_thickness;lh_caudalmiddlefrontal_thickness;lh_cuneus_thickness;lh_entorhinal_thickness;lh_fusiform_thickness;lh_inferiorparietal_thickness;lh_inferiortemporal_thickness;lh_isthmuscingulate_thickness;lh_lateraloccipital_thickness;lh_lateralorbitofrontal_thickness;lh_lingual_thickness;lh_medialorbitofrontal_thickness;lh_middletemporal_thickness;lh_parahippocampal_thickness;lh_paracentral_thickness;lh_parsopercularis_thickness;lh_parsorbitalis_thickness;lh_parstriangularis_thickness;lh_pericalcarine_thickness;lh_postcentral_thickness;lh_posteriorcingulate_thickness;lh_precentral_thickness;lh_precuneus_thickness;lh_rostralanteriorcingulate_thickness;lh_rostralmiddlefrontal_thickness;lh_superiorfrontal_thickness;lh_superiorparietal_thickness;lh_superiortemporal_thickness;lh_supramarginal_thickness;lh_frontalpole_thickness;lh_temporalpole_thickness;lh_transversetemporal_thickness;lh_insula_thickness;rh_bankssts_thickness;rh_caudalanteriorcingulate_thickness;rh_caudalmiddlefrontal_thickness;rh_cuneus_thickness;rh_entorhinal_thickness;rh_fusiform_thickness;rh_inferiorparietal_thickness;rh_inferiortemporal_thickness;rh_isthmuscingulate_thickness;rh_lateraloccipital_thickness;rh_lateralorbitofrontal_thickness;rh_lingual_thickness;rh_medialorbitofrontal_thickness;rh_middletemporal_thickness;rh_parahippocampal_thickness;rh_paracentral_thickness;rh_parsopercularis_thickness;rh_parsorbitalis_thickness;rh_parstriangularis_thickness;rh_pericalcarine_thickness;rh_postcentral_thickness;rh_posteriorcingulate_thickness;rh_precentral_thickness;rh_precuneus_thickness;rh_rostralanteriorcingulate_thickness;rh_rostralmiddlefrontal_thickness;rh_superiorfrontal_thickness;rh_superiorparietal_thickness;rh_superiortemporal_thickness;rh_supramarginal_thickness;rh_frontalpole_thickness;rh_temporalpole_thickness;rh_transversetemporal_thickness;rh_insula_thickness;Left-Lateral-Ventricle;Left-Inf-Lat-Vent;Left-Cerebellum-White-Matter;Left-Cerebellum-Cortex;Left-Thalamus-Proper;Left-Caudate;Left-Putamen;Left-Pallidum;3rd-Ventricle;4th-Ventricle;Brain-Stem;Left-Hippocampus;Left-Amygdala;Left-Accumbens-area;Left-VentralDC;Left-vessel;Left-choroid-plexus;Right-Lateral-Ventricle;Right-Inf-Lat-Vent;Right-Cerebellum-White-Matter;Right-Cerebellum-Cortex;Right-Thalamus-Proper;Right-Caudate;Right-Putamen;Right-Pallidum;Right-Hippocampus;Right-Amygdala;Right-Accumbens-area;Right-VentralDC;Right-vessel;Right-choroid-plexus;EstimatedTotalIntraCranialVol
024_S_1171;2.04;2.34;2.207;1.69;3.166;2.471;2.039;2.607;1.762;1.844;2.341;1.67;2.093;2.51;2.592;2.074;2.096;2.352;2.144;1.343;1.666;2.076;1.914;2.102;2.463;1.946;2.27;2.093;2.239;2.245;2.294;3.481;1.799;2.649;2.163;1.787;2.164;1.557;3.226;2.401;2.082;2.549;1.943;1.944;2.522;1.728;1.958;2.518;2.523;2.298;2.278;2.258;1.881;1.413;1.85;1.912;2.148;2.049;2.319;1.955;2.253;1.902;2.348;2.261;2.086;2.921;2.03;2.628;40390.0;1784.9;14193.0;56415.2;6988.7;3682.5;4310.1;2136.4;2787.8;3557.9;24149.8;3785.8;1357.6;425.6;3606.4;76.9;1088.0;40106.3;1108.1;14336.6;55956.9;6794.9;3969.2;4149.9;2062.6;3835.2;1613.1;468.1;3860.4;40.3;1186.3;1819473.27093
126_S_0606;1.846;2.961;2.49;1.905;2.673;2.785;2.281;2.561;2.029;2.129;2.661;2.084;2.297;2.618;2.358;2.249;2.493;2.866;2.192;1.787;1.833;2.203;2.373;2.217;2.551;2.155;2.517;2.038;2.251;2.308;2.521;3.361;2.209;2.518;1.855;1.977;2.164;1.869;1.948;2.271;1.995;2.278;2.009;2.062;2.398;1.863;2.218;2.272;1.939;2.337;2.324;2.818;2.262;1.641;1.811;2.1;2.23;1.904;2.697;2.102;2.422;1.735;2.005;1.931;3.162;3.158;1.961;2.324;11907.7;623.8;12331.7;47437.3;5926.2;3191.5;4286.6;1603.0;1803.7;1331.5;20490.9;2619.1;836.1;400.9;3501.4;41.1;602.1;20317.1;1129.6;12513.2;48707.7;5311.9;3287.0;3908.2;1666.7;2249.8;889.2;337.2;3405.9;40.2;783.6;1467058.36136
141_S_1152;2.424;3.122;2.582;1.83;2.842;2.635;2.377;2.961;2.301;2.155;2.501;2.023;2.63;2.947;2.086;2.151;2.575;2.339;2.364;1.471;1.81;2.375;2.389;2.143;3.184;2.359;2.724;1.998;2.643;2.422;2.966;3.49;2.098;2.585;2.178;2.865;2.397;2.05;3.105;2.666;2.266;2.774;2.342;2.07;2.322;1.898;2.361;2.631;1.968;2.197;2.486;2.24;2.277;1.544;1.78;2.428;2.386;2.293;3.251;2.275;2.568;1.933;2.418;2.292;2.311;3.359;1.865;2.916;15037.6;256.4;8526.6;40272.2;6125.1;4055.9;4826.0;1163.4;864.1;1571.1;15856.2;2708.6;958.3;294.1;2960.3;32.0;484.2;14152.4;351.4;8539.7;38923.5;6287.8;4019.2;4003.3;1541.7;2780.6;990.1;354.5;2539.3;42.5;681.4;1357695.36758
005_S_0929;2.022;2.947;1.861;1.661;2.364;2.321;1.924;2.378;2.014;1.804;2.593;1.722;2.21;2.487;2.297;1.872;2.059;2.396;2.067;1.342;1.597;2.132;1.971;1.941;2.416;1.915;2.212;1.736;2.195;2.014;2.053;3.539;1.773;2.711;2.153;2.34;1.833;1.53;2.61;2.424;1.904;2.661;2.061;1.838;2.502;1.749;1.986;2.711;1.834;1.819;2.046;2.156;1.991;1.245;1.562;2.177;1.912;1.925;2.602;1.873;1.983;1.674;2.388;2.1;1.932;4.018;1.502;2.436;19981.0;1838.9;11715.1;55405.9;5750.0;2943.2;3893.7;1714.9;1587.7;2935.8;20995.8;2696.2;1102.0;410.8;3250.7;63.1;967.6;25224.4;1864.6;11753.2;56195.1;5506.5;2829.1;3907.5;1761.3;2543.3;1095.8;301.2;3045.8;44.0;1044.5;1596613.77185
131_S_0691;1.927;2.947;2.289;2.049;2.918;2.334;2.118;2.429;1.902;1.903;2.345;1.86;2.065;2.403;2.829;2.414;2.242;2.242;2.052;1.508;1.922;2.096;2.159;2.388;2.513;2.084;2.567;2.211;2.389;2.143;2.466;2.911;2.152;2.58;2.337;2.397;2.353;1.889;3.214;2.407;2.304;2.45;2.329;2.012;2.188;1.971;1.89;2.465;2.506;2.168;2.279;2.133;2.037;1.528;2.018;2.494;2.389;2.545;2.626;2.046;2.541;2.453;2.413;2.19;2.284;3.091;2.072;2.491;37030.8;2785.6;13699.3;48657.1;6058.9;2853.2;3659.5;1613.4;3322.7;2162.2;20532.9;2621.0;1277.2;326.3;3619.5;83.1;1244.6;39264.7;3017.4;12297.1;48972.9;5789.4;3528.1;3890.4;2163.1;2666.5;1368.1;409.3;3438.8;31.2;1058.9;1574277.17629
114_S_0228;2.057;2.249;2.256;1.651;1.964;2.143;2.191;2.188;1.733;1.891;2.227;1.613;2.206;2.182;2.168;1.888;2.213;2.313;2.068;1.485;1.813;1.989;2.085;2.112;2.273;1.899;2.355;1.952;2.042;2.094;2.252;2.384;1.816;2.551;2.307;1.855;2.111;1.749;2.39;2.383;2.31;2.375;1.679;1.905;2.118;1.781;2.044;2.342;2.191;1.847;2.269;2.192;1.958;1.503;1.849;1.532;1.906;1.975;2.198;1.995;2.26;1.916;2.155;2.162;2.005;2.276;1.977;2.373;53603.2;3963.5;10972.0;41562.8;6329.2;3024.2;2614.6;1448.2;1927.5;1581.5;19784.2;2341.5;682.1;211.8;2868.9;6.2;791.4;39308.9;3388.6;10431.2;41665.8;5624.8;3178.2;2344.7;1273.9;2437.4;857.5;274.2;2747.4;0.0;1194.3;1581280.27768
011_S_0183;2.355;2.676;2.345;1.831;3.228;2.629;2.341;2.561;2.05;2.044;2.303;1.897;2.147;2.597;2.856;2.394;2.334;2.308;2.27;1.667;1.84;2.401;2.502;2.173;2.553;1.989;2.57;2.1;2.635;2.352;2.762;3.365;1.879;2.896;2.271;2.248;2.154;1.94;3.099;2.236;2.0;2.454;1.695;1.773;2.275;1.818;2.213;2.394;2.692;2.247;2.349;2.451;2.078;1.481;1.667;1.704;2.173;1.982;2.254;1.814;2.293;1.759;2.493;2.177;2.19;3.055;2.288;2.525;38805.8;1810.8;11761.3;48662.2;5694.1;4218.8;4236.5;1895.2;2075.6;3453.2;19120.3;2683.2;1178.6;286.3;3407.4;64.8;864.0;37313.7;2002.3;11713.9;48858.0;5719.6;3795.3;3890.3;1741.9;2727.1;1258.3;402.8;3177.0;6.2;910.4;1528605.46255
094_S_1164;2.002;2.831;1.869;1.767;2.645;2.149;1.801;2.189;1.69;1.93;2.505;1.646;2.277;1.994;2.456;1.955;2.125;2.105;2.046;1.431;1.699;2.109;2.092;1.836;2.755;1.941;2.218;1.754;2.211;1.901;2.324;2.947;1.799;2.79;2.134;2.495;2.091;1.614;2.793;2.382;1.991;2.262;2.143;1.885;2.303;1.677;2.252;2.226;2.338;2.094;2.193;2.302;1.978;1.535;1.659;2.251;2.226;1.954;2.551;1.942;2.253;1.844;2.401;2.184;2.542;3.224;2.043;2.723;17039.9;1109.9;11280.6;43254.2;5335.9;2124.0;3037.1;1501.6;1599.5;1399.1;16886.3;2262.8;646.3;292.4;2915.4;120.5;656.1;15855.8;867.3;10454.9;42119.1;5142.8;2436.3;3306.0;1655.4;2329.2;733.1;270.5;2932.7;22.0;592.6;1327930.69498
002_S_0938;2.304;2.641;2.059;1.649;1.941;2.273;1.975;2.226;1.963;1.958;2.237;1.72;2.097;2.167;2.415;2.155;2.218;2.298;2.187;1.411;1.654;2.398;1.903;2.028;2.614;2.018;2.349;1.919;2.115;2.156;2.779;2.192;1.511;2.384;1.959;2.343;2.009;1.652;1.889;2.109;2.061;2.129;2.017;2.02;2.112;1.68;1.922;2.001;2.252;2.057;2.156;2.439;2.23;1.502;1.614;2.414;1.907;1.96;2.645;2.123;2.205;1.869;2.122;2.2;2.261;1.939;1.69;2.287;8701.7;822.7;10534.7;42633.8;6005.2;2373.5;2187.3;1174.9;2174.7;1202.1;19251.2;2362.8;629.1;143.5;3179.7;0.0;703.7;8297.7;1201.4;9744.5;41104.1;5946.2;2358.2;2752.5;1378.9;2333.2;698.8;173.7;2928.2;0.0;557.6;1386025.96643
033_S_0739;1.991;3.121;2.036;1.742;2.448;2.425;2.1;2.697;1.976;1.927;2.336;1.824;2.567;2.43;1.942;2.062;2.297;2.465;2.208;1.352;1.597;2.336;1.933;2.102;2.934;2.005;2.295;1.84;2.277;2.073;2.29;2.814;2.055;2.788;2.312;2.64;2.223;1.599;3.364;2.468;2.182;2.786;2.065;2.023;2.486;1.702;2.215;2.771;1.946;1.954;2.536;2.521;2.344;1.421;1.673;2.211;2.047;2.042;3.313;2.08;2.326;1.85;2.64;2.297;2.563;2.631;2.014;2.901;23323.8;1196.2;11316.0;53862.7;6466.7;3014.4;4201.1;1757.3;1893.3;2387.0;21828.6;2194.3;859.3;269.6;3465.8;124.4;990.6;21808.9;895.5;11500.9;57414.8;6485.9;3341.2;5192.6;1980.6;3206.4;1268.2;373.3;3593.9;130.2;946.7;1637412.84108
