{
	"author": {
		"email": "support@mooregoodideas.com",
		"name": "Moore Good Ideas, Inc",
		"url": "https://www.mooregoodideas.com"
	},
	"bugs": "https://gitlab.com/mgi/gpm-packages/library-core/issues",
	"contributors": [
		{
			"email": "derek@mooregoodideas.com",
			"name": "Derek Trepanier",
			"url": "https://www.mooregoodideas.com/"
		}
	],
	"description": "Basic helpful reuse VIs",
	"files": [
		"Source/"
	],
	"keywords": [
		"common",
		"array",
		"application",
		"file",
		"timing"
	],
	"license": "BSD-3-Clause",
	"lvversion": ">=17",
	"name": "@mgi/library-core",
	"repository": "https://gitlab.com/mgi/gpm-packages/library-core",
	"version": "0.4.0"
}