{
	"author": {
		"email": "support@mooregoodideas.com",
		"name": "Moore Good Ideas, Inc",
		"url": "https://www.mooregoodideas.com"
	},
	"bugs": "https://gitlab.com/mgi/gpm/Package-Parser/issues",
	"contributors": [
		{
			"email": "derek@mooregoodideas.com",
			"name": "Derek Trepanier",
			"url": "https://www.mooregoodideas.com/consultants/derek-trepanier/"
		}
	],
	"dependencies": {
		"@mgi/json": "^0.1.5",
		"@mgi/semver": "^0.1.0"
	},
	"description": "Parses a GPM Package File",
	"files": [
		"Package"
	],
	"license": "GPL-3.0",
	"lvversion": ">=17",
	"name": "@mgi/gpm-package-parser",
	"repository": "https://gitlab.com/mgi/gpm/Package-Parser",
	"version": "0.1.1"
}