{
  "courses": [
    {
      "id": 1,
      "title": "Angular 13 Fundamentals update",
      "description": "Learn the fundamentals of Angular 13",
      "percentComplete": 26,
      "favorite": true
    },
    {
      "id": 2,
      "title": "asdfasdf",
      "description": "asdfasdf",
      "percentComplete": 24,
      "favorite": false
    }
  ]
}