﻿0;8:25
1;8:15
2;8:15
3;8:15
4;8:15
5;8:15
6;8:15
7;8:15
8;8:15
9;8:15
10;8:15
11;7:55
12;7:55
13;7:55
14;8:25
15;8:25
16;8:25
17;8:15
18;8:15
19;8:15
20;8:25
21;8:25
22;8:15
23;8:15
24;8:15
25;8:15
26;8:15
27;8:15
28;8:15
29;8:15
30;8:15
31;8:15
32;8:15
33;8:15
34;8:15
35;8:05
36;8:05
37;8:05
38;8:05
39;8:05
40;8:25
41;8:25
42;8:25
43;8:15
44;8:15
45;8:05
46;8:05
47;8:05
48;8:05
49;8:05
50;8:05
51;8:05
52;8:05
53;8:05
54;8:05
55;8:05
56;7:55
57;7:55
58;7:55
59;7:55
60;7:55
61;7:55
62;7:55
63;7:55
64;7:55
65;7:55
66;7:55
67;7:55
68;7:55
69;7:55
70;7:55
71;7:55
72;7:55
73;7:45
74;7:45
75;7:45
76;7:45
77;7:45
78;7:45
79;7:45
80;7:45
81;7:45
82;7:45
83;7:45
84;7:45
85;7:45
86;7:45
87;7:45
88;7:45
89;7:45
90;7:45
91;7:45
92;7:45
93;7:45
94;7:45
95;7:45
96;7:45
97;7:45
98;7:45
99;7:45
100;7:45
101;8:05
102;8:05
103;8:05
104;8:05
105;8:05
106;8:05
107;8:05
108;8:05
109;8:05
110;8:05
111;8:05
112;8:05
113;8:05
114;8:05
115;7:55
116;7:55
117;7:55
118;7:55
119;7:55
120;7:55
121;7:55
122;7:55
123;7:55
124;7:55
125;7:55
126;7:55
127;7:55
