{
  "id": "@itentialopensource/app-tmfapi",
  "type": "Application",
  "export": "tmfapi",
  "displayName": "tmfapi",
  "title": "tmfApi",
  "src": "cog.js",
  "encrypted": false,
  "roles": [
    "admin",
    "engineering",
    "support"
  ],
  "components": [
    {
      "src": "/components/dist/workflow_task.js",
      "name": "workflowTask"
    },
    {
      "src": "/components/dist/1.workflow_task.js",
      "name": "1.workflow_task"
    },
    {
      "src": "/components/dist/2.workflow_task.js",
      "name": "2.workflow_task"
    }
  ],
  "views": [
    {
      "path": "/",
      "roles": [
        "admin",
        "engineering",
        "support"
      ],
      "template": "../public/build/index.html",
      "title": "HELLO WORLD REACT",
      "type": "view",
      "icon": "/tmfApi/public/operations.svg"
    },
    {
      "path": "/task/ShowWorkflowTask",
      "roles": [
        "admin",
        "engineering",
        "operations",
        "readonly"
      ],
      "name": "React workflow Task",
      "summary": "a react workflow task",
      "description": "a react workflow task",
      "template": "./tasks/ShowWorkflowTask/main.jade",
      "title": "React workflow task",
      "type": "task",
      "variables": {
        "incoming": {
          "taskDataIn": {
            "type": "object"
          }
        },
        "outgoing": {
          "export": null
        }
      },
      "task": true
    }
  ],
  "methods": [
    {
      "name": "serviceOrderCreate",
      "summary": "Create a service order",
      "description": "This operation creates a Service Order instance in the Service Order management system maintained by the SOF.",
      "input": [],
      "output": {
        "name": "result",
        "type": "object",
        "description": "A JSON Object containing status, code and the result"
      },
      "roles": [
        "admin"
      ],
      "task": true,
      "deprecated": false,
      "route": {
        "path": "/serviceOrdering/v4/serviceOrder/serviceOrderCreate",
        "verb": "POST"
      }
    },
    {
      "name": "serviceOrderFind",
      "summary": "List service orders",
      "description": "This operation returns a list of Service Order instances matching the query parameters from the Service Order management system maintained by the SOF.",
      "input": [],
      "output": {
        "name": "result",
        "type": "object",
        "description": "A JSON Object containing status, code and the result"
      },
      "roles": [
        "admin"
      ],
      "task": true,
      "deprecated": false,
      "route": {
        "path": "/serviceOrdering/v4/serviceOrder/serviceOrderFind",
        "verb": "GET"
      }
    },
    {
      "name": "serviceOrderGet",
      "summary": "Retrieve a service order",
      "description": "This operation retrieves a Service Order instance identified by the Id parameter from the Service Order managment system maintained by the SOF.",
      "input": [],
      "output": {
        "name": "result",
        "type": "object",
        "description": "A JSON Object containing status, code and the result - this worked!"
      },
      "roles": [
        "admin"
      ],
      "task": true,
      "deprecated": false,
      "route": {
        "path": "/serviceOrdering/v4/serviceOrder/serviceOrderGet",
        "verb": "GET"
      }
    },
    {
      "name": "serviceOrderDelete",
      "summary": "Delete a service order",
      "description": "This operation deletes a Service Order instance identified by the Id parameter from the Service Order managment system maintained by the SOF.",
      "input": [
        {
          "name": "payload",
          "type": "Object",
          "info": "A basic test call for a generated app",
          "required": true
        }
      ],
      "output": {
        "name": "result",
        "type": "object",
        "description": "A JSON Object containing status, code and the result"
      },
      "roles": [
        "admin"
      ],
      "task": true,
      "deprecated": false,
      "route": {
        "path": "/serviceOrdering/v4/serviceOrder/serviceOrderDelete",
        "verb": "DELETE"
      }
    },
        {
        "name": "demoStatus",
        "summary": "demo status api call",
        "description": "Simple status API call",
        "input": [],
        "output": {
          "name": "result",
          "type": "object",
          "description": "A JSON Object containing status, code and the result"
        },
        "roles": [
          "admin"
        ],
        "task": true,
        "deprecated": false,
        "route": {
          "path": "/demoStatus",
          "verb": "GET"
        }
      },
        {
        "name": "jobList",
        "summary": "List all completed jobs",
        "description": "API call to list completed jobs",
        "input": [],
        "output": {
          "name": "result",
          "type": "object",
          "description": "A JSON Object containing status, code and the result"
        },
        "roles": [
          "admin"
        ],
        "task": true,
        "deprecated": false,
        "route": {
          "path": "/jobList",
          "verb": "POST"
        }
      }
  ]
}
