<?xml version="1.0" encoding="utf-8"?>
<!-- Generator: Adobe Illustrator 23.1.0, SVG Export Plug-In . SVG Version: 6.00 Build 0)  -->
<svg version="1.1" id="Ebene_1" xmlns="http://www.w3.org/2000/svg" xmlns:xlink="http://www.w3.org/1999/xlink" x="0px" y="0px"
	 viewBox="0 0 425.2 425.2" style="enable-background:new 0 0 425.2 425.2;" xml:space="preserve">
<style type="text/css">
	.st0{fill:#444444;}
	.st1{fill:#FFFFFF;}
</style>
<path class="st0" d="M354.3,0H141.7c-39.1,0-70.8,31.7-70.9,70.8h-0.1v0.1C31.7,70.9,0,102.6,0,141.7v212.6
	c0,39.2,31.7,70.9,70.9,70.9h212.6c39.1,0,70.9-31.7,70.9-70.9c39.1,0,70.9-31.7,70.9-70.9V70.9C425.2,31.7,393.5,0,354.3,0"/>
<g>
	<path class="st1" d="M121.3,248.3c0,14.4-2.5,25.2-7.6,32.2c-4.6,6.4-11.3,9.5-20.6,9.5c-9.4,0-16.3-3.2-21.3-9.7
		c-5.3-7-7.9-17.6-7.9-31.6V120.6H38.1v126.7c0,20.8,4.7,37.2,13.9,48.7c9.5,11.9,23.4,18,41.1,18c24.5,0,53.8-11.6,53.8-66.7V120.6
		h-25.7V248.3z"/>
	<path class="st1" d="M237.5,141.7c8.4,0,16,1.9,22.5,5.7l5.4,3.2l12.3-21.4l-5.5-3.1c-9.9-5.6-21.5-8.4-34.5-8.4
		c-21.3,0-38.4,9.1-50.7,27.1c-11.8,17.3-17.8,41-17.8,70.7c0,19.7,2.7,37,8,51.5c5.5,14.9,13.5,26.5,23.7,34.6
		c10.4,8.2,22.7,12.3,36.6,12.3c12.3,0,22.6-2.1,30.4-6.2l3.4-1.7v-24.5l-8.8,4c-6.5,3-14.5,4.5-23.7,4.5c-8.5,0-15.7-2.7-22.1-8.2
		c-6.6-5.7-11.8-14.2-15.5-25.2c-3.8-11.4-5.7-25.1-5.7-40.7c0-23.9,4.1-42.6,12.2-55.8C215.1,147.7,224.9,141.7,237.5,141.7z"/>
	<path class="st1" d="M378.9,226.1c-6.7-8.6-17.3-16.2-31.4-22.4c-14.8-6.8-20.9-12.2-23.5-15.4c-3.5-4.4-5.2-10.9-5.2-19.4
		c0-8.2,2.4-14.5,7.2-19.3c4.9-4.8,11.1-7.2,19.2-7.2c9.3,0,18.6,2.1,27.7,6.4l5.8,2.7l10.1-22.7l-5.3-2.7c-4-2-9.3-3.8-16-5.5
		c-6.7-1.7-14.2-2.5-22.3-2.5c-9.4,0-18.2,2.2-26.2,6.4c-8.1,4.3-14.5,10.5-19,18.3c-4.5,7.8-6.7,16.7-6.7,26.6
		c0,8.9,1.4,16.7,4.1,23.2c2.8,6.6,7.1,12.5,12.8,17.5c5.5,4.8,13.4,9.5,24.2,14.5c14.8,6.6,21.1,12.1,23.8,15.5
		c3.7,4.6,5.5,11.2,5.5,19.6c0,9.1-2.6,16.3-8,22.1c-5.3,5.6-11.8,8.4-20.1,8.4c-6.3,0-12.7-0.7-19.2-2c-6.3-1.3-11.6-2.9-15.7-5
		l-9.1-4.6v27.2l3.7,1.6c10.2,4.5,23.8,6.8,40.2,6.8c15.5,0,28.4-5.2,38.6-15.5c10.1-10.2,15.2-23.7,15.2-40
		C389.4,245.9,385.9,235,378.9,226.1z"/>
</g>
</svg>
