<?xml version="1.0" encoding="UTF-8" standalone="no"?>
<svg xmlns:rdf="http://www.w3.org/1999/02/22-rdf-syntax-ns#" xmlns="http://www.w3.org/2000/svg" version="1.1" xmlns:cc="http://creativecommons.org/ns#" xmlns:xlink="http://www.w3.org/1999/xlink" viewBox="0 0 16.059534 16" xmlns:dc="http://purl.org/dc/elements/1.1/">
<metadata>
<rdf:RDF>
<cc:Work rdf:about="">
<dc:format>image/svg+xml</dc:format>
<dc:type rdf:resource="http://purl.org/dc/dcmitype/StillImage"/>
</cc:Work>
</rdf:RDF>
</metadata>
<defs>
<linearGradient id="a" y2="178.6575" gradientUnits="userSpaceOnUse" x2="-33.69472" gradientTransform="rotate(90,-37.4946,182.5022)" y1="187.863" x1="-37.33073">
<stop stop-color="#5a5a5a" offset="0"/>
<stop offset="1"/>
</linearGradient>
<linearGradient id="b" y2="183.8145" gradientUnits="userSpaceOnUse" x2="-40.58511" y1="189.5493" x1="-42.30934">
<stop stop-color="#ffbf00" offset="0"/>
<stop stop-color="#fff" offset="1"/>
</linearGradient>
</defs>
<g transform="matrix(-1,0,0,1,-28.94047,-175)">
<rect style="color:#000000" height="16" width="16" y="175" x="-45" fill="none"/>
<path stroke-linejoin="round" style="color:#000000" d="m-37.5 175.5v15h-6l6-15z" fill-rule="evenodd" stroke="#000" stroke-linecap="round" stroke-miterlimit="0" stroke-width="1.0000002"/>
<path stroke-linejoin="round" style="color:#000000" d="m-29.5 188.5h-15v-6l15 6z" fill-rule="evenodd" stroke="url(#a)" stroke-linecap="round" stroke-miterlimit="0" stroke-width="1.0000006" fill="url(#b)"/>
<path style="color:#000000" stroke-width="1px" d="m-36.03125 176.9687v1h3l1.0149 0.9922h1l-2.0149-1.9922h-3v0.0001z"/>
<path d="m199 207v1h3l1.0312 1v3.0312h-2l2.5 3 2.5-3h-2v-3.0312l-2.0312-2h-3z" fill-rule="evenodd" transform="translate(-234.97167 -30.038663)"/>
</g>
</svg>
