<?xml version="1.0" encoding="UTF-8" standalone="no"?>
<svg xmlns:rdf="http://www.w3.org/1999/02/22-rdf-syntax-ns#" xmlns="http://www.w3.org/2000/svg" version="1.1" xmlns:cc="http://creativecommons.org/ns#" xmlns:xlink="http://www.w3.org/1999/xlink" viewBox="0 0 24.000003 24.000001" xmlns:dc="http://purl.org/dc/elements/1.1/">
<metadata>
<rdf:RDF>
<cc:Work rdf:about="">
<dc:format>image/svg+xml</dc:format>
<dc:type rdf:resource="http://purl.org/dc/dcmitype/StillImage"/>
</cc:Work>
</rdf:RDF>
</metadata>
<defs>
<linearGradient id="a" y2="214.0299" gradientUnits="userSpaceOnUse" x2="1095.32" gradientTransform="matrix(.9891733 0 0 .9571849 -1182.248 9.280945)" y1="180.8225" x1="1095.307">
<stop offset="0"/>
<stop stop-color="#7f7f7f" offset=".35076979"/>
<stop stop-color="#bfbfbf" offset=".59668732"/>
<stop stop-color="#dfdfdf" offset=".78382427"/>
<stop stop-color="#fff" offset="1"/>
</linearGradient>
</defs>
<g transform="matrix(.9610923 0 0 .9805424 106.21022 -176.52067)">
<rect style="color:#000000" height="24.47625" width="24.97159" y="180.0235" x="-110.5099" fill="none"/>
<path d="m-109.5169 193.9456c8.2165 1.6913 5.1224-7.85 10.71653-11.5841 1.72915-1.1542 6.23552-0.8058 7.60383 2.2962 1.01863 2.3092 0.57299 3.7792-0.88086 3.3379-1.52946-0.4643-1.24291-2.3104-3.81779-1.813-1.3025 0.2516-2.0822 2.3434-1.10913 4.6913 1.09776 2.6488 3.352 4.4227 8.9464 3.0717v9.5976h-21.45898v-9.5976z" stroke="#000" stroke-width=".9185374" fill="url(#a)"/>
<path d="m-96.8577 182.6385c-2.71067 0.552-4.0177 3.4163-4.8477 5.9037-0.7259 2.2595-1.4136 5.0237-3.7439 6.0105-1.0107 0.3882-2.9612 0.5448-4.0361 0.3826l-0.0291 8.5583 21.4833 0.06v-8.5582c-2.78224 0.4279-5.92299 0.3649-8.21536-1.4697-2.01583-1.6882-2.67843-5.0914-1.22227-7.3482 1.45069-1.684 4.46573-0.982 5.41291 0.8999 0.78385 0.398 0.53026-0.7543 0.39943-1.2072-0.63017-2.1587-3.02208-3.4761-5.20121-3.2317z" stroke="#fff" stroke-width=".9185374" fill="none"/>
</g>
</svg>
