<?xml version="1.0" encoding="UTF-8" standalone="no"?>
<svg xmlns:rdf="http://www.w3.org/1999/02/22-rdf-syntax-ns#" xmlns="http://www.w3.org/2000/svg" version="1.1" xmlns:cc="http://creativecommons.org/ns#" viewBox="0 0 20.25 24" xmlns:dc="http://purl.org/dc/elements/1.1/">
<metadata>
<rdf:RDF>
<cc:Work rdf:about="">
<dc:format>image/svg+xml</dc:format>
<dc:type rdf:resource="http://purl.org/dc/dcmitype/StillImage"/>
</cc:Work>
</rdf:RDF>
</metadata>
<g transform="translate(-612.75,-85.500023)" fill="none">
<rect style="color:#000000" height="24" width="20.25" y="85.500023" x="612.75" stroke-width="3"/>
<path stroke-linejoin="bevel" d="m617.649 102.882 10.4519-10.76389" stroke-dashoffset="23.200001" stroke="#000" stroke-linecap="round" stroke-miterlimit="4.27" stroke-width="4.2362256"/>
<path stroke-linejoin="bevel" d="m628.2568 102.7259-10.7636-10.4518" stroke-dashoffset="23.200001" stroke="#000" stroke-linecap="round" stroke-miterlimit="4.27" stroke-width="4.2362256"/>
</g>
</svg>
