<?xml version="1.0" encoding="UTF-8" standalone="no"?>
<svg xmlns:rdf="http://www.w3.org/1999/02/22-rdf-syntax-ns#" xmlns="http://www.w3.org/2000/svg" version="1.1" xmlns:cc="http://creativecommons.org/ns#" viewBox="0 0 24 24" xmlns:dc="http://purl.org/dc/elements/1.1/">
<metadata>
<rdf:RDF>
<cc:Work rdf:about="">
<dc:format>image/svg+xml</dc:format>
<dc:type rdf:resource="http://purl.org/dc/dcmitype/StillImage"/>
</cc:Work>
</rdf:RDF>
</metadata>
<g stroke="#c80000" fill="none">
<path d="m0.5 0v24"/>
<path d="m14.5 0v24"/>
</g>
<path d="m1 2.5 3-2.5v2h7v-2l3 2.5-3 2.5v-2h-7v2z"/>
<path fill="#4e6e90" d="m5.1 13.4c-0.55 0-0.97 0.1-1.25 0.3s-0.41 0.4-0.41 0.8c0 0.3 0.11 0.5 0.33 0.7 0.23 0.2 0.54 0.3 0.94 0.3 0.5 0 0.92-0.2 1.26-0.5 0.34-0.4 0.51-0.8 0.51-1.3v-0.3zm4.05 3.5h-2.67v-1.2c-0.36 0.5-0.76 0.9-1.2 1.1s-0.98 0.3-1.62 0.3c-0.86 0-1.56-0.2-2.1-0.7-0.53-0.5-0.794-1.1-0.794-1.8 0-0.9 0.334-1.6 0.994-2 0.68-0.4 1.73-0.6 3.16-0.6h1.56v-0.2c0-0.4-0.17-0.7-0.5-0.9s-0.84-0.3-1.54-0.3c-0.57 0-1.1 0-1.59 0.2-0.49 0.1-0.94 0.3-1.36 0.5v-1.91c0.57-0.13 1.14-0.22 1.71-0.29 0.57-0.1 1.14-0.1 1.72-0.1 1.49 0 2.57 0.27 3.23 0.82 0.67 0.58 1 1.48 1 2.68z"/>
<path d="m13.2 7.91c0.8-0.68 2.1-0.44 2.7 0.34 1 1.19 1.2 2.75 1.6 4.15 0.3 1.2 0.4 2.4 0.5 3.6 0.8-1.5 1.7-3.2 1.7-4.9 0-0.9-0.5-1.69-0.9-2.47-0.3-0.66 0.6-1.34 1.3-1.13 0.8 0.16 0.9 1.1 0.9 1.78-0.1 2.02-0.9 3.92-1.7 5.82-1.2 2.4-2.9 4.6-5.1 6.3-0.9 0.6-3.1 1.4-4.1 1-2.05-1-2.05-3 0-3 0.7-0.3 2.5 1.3 3.2 1.2 1.2 0 2.1-1 2.4-2 0.4-1.3 0.1-2.7-0.1-4-0.4-1.7-0.8-3.4-1.6-4.95-0.2-0.59-1.6-0.95-0.8-1.74z"/>
</svg>
