{
  "name": "tezos-client",
  "reason": {
    "react-jsx": 3
  },
  "sources": [
    {
      "dir": "src",
      "subdirs": true
    },
    {
      "dir": "__tests__",
      "subdirs": true,
      "type": "dev"
    }
  ],
  "bsc-flags":
  ["-bs-super-errors", "-bs-no-version-header", "-open Belt"],
  "warnings": {
    "number": "-44-48-9-45",
  },
  "package-specs": [
    {
      "module": "commonjs",
      "in-source": true
    }
  ],
  "suffix": ".bs.js",
  "namespace": true,
  "ppx-flags": ["lenses-ppx/ppx"],
  "bs-dependencies": [
    "bs-fetch",
    "@glennsl/bs-json",
    "reason-react",
    "reason-react-native",
    "child-reprocess",
    "reason-react-update",
    "reason-future",
    "reason-test-framework",
    "bs-reform",
    "reschema",
    "@reason-react-native/svg",
  ],
  "refmt": 3
}
