<svg width="24" height="24" viewBox="0 0 24 24" fill="none" xmlns="http://www.w3.org/2000/svg">
<g id="curved / logout">
<path id="shape" d="M14 4.00006L17.5 4.00006C20.5577 4.00006 20.5 8.00006 20.5 12.0001C20.5 16.0001 20.5577 20.0001 17.5 20.0001H14M3 12.0001L15 12.0001M3 12.0001L7 8.00006M3 12.0001L7 16.0001" stroke="#444444" stroke-width="1.5" stroke-linecap="round" stroke-linejoin="round"/>
</g>
</svg>
