--f92a722--2020-09-30--matija.marinovic
39	37	src/views/Album.js

--bbf1144--2020-09-27--matija.marinovic
--fc3999c--2020-09-27--Matija Marinovic
0	2	README.md

--9b8d10a--2020-09-27--matija.marinovic
14425	0	package-lock.json
8	0	package.json
30	25	src/App.css
21	19	src/App.js
-	-	src/images/aboutus.jpg
-	-	src/images/background.jpg
-	-	src/images/login.jpg
-	-	src/images/logo.jpg
-	-	src/images/mycollection.jpg
-	-	src/images/paintings.jpg
-	-	src/images/photography.jpg
-	-	src/images/pocetna.jpg
-	-	src/images/pottery.jpg
-	-	src/images/sk1.jpg
-	-	src/images/sk2.jpg
-	-	src/images/sk3.jpg
-	-	src/images/sk4.webp
-	-	src/images/sk5.jpeg
1	0	src/index.css
21	0	src/index.js
0	7	src/logo.svg
26	0	src/utils/Clock.js
29	0	src/utils/Footer.js
112	0	src/utils/Header.js
144	0	src/views/Album.js
149	0	src/views/Category.js
187	0	src/views/Item.js
133	0	src/views/SignInSide.js
120	0	src/views/Store.js
17	0	src/views/UserStore.js

--a1c377a--2020-09-27--Matija Marinovic
2	0	README.md

--e3cf544--2020-09-20--matija.marinovic
23	0	.gitignore
68	0	README.md
34	0	package.json
-	-	public/favicon.ico
43	0	public/index.html
-	-	public/logo192.png
-	-	public/logo512.png
25	0	public/manifest.json
3	0	public/robots.txt
38	0	src/App.css
26	0	src/App.js
9	0	src/App.test.js
13	0	src/index.css
17	0	src/index.js
7	0	src/logo.svg
141	0	src/serviceWorker.js
5	0	src/setupTests.js
10849	0	yarn.lock
