<?xml version="1.0" encoding="UTF-8"?>
<svg width="40px" height="52px" viewBox="0 0 40 52" version="1.1" xmlns="http://www.w3.org/2000/svg" xmlns:xlink="http://www.w3.org/1999/xlink">
    <!-- Generator: Sketch 57.1 (83088) - https://sketch.com -->
    <title>Shape</title>
    <desc>Created with Sketch.</desc>
    <g id="UI-design" stroke="none" stroke-width="1" fill="none" fill-rule="evenodd">
        <g id="Locations" transform="translate(-708.000000, -1023.000000)" fill="#00ADBB" fill-rule="nonzero">
            <g id="Group-6" transform="translate(0.000000, 672.000000)">
                <g id="24px-pin-3" transform="translate(708.000000, 351.000000)">
                    <path d="M20,0 C10.2222222,0 0,7.55555556 0,20 C0,31.7777778 17.7777778,49.7777778 18.4444444,50.4444444 C18.8888889,50.8888889 19.3333333,51.1111111 20,51.1111111 C20.6666667,51.1111111 21.1111111,50.8888889 21.5555556,50.4444444 C22.2222222,49.7777778 40,31.7777778 40,20 C40,7.55555556 29.7777778,0 20,0 Z M20,26.6666667 C16.2222222,26.6666667 13.3333333,23.7777778 13.3333333,20 C13.3333333,16.2222222 16.2222222,13.3333333 20,13.3333333 C23.7777778,13.3333333 26.6666667,16.2222222 26.6666667,20 C26.6666667,23.7777778 23.7777778,26.6666667 20,26.6666667 Z" id="Shape"></path>
                </g>
            </g>
        </g>
    </g>
</svg>