<?xml version="1.0" encoding="UTF-8" standalone="no"?>
<!-- Created with Inkscape (http://www.inkscape.org/) -->

<svg
   width="78.706169mm"
   height="68.390549mm"
   viewBox="0 0 78.706169 68.390549"
   version="1.1"
   id="svg1"
   inkscape:version="1.3 (0e150ed6c4, 2023-07-21)"
   sodipodi:docname="pqGHTEvaluateCoarse.svg"
   xmlns:inkscape="http://www.inkscape.org/namespaces/inkscape"
   xmlns:sodipodi="http://sodipodi.sourceforge.net/DTD/sodipodi-0.dtd"
   xmlns="http://www.w3.org/2000/svg"
   xmlns:svg="http://www.w3.org/2000/svg">
  <sodipodi:namedview
     id="namedview1"
     pagecolor="#ffffff"
     bordercolor="#000000"
     borderopacity="0.25"
     inkscape:showpageshadow="2"
     inkscape:pageopacity="0.0"
     inkscape:pagecheckerboard="0"
     inkscape:deskcolor="#d1d1d1"
     inkscape:document-units="mm"
     inkscape:zoom="1.4677327"
     inkscape:cx="253.45214"
     inkscape:cy="246.29825"
     inkscape:window-width="1517"
     inkscape:window-height="1133"
     inkscape:window-x="10"
     inkscape:window-y="1495"
     inkscape:window-maximized="1"
     inkscape:current-layer="layer1" />
  <defs
     id="defs1">
    <marker
       style="overflow:visible"
       id="marker3"
       refX="0"
       refY="0"
       orient="auto-start-reverse"
       inkscape:stockid="Wide arrow"
       markerWidth="1"
       markerHeight="1"
       viewBox="0 0 1 1"
       inkscape:isstock="true"
       inkscape:collect="always"
       preserveAspectRatio="xMidYMid">
      <path
         style="fill:none;stroke:context-stroke;stroke-width:1;stroke-linecap:butt"
         d="M 3,-3 0,0 3,3"
         transform="rotate(180,0.125,0)"
         sodipodi:nodetypes="ccc"
         id="path3" />
    </marker>
    <marker
       style="overflow:visible"
       id="ArrowWide"
       refX="0"
       refY="0"
       orient="auto-start-reverse"
       inkscape:stockid="Wide arrow"
       markerWidth="1"
       markerHeight="1"
       viewBox="0 0 1 1"
       inkscape:isstock="true"
       inkscape:collect="always"
       preserveAspectRatio="xMidYMid">
      <path
         style="fill:none;stroke:context-stroke;stroke-width:1;stroke-linecap:butt"
         d="M 3,-3 0,0 3,3"
         transform="rotate(180,0.125,0)"
         sodipodi:nodetypes="ccc"
         id="path2" />
    </marker>
  </defs>
  <g
     inkscape:label="Layer 1"
     inkscape:groupmode="layer"
     id="layer1"
     transform="translate(-5.0570908,-4.7986722)">
    <rect
       style="fill:#ffffff;stroke:#000000;stroke-width:5.538;stroke-dasharray:none;stroke-dashoffset:8.52598"
       id="rect1"
       width="24.661545"
       height="24.661543"
       x="7.8260908"
       y="7.5676723"
       rx="0"
       ry="0" />
    <rect
       style="fill:#ffffff;stroke:#000000;stroke-width:5.538;stroke-dasharray:none;stroke-dashoffset:8.52598"
       id="rect1-6"
       width="24.661545"
       height="24.661543"
       x="56.332718"
       y="34.396545"
       rx="0"
       ry="0" />
    <path
       style="fill:#ffffff;stroke:#000000;stroke-width:3.338;stroke-dasharray:none;stroke-dashoffset:8.52598;marker-mid:url(#ArrowWide);marker-end:url(#marker3)"
       d="m 16.628805,39.852427 c 0,0 -3.880158,37.636999 29.613187,19.691813"
       id="path1" />
    <path
       style="fill:#ffffff;stroke:#000000;stroke-width:3.33801;stroke-dasharray:none;stroke-dashoffset:8.52598"
       d="M 19.986576,7.5812855 V 32.694398"
       id="path4" />
    <path
       style="fill:#ffffff;stroke:#000000;stroke-width:3.33801;stroke-dasharray:none;stroke-dashoffset:8.52598"
       d="M 7.4601853,19.828683 H 32.418927"
       id="path5" />
  </g>
</svg>
