<?xml version="1.0" encoding="UTF-8" standalone="no"?>
<svg
   id="Layer_1"
   data-name="Layer 1"
   viewBox="0 0 64 64"
   version="1.1"
   sodipodi:docname="pqYReflect.svg"
   inkscape:version="1.1 (c4e8f9ed74, 2021-05-24)"
   xmlns:inkscape="http://www.inkscape.org/namespaces/inkscape"
   xmlns:sodipodi="http://sodipodi.sourceforge.net/DTD/sodipodi-0.dtd"
   xmlns="http://www.w3.org/2000/svg"
   xmlns:svg="http://www.w3.org/2000/svg">
  <defs
     id="defs171" />
  <sodipodi:namedview
     id="namedview169"
     pagecolor="#ffffff"
     bordercolor="#999999"
     borderopacity="1"
     inkscape:pageshadow="0"
     inkscape:pageopacity="0"
     inkscape:pagecheckerboard="0"
     showgrid="true"
     inkscape:zoom="18.796875"
     inkscape:cx="31.813799"
     inkscape:cy="35.351621"
     inkscape:window-width="2558"
     inkscape:window-height="1418"
     inkscape:window-x="0"
     inkscape:window-y="20"
     inkscape:window-maximized="1"
     inkscape:current-layer="Layer_1">
    <inkscape:grid
       type="xygrid"
       id="grid17061" />
  </sodipodi:namedview>
  <path
     d="M 5.2799909,26.289 V 47.481 L 21.279991,36.897 Z"
     style="fill:#f3c017;stroke:#6f6f59;stroke-width:1.80288px;stroke-linecap:round;stroke-linejoin:round;fill-opacity:1"
     id="path150" />
  <path
     d="M 57.510009,47.481 V 26.289 l -16,10.592 z"
     style="fill:#f3c017;stroke:#6f6f59;stroke-width:1.80288px;stroke-linecap:round;stroke-linejoin:round;fill-opacity:1"
     id="path152" />
  <path
     d="M53.54,17.8l-.23,0-9.16-1.86a1.12,1.12,0,0,1-.85-.76,1.13,1.13,0,0,1,.25-1.11l1.94-1.94A25.63,25.63,0,0,0,13.3,15.45a2.16,2.16,0,0,1-1.52.63,2.16,2.16,0,0,1-1.53-3.68A30,30,0,0,1,48.59,9l2.3-2.29a1.09,1.09,0,0,1,.79-.33,1.24,1.24,0,0,1,.33,0,1.12,1.12,0,0,1,.78.86l1.85,9.17a1.11,1.11,0,0,1-.31,1A1.13,1.13,0,0,1,53.54,17.8Z"
     style="fill:#47b1d8"
     id="path164" />
  <path
     d="M31.46,4.73a28.66,28.66,0,0,1,17.25,5.75l3-3,1.86,9.17-9.17-1.86L47.24,12a26.75,26.75,0,0,0-34.73,2.7,1,1,0,0,1-1.46,0,1,1,0,0,1,0-1.45A28.69,28.69,0,0,1,31.46,4.73m0-2.25a30.93,30.93,0,0,0-22,9.12,3.28,3.28,0,0,0,4.64,4.65,24.46,24.46,0,0,1,29.58-3.93l-.9.9a2.27,2.27,0,0,0-.57,2.24A2.24,2.24,0,0,0,43.92,17l9.17,1.86a2.2,2.2,0,0,0,2-.61,2.27,2.27,0,0,0,.61-2L53.89,7.06a2.23,2.23,0,0,0-1.56-1.71,2.05,2.05,0,0,0-.65-.1,2.24,2.24,0,0,0-1.59.66L48.45,7.55a30.77,30.77,0,0,0-17-5.07Z"
     style="fill:#6f6f59"
     id="path166" />
  <line
     x1="31.315933"
     y1="27.994829"
     x2="31.315933"
     y2="23.519026"
     style="fill:none;stroke:#6f6f59;stroke-width:1.44453px;stroke-linecap:round;stroke-linejoin:round"
     id="line158" />
  <line
     x1="31.315933"
     y1="17.191866"
     x2="31.315933"
     y2="12.716062"
     style="fill:none;stroke:#6f6f59;stroke-width:1.44453px;stroke-linecap:round;stroke-linejoin:round"
     id="line160" />
  <line
     x1="31.312122"
     y1="49.684284"
     x2="31.312122"
     y2="45.208477"
     style="fill:none;stroke:#6f6f59;stroke-width:1.44453px;stroke-linecap:round;stroke-linejoin:round"
     id="line158-1" />
  <line
     x1="31.312122"
     y1="38.881317"
     x2="31.312122"
     y2="34.405514"
     style="fill:none;stroke:#6f6f59;stroke-width:1.44453px;stroke-linecap:round;stroke-linejoin:round"
     id="line160-1" />
  <line
     x1="31.312122"
     y1="60.487247"
     x2="31.312122"
     y2="56.01144"
     style="fill:none;stroke:#6f6f59;stroke-width:1.44453px;stroke-linecap:round;stroke-linejoin:round"
     id="line162-5" />
  <text
     xml:space="preserve"
     style="font-style:normal;font-weight:normal;font-size:43.2016px;line-height:1.25;font-family:sans-serif;letter-spacing:0px;word-spacing:0px;fill:#787878;fill-opacity:1;stroke:#6f6f59;stroke-width:1;stroke-opacity:1;stroke-miterlimit:4;stroke-dasharray:none"
     x="16.266642"
     y="54.306637"
     id="text5739"
     transform="scale(1.0572314,0.94586673)"><tspan
       sodipodi:role="line"
       id="tspan5737"
       x="16.266642"
       y="54.306637"
       style="fill:#787878;fill-opacity:1;stroke:#6f6f59;stroke-width:1;stroke-opacity:1;stroke-miterlimit:4;stroke-dasharray:none">Y</tspan></text>
</svg>
