<?xml version="1.0" encoding="UTF-8" standalone="no"?>
<svg
   id="Layer_1"
   data-name="Layer 1"
   viewBox="0 0 64 64"
   version="1.1"
   sodipodi:docname="pqCalculator.svg"
   inkscape:version="1.3 (0e150ed6c4, 2023-07-21)"
   xmlns:inkscape="http://www.inkscape.org/namespaces/inkscape"
   xmlns:sodipodi="http://sodipodi.sourceforge.net/DTD/sodipodi-0.dtd"
   xmlns:xlink="http://www.w3.org/1999/xlink"
   xmlns="http://www.w3.org/2000/svg"
   xmlns:svg="http://www.w3.org/2000/svg">
  <defs
     id="defs9">
    <radialGradient
       inkscape:collect="always"
       xlink:href="#linearGradient2795"
       id="radialGradient1480"
       gradientUnits="userSpaceOnUse"
       gradientTransform="matrix(0,-0.06076114,0.2670708,9.6012315e-8,1.2430541,48.936796)"
       cx="61.518883"
       cy="132.28575"
       fx="61.518883"
       fy="132.28575"
       r="29.036913" />
    <linearGradient
       id="linearGradient2795">
      <stop
         style="stop-color:#b8b8b8;stop-opacity:0.49803922;"
         offset="0"
         id="stop2797" />
      <stop
         style="stop-color:#7f7f7f;stop-opacity:0;"
         offset="1"
         id="stop2799" />
    </linearGradient>
    <linearGradient
       inkscape:collect="always"
       xlink:href="#linearGradient4671"
       id="linearGradient1475"
       gradientUnits="userSpaceOnUse"
       gradientTransform="matrix(0.17394501,0,0,0.17562435,20.819689,8.9882914)"
       x1="150.96111"
       y1="192.35176"
       x2="112.03144"
       y2="137.27299" />
    <linearGradient
       id="linearGradient4671">
      <stop
         style="stop-color:#ffd43b;stop-opacity:1;"
         offset="0"
         id="stop4673" />
      <stop
         style="stop-color:#ffe873;stop-opacity:1"
         offset="1"
         id="stop4675" />
    </linearGradient>
    <linearGradient
       inkscape:collect="always"
       xlink:href="#linearGradient4689"
       id="linearGradient1478"
       gradientUnits="userSpaceOnUse"
       gradientTransform="matrix(0.17394501,0,0,0.17562435,20.819689,8.9882914)"
       x1="26.648937"
       y1="20.603781"
       x2="135.66525"
       y2="114.39767" />
    <linearGradient
       id="linearGradient4689">
      <stop
         style="stop-color:#5a9fd4;stop-opacity:1;"
         offset="0"
         id="stop4691" />
      <stop
         style="stop-color:#306998;stop-opacity:1;"
         offset="1"
         id="stop4693" />
    </linearGradient>
  </defs>
  <sodipodi:namedview
     id="namedview9"
     pagecolor="#ffffff"
     bordercolor="#000000"
     borderopacity="0.25"
     inkscape:showpageshadow="2"
     inkscape:pageopacity="0.0"
     inkscape:pagecheckerboard="0"
     inkscape:deskcolor="#d1d1d1"
     showgrid="false"
     inkscape:zoom="7.0859375"
     inkscape:cx="23.920617"
     inkscape:cy="26.037486"
     inkscape:window-width="1920"
     inkscape:window-height="1155"
     inkscape:window-x="0"
     inkscape:window-y="1463"
     inkscape:window-maximized="0"
     inkscape:current-layer="Layer_1" />
  <title
     id="title1">SVG_Artboards</title>
  <rect
     x="3.83"
     y="10.72"
     width="56.34"
     height="43.6"
     rx="6.96"
     transform="translate(64.52 0.52) rotate(90)"
     style="fill:#cdcece;stroke:#787878;stroke-linecap:round;stroke-linejoin:round;stroke-width:2.2536px"
     id="rect1" />
  <circle
     cx="20.14"
     cy="30.21"
     r="3.78"
     style="fill:#6f6f59"
     id="circle1" />
  <circle
     cx="20.14"
     cy="41.52"
     r="3.78"
     style="fill:#6f6f59"
     id="circle4" />
  <circle
     cx="20.14"
     cy="52.84"
     r="3.78"
     style="fill:#6f6f59"
     id="circle7" />
  <circle
     cx="32"
     cy="52.84"
     r="3.78"
     style="fill:#6f6f59"
     id="circle8" />
  <circle
     cx="43.86"
     cy="52.84"
     r="3.78"
     style="fill:#6f6f59"
     id="circle9" />
  <rect
     x="26.21"
     y="-1.13"
     width="11.58"
     height="33.28"
     rx="3"
     transform="translate(47.51 -16.49) rotate(90)"
     style="fill:#d0e5f6;stroke:#787878;stroke-linecap:round;stroke-linejoin:round;stroke-width:2.2536px"
     id="rect9" />
  <path
     style="fill:url(#linearGradient1478);fill-opacity:1;stroke-width:0.309213"
     d="m 42.436742,12.607101 c -1.417325,0.0066 -2.770839,0.127463 -3.961791,0.338201 -3.508399,0.61982 -4.145388,1.917153 -4.145388,4.309657 v 3.15977 h 8.290774 v 1.053257 h -8.290774 -3.111456 c -2.40953,0 -4.519383,1.448266 -5.179319,4.203364 -0.761226,3.157983 -0.79499,5.128615 0,8.426056 0.589339,2.454486 1.996757,4.203363 4.406286,4.203365 h 2.850558 V 34.51291 c 0,-2.736504 2.367689,-5.150329 5.179319,-5.150329 h 8.28111 c 2.305169,0 4.145388,-1.898 4.145387,-4.213027 v -7.894595 c 0,-2.246847 -1.895469,-3.934667 -4.145387,-4.309657 -1.424231,-0.23708 -2.901993,-0.344787 -4.319319,-0.338201 z m -4.483589,2.541343 c 0.856381,0 1.555729,0.710772 1.555729,1.584718 -10e-7,0.870847 -0.699348,1.575054 -1.555729,1.575054 -0.85945,-1e-6 -1.555728,-0.704207 -1.555728,-1.575054 0,-0.873945 0.696278,-1.584718 1.555728,-1.584718 z"
     id="path1948" />
  <path
     style="fill:url(#linearGradient1475);fill-opacity:1;stroke-width:0.309213"
     d="m 51.935379,21.467986 v 3.681568 c 0,2.85427 -2.419868,5.256621 -5.179318,5.256621 h -8.28111 c -2.268336,0 -4.145388,1.941389 -4.145388,4.213027 v 7.894595 c 0,2.246848 1.95379,3.568419 4.145388,4.213029 2.624392,0.771674 5.141048,0.911135 8.28111,0 2.087236,-0.604323 4.145388,-1.820526 4.145387,-4.213029 v -3.15977 h -8.281111 v -1.053256 h 8.281111 4.145389 c 2.40953,0 3.30742,-1.6807 4.145384,-4.203365 0.86559,-2.597046 0.828759,-5.094524 0,-8.426056 -0.595476,-2.398701 -1.732789,-4.203364 -4.145384,-4.203364 z m -4.657521,19.992555 c 0.859451,0 1.555728,0.704207 1.555728,1.575053 0,0.873945 -0.696278,1.584717 -1.555728,1.584717 -0.856381,0 -1.555728,-0.710772 -1.555728,-1.584717 2e-6,-0.870846 0.699347,-1.575053 1.555728,-1.575053 z"
     id="path1950" />
  <ellipse
     style="opacity:0.44382;fill:url(#radialGradient1480);fill-opacity:1;fill-rule:nonzero;stroke:none;stroke-width:3.90411;stroke-miterlimit:4;stroke-dasharray:none;stroke-opacity:1"
     id="path1894"
     cx="36.57272"
     cy="45.19886"
     rx="9.0987062"
     ry="1.7643141" />
</svg>
