Numéro;Campagne;Type;Désignation;Date;Montant;Code Promo;Statut;Moyen de paiement;Attestation;Reçu;Don anonyme;Nom;Prénom;Société;Adresse;Code Postal;Ville;Pays;Email;Date de naissance;Commentaire;Numéro de reçu;Nom acheteur;Prénom acheteur;Adresse acheteur;Code Postal acheteur;Ville acheteur;Pays acheteur
53;Association N.A.T.U.R.E.S des Pradettes;Adhésion;Adhérent.e membre actif ;09/06/2021 09:39;20;;Validé;Carte bancaire;https://www.helloasso.com/associations/natures/adhesions/adhesion-association-n-a-t-u-r-e-s-des-pradettes/paiement-attestation/23484034;;Non;Cousy;Mathieu;;;;;;mathieu.cousy@gmail.com;02/03/1981;;;Cousy;Mathieu;;;;FRA
52;Association N.A.T.U.R.E.S des Pradettes;Adhésion;Adhérent.e membre actif ;01/06/2021 14:22;5;;Validé;Carte bancaire;https://www.helloasso.com/associations/natures/adhesions/adhesion-association-n-a-t-u-r-e-s-des-pradettes/paiement-attestation/23174337;;Non;orsoni;marine;;;;;;marine.orsoni@laposte.net;29/10/1976;;;Marine;Orsoni;;;;FRA
51;Association N.A.T.U.R.E.S des Pradettes;Adhésion;Adhérent.e membre actif ;22/03/2021 11:55;8;;Validé;Carte bancaire;https://www.helloasso.com/associations/natures/adhesions/adhesion-association-n-a-t-u-r-e-s-des-pradettes/paiement-attestation/21220143;;Non;Annie;BOUTLELIS;;;;;;aboutrey@hotmail.fr;20/01/1959;;;BOUTLELIS;annie;;;;FRA
50;Association N.A.T.U.R.E.S des Pradettes;Adhésion;Adhérent.e membre actif ;02/03/2021 11:53;10;;Validé;Carte bancaire;https://www.helloasso.com/associations/natures/adhesions/adhesion-association-n-a-t-u-r-e-s-des-pradettes/paiement-attestation/20756556;;Non;Dezzou-Mercier;sophie;;;;;;sophie.merciersc@gmail.com;20/11/2020;;;Dezzou-Mercier;sophie;;;;FRA
49;Association N.A.T.U.R.E.S des Pradettes;Adhésion;Adhérent.e membre actif ;26/02/2021 17:23;15;;Validé;Carte bancaire;https://www.helloasso.com/associations/natures/adhesions/adhesion-association-n-a-t-u-r-e-s-des-pradettes/paiement-attestation/20670754;;Non;rebourcier;jacques;;;;;;jacques.Rebourcier@free.fr;22/01/1972;;;rebourcier;jacques;;;;FRA
48;Association N.A.T.U.R.E.S des Pradettes;Adhésion;Adhérent.e membre actif ;25/02/2021 10:25;10;;Validé;Carte bancaire;https://www.helloasso.com/associations/natures/adhesions/adhesion-association-n-a-t-u-r-e-s-des-pradettes/paiement-attestation/20639294;;Non;Bonnet;Alain;;;;;;alainbonnet3131@gmail.com;06/12/1958;;;Bonnet;Alain;;;;FRA
47;Association N.A.T.U.R.E.S des Pradettes;Adhésion;Adhérent.e membre actif ;17/02/2021 10:56;5;;Validé;Carte bancaire;https://www.helloasso.com/associations/natures/adhesions/adhesion-association-n-a-t-u-r-e-s-des-pradettes/paiement-attestation/20474524;;Non;garcia;marie;;;;;;maritougarcia@laposte.net;17/11/1981;;;garcia;marie;;;;FRA
46;Association N.A.T.U.R.E.S des Pradettes;Adhésion;Adhérent.e membre actif ;16/02/2021 18:57;10;;Validé;Carte bancaire;https://www.helloasso.com/associations/natures/adhesions/adhesion-association-n-a-t-u-r-e-s-des-pradettes/paiement-attestation/20462983;;Non;VALOT;Jamyl;;;;;;jamylvalot@yahoo.fr;31/03/1981;;;valot;jamyl;;;;FRA
45;Association N.A.T.U.R.E.S des Pradettes;Adhésion;Adhérent.e membre actif ;12/02/2021 18:06;5;;Validé;Carte bancaire;https://www.helloasso.com/associations/natures/adhesions/adhesion-association-n-a-t-u-r-e-s-des-pradettes/paiement-attestation/20374729;;Non;gaillochet;josy;;;;;;josy.gaillochet@orange.fr;18/02/1956;;;gaillochet;josy;;;;FRA
44;Association N.A.T.U.R.E.S des Pradettes;Adhésion;Adhérent.e membre actif ;11/02/2021 10:18;5;;Validé;Carte bancaire;https://www.helloasso.com/associations/natures/adhesions/adhesion-association-n-a-t-u-r-e-s-des-pradettes/paiement-attestation/20340753;;Non;FENON;Raphaël;;;;;;fenon.raphael@wanadoo.fr;11/11/1957;;;FENON;Raphaël;;;;FRA
43;Association N.A.T.U.R.E.S des Pradettes;Adhésion;Adhérent.e membre actif ;10/02/2021 14:19;30;;Validé;Carte bancaire;https://www.helloasso.com/associations/natures/adhesions/adhesion-association-n-a-t-u-r-e-s-des-pradettes/paiement-attestation/20321921;;Non;Pratlong;Marie-Thérèse;;;;;;mth.pratlong@orange.fr;28/03/1949;;;Pratlong;Marie-Thérèse;;;;FRA
42;Association N.A.T.U.R.E.S des Pradettes;Adhésion;Adhérent.e membre actif ;09/02/2021 22:58;5;;Validé;Carte bancaire;https://www.helloasso.com/associations/natures/adhesions/adhesion-association-n-a-t-u-r-e-s-des-pradettes/paiement-attestation/20311452;;Non;Pierre;ROYNARD;;;;;;pierreroynard@orange.fr;07/05/1953;;;ROYNARD;Pierre;;;;FRA
41;Association N.A.T.U.R.E.S des Pradettes;Adhésion;Adhérent.e membre actif ;09/02/2021 20:25;5;;Validé;Carte bancaire;https://www.helloasso.com/associations/natures/adhesions/adhesion-association-n-a-t-u-r-e-s-des-pradettes/paiement-attestation/20308066;;Non;Fabre;David;;;;;;erbafdavid@gmail.com;;;;Fabre;David;;;;FRA
40;Association N.A.T.U.R.E.S des Pradettes;Adhésion;Adhérent.e membre actif ;09/02/2021 19:50;5;;Validé;Carte bancaire;https://www.helloasso.com/associations/natures/adhesions/adhesion-association-n-a-t-u-r-e-s-des-pradettes/paiement-attestation/20307082;;Non;BELDJOUDI;Malik;;;;;;malik.beldjoudi@laposte.net;11/02/1972;;;BELDJOUDI;malik;;;;FRA
39;Association N.A.T.U.R.E.S des Pradettes;Adhésion;Adhérent.e membre actif ;09/02/2021 06:08;5;;Validé;Carte bancaire;https://www.helloasso.com/associations/natures/adhesions/adhesion-association-n-a-t-u-r-e-s-des-pradettes/paiement-attestation/20286739;;Non;taillemite;martine;;;;;;titine8239@gmail.com;03/10/1960;;;taillemite;martine;;;;FRA
38;Association N.A.T.U.R.E.S des Pradettes;Adhésion;Adhérent.e membre actif ;07/02/2021 18:11;5;;Validé;Carte bancaire;https://www.helloasso.com/associations/natures/adhesions/adhesion-association-n-a-t-u-r-e-s-des-pradettes/paiement-attestation/20249393;;Non;Valdelvira;Míriam;;;;;;miriam.valdelvira@gmail.com;19/03/1984;;;Valdelvira;Míriam;;;;FRA
37;Association N.A.T.U.R.E.S des Pradettes;Adhésion;Adhérent.e membre actif ;07/02/2021 18:05;5;;Validé;Carte bancaire;https://www.helloasso.com/associations/natures/adhesions/adhesion-association-n-a-t-u-r-e-s-des-pradettes/paiement-attestation/20249226;;Non;Vidal;Josep;;;;;;josepvidal.a@gmail.com;01/02/1979;;;Vidal;Josep;;;;FRA
36;Association N.A.T.U.R.E.S des Pradettes;Adhésion;Adhérent.e membre actif ;28/01/2021 16:54;5;;Validé;Carte bancaire;https://www.helloasso.com/associations/natures/adhesions/adhesion-association-n-a-t-u-r-e-s-des-pradettes/paiement-attestation/20006450;;Non;Py;Julien;;;;;;julien.py@free.fr;06/04/1979;;;Py;Julien;;;;FRA
35;Association N.A.T.U.R.E.S des Pradettes;Adhésion;Adhérent.e membre actif ;25/01/2021 16:46;5;;Validé;Carte bancaire;https://www.helloasso.com/associations/natures/adhesions/adhesion-association-n-a-t-u-r-e-s-des-pradettes/paiement-attestation/19934256;;Non;Descous;Julien;;;;;;julien.descous@outlook.com;05/05/1980;;;Descous;Julien;;;;FRA
34;Association N.A.T.U.R.E.S des Pradettes;Adhésion;Adhérent.e membre actif ;24/01/2021 16:58;5;;Validé;Carte bancaire;https://www.helloasso.com/associations/natures/adhesions/adhesion-association-n-a-t-u-r-e-s-des-pradettes/paiement-attestation/19911449;;Non;BACHELOT;Aude;;;;;;abachelot@orange.fr;01/01/1970;;;Bachelot;Aude;30 rue antoine bayès;31100;Toulouse;FRA
33;Association N.A.T.U.R.E.S des Pradettes;Adhésion;Adhérent.e membre actif ;22/01/2021 18:44;10;;Validé;Carte bancaire;https://www.helloasso.com/associations/natures/adhesions/adhesion-association-n-a-t-u-r-e-s-des-pradettes/paiement-attestation/19880111;;Non;LEBAILLY;PHILIPPE;;;;;;lebaillytoulouse@orange.fr;03/09/1959;;;LEBAILLY;Philippe;;;;FRA
32;Association N.A.T.U.R.E.S des Pradettes;Adhésion;Adhérent.e membre actif ;22/01/2021 15:23;5;;Validé;Carte bancaire;https://www.helloasso.com/associations/natures/adhesions/adhesion-association-n-a-t-u-r-e-s-des-pradettes/paiement-attestation/19875579;;Non;desvaux;romain;;;;;;romdev@hotmail.fr;11/01/1984;;;desvaux;romain;;;;FRA
31;Association N.A.T.U.R.E.S des Pradettes;Adhésion;Adhérent.e membre actif ;19/01/2021 18:28;10;;Validé;Carte bancaire;https://www.helloasso.com/associations/natures/adhesions/adhesion-association-n-a-t-u-r-e-s-des-pradettes/paiement-attestation/19812427;;Non;Généreux;Elisabel;;;;;;elisabel.genereux@gmail.com;29/05/1986;;;Généreux;Elisabel;1 impasse François Lucas;31100;Toulouse/France;FRA
30;Association N.A.T.U.R.E.S des Pradettes;Adhésion;Adhérent.e membre actif ;18/01/2021 09:17;5;;Validé;Carte bancaire;https://www.helloasso.com/associations/natures/adhesions/adhesion-association-n-a-t-u-r-e-s-des-pradettes/paiement-attestation/19773644;;Non;LARICQ;Philippe;;;;;;philippe.laricq@wanadoo.fr;16/05/1961;;;LARICQ;Philippe;;;;FRA
29;Association N.A.T.U.R.E.S des Pradettes;Adhésion;Adhérent.e membre soutien;16/01/2021 18:29;5;;Validé;Carte bancaire;https://www.helloasso.com/associations/natures/adhesions/adhesion-association-n-a-t-u-r-e-s-des-pradettes/paiement-attestation/19745746;;Non;GERARD;Nicolas;;;;;;skyplane123@gmail.com;16/01/1987;;;GERARD;Nicolas;;;;FRA
28;Association N.A.T.U.R.E.S des Pradettes;Adhésion;Adhérent.e membre actif ;20/12/2020 21:06;5;;Validé;Carte bancaire;https://www.helloasso.com/associations/natures/adhesions/adhesion-association-n-a-t-u-r-e-s-des-pradettes/paiement-attestation/19145445;;Non;Chaillou;Clémence;;;;;;clem.chaillou@gmail.com;17/01/1990;;;Chaillou;Clémence;114 boulevard Déodat de Severac;31300;Toulouse;FRA
27;Association N.A.T.U.R.E.S des Pradettes;Adhésion;Adhérent.e membre actif ;20/12/2020 20:55;5;;Validé;Carte bancaire;https://www.helloasso.com/associations/natures/adhesions/adhesion-association-n-a-t-u-r-e-s-des-pradettes/paiement-attestation/19145126;;Non;Brehin;Laurent;;;;;;laubrehin@gmail.com;18/03/1981;;;Brehin;Laurent;;;;FRA
26;Association N.A.T.U.R.E.S des Pradettes;Adhésion;Adhérent.e membre soutien;21/11/2020 21:46;5;;Validé;Carte bancaire;https://www.helloasso.com/associations/natures/adhesions/adhesion-association-n-a-t-u-r-e-s-des-pradettes/paiement-attestation/18311669;;Non;Monchoux;Agathe;;;;;;agathe.monchoux@gmail.com;11/12/1980;;;Monchoux;Agathe;;;;FRA
25;Association N.A.T.U.R.E.S des Pradettes;Adhésion;Adhérent.e membre soutien;04/11/2020 09:31;5;;Validé;Carte bancaire;https://www.helloasso.com/associations/natures/adhesions/adhesion-association-n-a-t-u-r-e-s-des-pradettes/paiement-attestation/17895402;;Non;EXPOSITO;Marion;;;;;;romainflourens@gmail.com;23/03/1984;;;FLOURENS;Romain;;;;FRA
24;Association N.A.T.U.R.E.S des Pradettes;Adhésion;Adhérent.e membre actif ;04/11/2020 09:31;5;;Validé;Carte bancaire;https://www.helloasso.com/associations/natures/adhesions/adhesion-association-n-a-t-u-r-e-s-des-pradettes/paiement-attestation/17895402;;Non;FLOURENS;Romain;;;;;;romainflourens@gmail.com;23/03/1984;;;FLOURENS;Romain;;;;FRA
23;Association N.A.T.U.R.E.S des Pradettes;Adhésion;Adhérent.e membre soutien;31/10/2020 15:49;10;;Validé;Carte bancaire;https://www.helloasso.com/associations/natures/adhesions/adhesion-association-n-a-t-u-r-e-s-des-pradettes/paiement-attestation/17826748;;Non;RODRIGUES;Isabelle;;;;;;rodrigues.7isabelle@gmail.com;30/10/1969;;;RODRIGUES;Isabelle;;;;FRA
22;Association N.A.T.U.R.E.S des Pradettes;Adhésion;Adhérent.e membre soutien;27/10/2020 22:07;5;;Validé;Carte bancaire;https://www.helloasso.com/associations/natures/adhesions/adhesion-association-n-a-t-u-r-e-s-des-pradettes/paiement-attestation/17781059;;Non;Chevalier;Caroline;;;;;;krochevalier@hotmail.fr;23/07/1976;;;Chevalier;Caroline;;;;FRA
21;Association N.A.T.U.R.E.S des Pradettes;Adhésion;Adhérent.e membre soutien;26/10/2020 16:00;5;;Validé;Carte bancaire;https://www.helloasso.com/associations/natures/adhesions/adhesion-association-n-a-t-u-r-e-s-des-pradettes/paiement-attestation/17755268;;Non;aguilera;anne;;;;;;aguilera@laposte.net;07/06/1965;;;aguilera;anne;;;;FRA
20;Association N.A.T.U.R.E.S des Pradettes;Adhésion;Adhérent.e membre actif ;26/10/2020 16:00;5;;Validé;Carte bancaire;https://www.helloasso.com/associations/natures/adhesions/adhesion-association-n-a-t-u-r-e-s-des-pradettes/paiement-attestation/17755268;;Non;aguilera;anne;;;;;;aguilera@laposte.net;07/06/1965;;;aguilera;anne;;;;FRA
19;Association N.A.T.U.R.E.S des Pradettes;Adhésion;Adhérent.e membre soutien;26/10/2020 13:08;5;;Validé;Carte bancaire;https://www.helloasso.com/associations/natures/adhesions/adhesion-association-n-a-t-u-r-e-s-des-pradettes/paiement-attestation/17751947;;Non;Benchaa;Abdelkader;;;;;;abdelben381@gmail.com;03/07/1955;;;Benchaa;Abdelkader;;;;FRA
18;Association N.A.T.U.R.E.S des Pradettes;Adhésion;Adhérent.e membre actif ;25/10/2020 20:09;5;;Validé;Carte bancaire;https://www.helloasso.com/associations/natures/adhesions/adhesion-association-n-a-t-u-r-e-s-des-pradettes/paiement-attestation/17742708;;Non;Lallemand ;Frédéric ;;;;;;frederic.lallemand@laposte.net;20/12/1972;;;Lallemand;Frédéric;;;;FRA
17;Association N.A.T.U.R.E.S des Pradettes;Adhésion;Adhérent.e membre soutien;21/10/2020 22:24;10;;Validé;Carte bancaire;https://www.helloasso.com/associations/natures/adhesions/adhesion-association-n-a-t-u-r-e-s-des-pradettes/paiement-attestation/17675783;;Non;Gabriel-Robez;VÉRONIQUE;;;;;;jean.gabriel2@wanadoo.fr;10/07/1956;;;Gabriel-Robez;VÉRONIQUE;;;;FRA
16;Association N.A.T.U.R.E.S des Pradettes;Adhésion;Adhérent.e membre actif ;21/10/2020 18:26;5;;Validé;Carte bancaire;https://www.helloasso.com/associations/natures/adhesions/adhesion-association-n-a-t-u-r-e-s-des-pradettes/paiement-attestation/17669938;;Non;taillemite;martine;;;;;;titine8239@gmail.com;03/10/1960;;;taillemite;martine;;;;FRA
15;Association N.A.T.U.R.E.S des Pradettes;Adhésion;Adhérent.e membre soutien;19/10/2020 14:35;20;;Validé;Carte bancaire;https://www.helloasso.com/associations/natures/adhesions/adhesion-association-n-a-t-u-r-e-s-des-pradettes/paiement-attestation/17615447;;Non;CITTOLEUX ;Dominique ;;;;;;d.cittoleux@gmail.com;15/01/1951;;;CITTOLEUX;Dominique;;;;FRA
14;Association N.A.T.U.R.E.S des Pradettes;Adhésion;Adhérent.e membre actif ;19/10/2020 14:17;5;;Validé;Carte bancaire;https://www.helloasso.com/associations/natures/adhesions/adhesion-association-n-a-t-u-r-e-s-des-pradettes/paiement-attestation/17615057;;Non;Pointet;Aurore ;;;;;;aurorepointet@gmail.com;16/12/1986;;;Pointet;Aurore;;;;FRA
13;Association N.A.T.U.R.E.S des Pradettes;Adhésion;Adhérent.e membre actif ;19/10/2020 14:15;5;;Validé;Carte bancaire;https://www.helloasso.com/associations/natures/adhesions/adhesion-association-n-a-t-u-r-e-s-des-pradettes/paiement-attestation/17614982;;Non;PERARNAUD;DIDIER;;;;;;d.perarnaud@gmail.com;10/06/1955;;;Perarnaud;Didier;5 rue du Comte Begouen;31100;Toulouse;FRA
12;Association N.A.T.U.R.E.S des Pradettes;Adhésion;Adhérent.e membre soutien;19/10/2020 13:44;5;;Validé;Carte bancaire;https://www.helloasso.com/associations/natures/adhesions/adhesion-association-n-a-t-u-r-e-s-des-pradettes/paiement-attestation/17614173;;Non;ROLLIN;Josiane;;;;;;josianerollin7@gmail.com;05/04/1957;;;Rollin;Josiane;;;;FRA
11;Association N.A.T.U.R.E.S des Pradettes;Adhésion;Adhérent.e membre soutien;19/10/2020 08:39;20;;Validé;Carte bancaire;https://www.helloasso.com/associations/natures/adhesions/adhesion-association-n-a-t-u-r-e-s-des-pradettes/paiement-attestation/17606654;;Non;kerboul;Florence;;;;;;florence.kerboul.fk@gmail.com;01/01/1970;;;Kerboul;Florence;;;;FRA
10;Association N.A.T.U.R.E.S des Pradettes;Adhésion;Adhérent.e membre soutien;19/10/2020 07:11;20;;Validé;Carte bancaire;https://www.helloasso.com/associations/natures/adhesions/adhesion-association-n-a-t-u-r-e-s-des-pradettes/paiement-attestation/17605995;;Non;Boulay;Charlotte;;;;;;charlotte.boulay33@gmail.com;18/02/1994;;;Boulay;Charlotte;;;;FRA
9;Association N.A.T.U.R.E.S des Pradettes;Adhésion;Adhérent.e membre actif ;19/10/2020 06:39;20;;Validé;Carte bancaire;https://www.helloasso.com/associations/natures/adhesions/adhesion-association-n-a-t-u-r-e-s-des-pradettes/paiement-attestation/17605937;;Non;DUMAZEAU;Andre;;;;;;andre.dumazeau@orange.fr;05/10/1948;;;DUMAZEAU;Andre;9, impasse St Martory;31100;TOULOUSE;FRA
8;Association N.A.T.U.R.E.S des Pradettes;Adhésion;Adhérent.e membre soutien;19/10/2020 00:06;30;;Validé;Carte bancaire;https://www.helloasso.com/associations/natures/adhesions/adhesion-association-n-a-t-u-r-e-s-des-pradettes/paiement-attestation/17605490;;Non;Mourgues;Caroline;;;;;;mourgues.caroline@gmail.com;10/08/1968;;;Mourgues;Caroline;68 rue Jean Gayral;31200;Toulouse;FRA
7;Association N.A.T.U.R.E.S des Pradettes;Adhésion;Adhérent.e membre soutien;18/10/2020 18:40;10;;Validé;Carte bancaire;https://www.helloasso.com/associations/natures/adhesions/adhesion-association-n-a-t-u-r-e-s-des-pradettes/paiement-attestation/17599575;;Non; Buisson;Lucien;;;;;;lucien.buisson2@orange.fr;06/06/1943;;;Buisson;Lucien;;;;FRA
6;Association N.A.T.U.R.E.S des Pradettes;Adhésion;Adhérent.e membre soutien;18/10/2020 13:57;5;;Validé;Carte bancaire;https://www.helloasso.com/associations/natures/adhesions/adhesion-association-n-a-t-u-r-e-s-des-pradettes/paiement-attestation/17594867;;Non;Vassallo;Gaït;;;;;;marguerite.vassallo@gmail.com;12/04/1987;;;Vassallo;Gaït;;;;FRA
5;Association N.A.T.U.R.E.S des Pradettes;Adhésion;Adhérent.e membre actif ;18/10/2020 13:57;5;;Validé;Carte bancaire;https://www.helloasso.com/associations/natures/adhesions/adhesion-association-n-a-t-u-r-e-s-des-pradettes/paiement-attestation/17594867;;Non;Vassallo;Gaït;;;;;;marguerite.vassallo@gmail.com;12/04/1987;;;Vassallo;Gaït;;;;FRA
4;Association N.A.T.U.R.E.S des Pradettes;Adhésion;Adhérent.e membre actif ;18/10/2020 12:28;5;;Validé;Carte bancaire;https://www.helloasso.com/associations/natures/adhesions/adhesion-association-n-a-t-u-r-e-s-des-pradettes/paiement-attestation/17593504;;Non;CAIN;Philippe;;;;;;philippe.cain@orange.fr;;;;CAIN;Philippe;;;;FRA
3;Association N.A.T.U.R.E.S des Pradettes;Adhésion;membre actif;17/10/2020 18:17;5;;Validé;Carte bancaire;https://www.helloasso.com/associations/natures/adhesions/adhesion-association-n-a-t-u-r-e-s-des-pradettes/paiement-attestation/17583985;;Non;SOUMET;Michel;;;;;;michel.soumet@orange.fr;27/05/1953;;;SOUMET;Michel;;;;FRA
2;Association N.A.T.U.R.E.S des Pradettes;Adhésion;membre de soutien;17/10/2020 15:02;5;;Validé;Carte bancaire;https://www.helloasso.com/associations/natures/adhesions/adhesion-association-n-a-t-u-r-e-s-des-pradettes/paiement-attestation/17580135;;Non;Gavaud ;Florence ;;;;;;gavaudflorence@gmail.com;30/07/1996;;;Gavaud;Florence;;;;FRA
1;ADHESION 2020-2021 Association NATURES Pradettes;Adhésion;membre actif;15/10/2020 17:04;5;;Validé;Carte bancaire;https://www.helloasso.com/associations/natures/adhesions/adhesion-2020-2021-association-natures-pradettes-1/paiement-attestation/17534500;;Non;Cain;Philippe;;;;;;cain.philippe@orange.fr;30/09/1958;;;Cain;Philippe;;;;FRA
