[
 {
   "proprietaire": "Air Canada",
   "avions": 130,
   "vols": 14073
 },
 {
   "proprietaire": "Jazz Aviation Lp",
   "avions": 66,
   "vols": 10816
 },
 {
   "proprietaire": "Sky Regional Airlines Inc.",
   "avions": 25,
   "vols": 6459
 },
 {
   "proprietaire": "Porter Airlines Inc.",
   "avions": 29,
   "vols": 4443
 },
 {
   "proprietaire": "Air Canada Rouge Lp",
   "avions": 24,
   "vols": 3524
 },
 {
   "proprietaire": "Westjet Encore Ltd.",
   "avions": 44,
   "vols": 2450
 },
 {
   "proprietaire": "American Airlines Inc",
   "avions": 222,
   "vols": 2323
 },
 {
   "proprietaire": "Delta Air Lines",
   "avions": 146,
   "vols": 2108
 },
 {
   "proprietaire": "Republic Airways Inc",
   "avions": 106,
   "vols": 1669
 },
 {
   "proprietaire": "Air Transat A T Inc.",
   "avions": 11,
   "vols": 1294
 },
 {
   "proprietaire": "Wells Fargo Trust Co Na Trustee",
   "avions": 86,
   "vols": 1087
 },
 {
   "proprietaire": "Cargojet Airways Ltd.",
   "avions": 19,
   "vols": 1074
 },
 {
   "proprietaire": "Air France",
   "avions": 58,
   "vols": 1053
 },
 {
   "proprietaire": "Westjet",
   "avions": 84,
   "vols": 932
 },
 {
   "proprietaire": "Air Georgian Limited",
   "avions": 13,
   "vols": 802
 },
 {
   "proprietaire": "Bank Of Utah Trustee",
   "avions": 78,
   "vols": 703
 },
 {
   "proprietaire": "United Express",
   "avions": 22,
   "vols": 563
 },
 {
   "proprietaire": "Skywest Airlines Inc",
   "avions": 137,
   "vols": 560
 },
 {
   "proprietaire": "Federal Express Corporation",
   "avions": 78,
   "vols": 550
 },
 {
   "proprietaire": "Lufthansa",
   "avions": 48,
   "vols": 527
 },
 {
   "proprietaire": "Skyservice Business Aviation Inc.",
   "avions": 19,
   "vols": 521
 },
 {
   "proprietaire": "Airsprint Inc.",
   "avions": 12,
   "vols": 489
 },
 {
   "proprietaire": "United Parcel Service Co",
   "avions": 51,
   "vols": 454
 },
 {
   "proprietaire": "Air Wisconsin Airlines Llc",
   "avions": 38,
   "vols": 452
 },
 {
   "proprietaire": "Fox Flight Inc.",
   "avions": 1,
   "vols": 436
 },
 {
   "proprietaire": "Sunwing Airlines Inc.",
   "avions": 13,
   "vols": 420
 },
 {
   "proprietaire": "Umb Bank N A Trustee",
   "avions": 30,
   "vols": 420
 },
 {
   "proprietaire": "Swiss International Air Lines Ltd.",
   "avions": 14,
   "vols": 416
 },
 {
   "proprietaire": "Northern Air Charter (p. R.) Inc.",
   "avions": 1,
   "vols": 413
 },
 {
   "proprietaire": "U S Bank National Association Trustee",
   "avions": 45,
   "vols": 393
 },
 {
   "proprietaire": "Netjets Sales Inc",
   "avions": 141,
   "vols": 384
 },
 {
   "proprietaire": "Chrono Aviation Inc.",
   "avions": 7,
   "vols": 371
 },
 {
   "proprietaire": "Qatar Airways",
   "avions": 28,
   "vols": 357
 },
 {
   "proprietaire": "Air Inuit Ltd. Air Inuit Ltee",
   "avions": 14,
   "vols": 355
 },
 {
   "proprietaire": "Morningstar Air Express Inc.",
   "avions": 10,
   "vols": 348
 },
 {
   "proprietaire": "American Eagle",
   "avions": 25,
   "vols": 328
 },
 {
   "proprietaire": "KLM Royal Dutch Airlines",
   "avions": 10,
   "vols": 324
 },
 {
   "proprietaire": "British Airways",
   "avions": 22,
   "vols": 319
 },
 {
   "proprietaire": "PAL Airlines Ltd.",
   "avions": 10,
   "vols": 312
 },
 {
   "proprietaire": "Delta Connection",
   "avions": 21,
   "vols": 293
 },
 {
   "proprietaire": "Flightexec",
   "avions": 3,
   "vols": 279
 },
 {
   "proprietaire": "Austrian",
   "avions": 3,
   "vols": 277
 },
 {
   "proprietaire": "Government Of Canada, Department Of Transport",
   "avions": 18,
   "vols": 276
 },
 {
   "proprietaire": "Air Algerie",
   "avions": 7,
   "vols": 273
 },
 {
   "proprietaire": "United Airlines Inc",
   "avions": 12,
   "vols": 272
 },
 {
   "proprietaire": "Royal Air Maroc",
   "avions": 4,
   "vols": 262
 },
 {
   "proprietaire": "Glencore Canada Corporation",
   "avions": 2,
   "vols": 237
 },
 {
   "proprietaire": "Hydro-Québec",
   "avions": 2,
   "vols": 233
 },
 {
   "proprietaire": "Royal Jordanian Airlines",
   "avions": 7,
   "vols": 227
 },
 {
   "proprietaire": "Flexjet Llc",
   "avions": 50,
   "vols": 181
 },
 {
   "proprietaire": "Les Investissements Nolinor Inc.",
   "avions": 7,
   "vols": 174
 },
 {
   "proprietaire": "Kalitta Charters LLC",
   "avions": 15,
   "vols": 166
 },
 {
   "proprietaire": "Summit Air",
   "avions": 1,
   "vols": 160
 },
 {
   "proprietaire": "Copa Airlines",
   "avions": 41,
   "vols": 159
 },
 {
   "proprietaire": "Sunwing Airlines",
   "avions": 1,
   "vols": 148
 },
 {
   "proprietaire": "Corsair International",
   "avions": 4,
   "vols": 143
 },
 {
   "proprietaire": "Pratt & Whitney Canada Corp.",
   "avions": 4,
   "vols": 134
 },
 {
   "proprietaire": "Bcc Equipment Leasing Corp",
   "avions": 8,
   "vols": 134
 },
 {
   "proprietaire": "Air Bravo Corp.",
   "avions": 4,
   "vols": 130
 },
 {
   "proprietaire": "Turkish Airlines",
   "avions": 24,
   "vols": 128
 },
 {
   "proprietaire": "Chartright Air Inc.",
   "avions": 17,
   "vols": 125
 },
 {
   "proprietaire": "Aviation Cmp Inc.",
   "avions": 6,
   "vols": 123
 },
 {
   "proprietaire": "Finnair",
   "avions": 4,
   "vols": 109
 },
 {
   "proprietaire": "Air Saguenay",
   "avions": 1,
   "vols": 108
 },
 {
   "proprietaire": "Flair Airlines Ltd",
   "avions": 1,
   "vols": 107
 },
 {
   "proprietaire": "9736140 Canada Inc. - Pascan",
   "avions": 2,
   "vols": 97
 },
 {
   "proprietaire": "Kudlik Aviation Inc.",
   "avions": 3,
   "vols": 96
 },
 {
   "proprietaire": "Bombardier Inc.",
   "avions": 15,
   "vols": 91
 },
 {
   "proprietaire": "Gouvernement Du Québec, Service Aérien Gouvernemental",
   "avions": 2,
   "vols": 90
 },
 {
   "proprietaire": "Wheels Up Partners Llc",
   "avions": 39,
   "vols": 90
 },
 {
   "proprietaire": "Skylink Express Inc.",
   "avions": 2,
   "vols": 88
 },
 {
   "proprietaire": "Québec Hélicoptères Inc.",
   "avions": 4,
   "vols": 85
 },
 {
   "proprietaire": "Glen Mair",
   "avions": 1,
   "vols": 69
 },
 {
   "proprietaire": "Wilmington Trust Co Trustee",
   "avions": 13,
   "vols": 67
 },
 {
   "proprietaire": "Alan Mills",
   "avions": 1,
   "vols": 63
 },
 {
   "proprietaire": "Cougar Helicopters",
   "avions": 1,
   "vols": 57
 },
 {
   "proprietaire": "Bell Helicopter Textron Canada Limitée",
   "avions": 11,
   "vols": 56
 },
 {
   "proprietaire": "Aviation Starlink Inc.",
   "avions": 7,
   "vols": 52
 },
 {
   "proprietaire": "Air Nunavut Ltd.",
   "avions": 3,
   "vols": 52
 },
 {
   "proprietaire": "Bradley Air Services Limited",
   "avions": 4,
   "vols": 51
 },
 {
   "proprietaire": "Sunwest Aviation Ltd.",
   "avions": 9,
   "vols": 46
 },
 {
   "proprietaire": "Aeromexico",
   "avions": 15,
   "vols": 42
 },
 {
   "proprietaire": "Berry Aviation Inc",
   "avions": 6,
   "vols": 40
 },
 {
   "proprietaire": "9368-2011 Québec Inc.",
   "avions": 1,
   "vols": 38
 },
 {
   "proprietaire": "Republic Airline Inc",
   "avions": 1,
   "vols": 36
 },
 {
   "proprietaire": "Gestion Aeronautique Richardson",
   "avions": 1,
   "vols": 36
 },
 {
   "proprietaire": "Great Slave Helicopters Ltd.",
   "avions": 1,
   "vols": 35
 },
 {
   "proprietaire": "Sun Country Inc",
   "avions": 5,
   "vols": 34
 },
 {
   "proprietaire": "Air Partners Corp.",
   "avions": 3,
   "vols": 33
 },
 {
   "proprietaire": "Private Air Inc.",
   "avions": 6,
   "vols": 31
 },
 {
   "proprietaire": "Avion Capital Corp",
   "avions": 7,
   "vols": 26
 },
 {
   "proprietaire": "Sky Jet M.g. Inc.",
   "avions": 1,
   "vols": 22
 },
 {
   "proprietaire": "Royal Canadian Air Force",
   "avions": 10,
   "vols": 22
 },
 {
   "proprietaire": "Air Creebec Inc.",
   "avions": 4,
   "vols": 20
 },
 {
   "proprietaire": "Icelandair",
   "avions": 2,
   "vols": 20
 },
 {
   "proprietaire": "Partner Jet Inc",
   "avions": 1,
   "vols": 19
 },
 {
   "proprietaire": "Swift Air Llc",
   "avions": 4,
   "vols": 17
 },
 {
   "proprietaire": "2106701 Ontario Inc (novajet)",
   "avions": 6,
   "vols": 17
 },
 {
   "proprietaire": "Vista Jet Malta",
   "avions": 4,
   "vols": 16
 },
 {
   "proprietaire": "Tvpx Aircraft Solutions Inc Trustee",
   "avions": 20,
   "vols": 16
 },
 {
   "proprietaire": "Transwest Air Limited Partnership, By Its General Partner Transwest Management Ltd.",
   "avions": 2,
   "vols": 16
 },
 {
   "proprietaire": "Wells Fargo Delaware Trust Co Na Trustee",
   "avions": 2,
   "vols": 16
 },
 {
   "proprietaire": "C C & E I Llc",
   "avions": 1,
   "vols": 16
 },
 {
   "proprietaire": "Corporation Hélico.Store inc.",
   "avions": 1,
   "vols": 15
 },
 {
   "proprietaire": "Eagle Copters Ltd.",
   "avions": 1,
   "vols": 14
 },
 {
   "proprietaire": "3457265 Canada Inc.",
   "avions": 1,
   "vols": 13
 },
 {
   "proprietaire": "Sunrise Asset Management Llc",
   "avions": 10,
   "vols": 13
 },
 {
   "proprietaire": "German Air Force",
   "avions": 4,
   "vols": 12
 },
 {
   "proprietaire": "Propair Inc.",
   "avions": 1,
   "vols": 12
 },
 {
   "proprietaire": "Hawk Leasing Inc",
   "avions": 1,
   "vols": 12
 },
 {
   "proprietaire": "Awas 2570 Trust",
   "avions": 1,
   "vols": 10
 },
 {
   "proprietaire": "Silver Aviation Llc",
   "avions": 1,
   "vols": 10
 },
 {
   "proprietaire": "Awas 2595 Trust",
   "avions": 1,
   "vols": 10
 },
 {
   "proprietaire": "Vintage Wings Of Canada",
   "avions": 1,
   "vols": 9
 },
 {
   "proprietaire": "Kard Sports Llc",
   "avions": 1,
   "vols": 9
 },
 {
   "proprietaire": "Exact Air Inc.",
   "avions": 1,
   "vols": 9
 },
 {
   "proprietaire": "Rdl Aviation Inc.",
   "avions": 1,
   "vols": 8
 },
 {
   "proprietaire": "8031851 Canada Inc.",
   "avions": 1,
   "vols": 8
 },
 {
   "proprietaire": "Rm Aviation Inc.",
   "avions": 1,
   "vols": 8
 },
 {
   "proprietaire": "Priority Air Charter Llc",
   "avions": 2,
   "vols": 7
 },
 {
   "proprietaire": "Tunisair",
   "avions": 2,
   "vols": 7
 },
 {
   "proprietaire": "Silk Way West Airlines",
   "avions": 4,
   "vols": 7
 },
 {
   "proprietaire": "Regional 1 Airlines Ltd.",
   "avions": 1,
   "vols": 7
 },
 {
   "proprietaire": "Pnc Bank Na",
   "avions": 1,
   "vols": 6
 },
 {
   "proprietaire": "Airmédic Inc.",
   "avions": 1,
   "vols": 6
 },
 {
   "proprietaire": "Tw Leasing Llc",
   "avions": 2,
   "vols": 6
 },
 {
   "proprietaire": "Ral Latitude Llc",
   "avions": 1,
   "vols": 6
 },
 {
   "proprietaire": "Mmap Llc",
   "avions": 1,
   "vols": 6
 },
 {
   "proprietaire": "Nav Canada",
   "avions": 2,
   "vols": 6
 },
 {
   "proprietaire": "Discovery Ventures Ii Management Llc",
   "avions": 1,
   "vols": 6
 },
 {
   "proprietaire": "Warren Henry Automobiles Inc",
   "avions": 1,
   "vols": 6
 },
 {
   "proprietaire": "Flightpath Charter Airways Inc.",
   "avions": 6,
   "vols": 6
 },
 {
   "proprietaire": "Jja Capital Leasing Ventures Llc",
   "avions": 1,
   "vols": 6
 },
 {
   "proprietaire": "Century Capital Corp",
   "avions": 1,
   "vols": 5
 },
 {
   "proprietaire": "Tvpx Ars Inc Trustee",
   "avions": 4,
   "vols": 5
 },
 {
   "proprietaire": "United States Air Force",
   "avions": 4,
   "vols": 5
 },
 {
   "proprietaire": "The Airborne Sensing Corporation",
   "avions": 2,
   "vols": 5
 },
 {
   "proprietaire": "Inconnu",
   "avions": 9,
   "vols": 5
 },
 {
   "proprietaire": "Bourdon Feed & Grain Inc.",
   "avions": 1,
   "vols": 5
 },
 {
   "proprietaire": "Fast Air Ltd.",
   "avions": 3,
   "vols": 5
 },
 {
   "proprietaire": "Cb20mf Llc",
   "avions": 1,
   "vols": 5
 },
 {
   "proprietaire": "Cargolux Airlines International",
   "avions": 2,
   "vols": 5
 },
 {
   "proprietaire": "Fu Air Llc",
   "avions": 1,
   "vols": 4
 },
 {
   "proprietaire": "Mesa Airlines Inc",
   "avions": 2,
   "vols": 4
 },
 {
   "proprietaire": "Martins Famous Pastry Shoppe Inc",
   "avions": 1,
   "vols": 4
 },
 {
   "proprietaire": "Antonov Airlines",
   "avions": 2,
   "vols": 4
 },
 {
   "proprietaire": "Mahiavik Llc",
   "avions": 1,
   "vols": 4
 },
 {
   "proprietaire": "Anderson Equipment Co",
   "avions": 1,
   "vols": 4
 },
 {
   "proprietaire": "Madero Air Llc",
   "avions": 1,
   "vols": 4
 },
 {
   "proprietaire": "Lynch Investments Llc",
   "avions": 1,
   "vols": 4
 },
 {
   "proprietaire": "American Airlines",
   "avions": 2,
   "vols": 4
 },
 {
   "proprietaire": "Oneida Ii Llc",
   "avions": 1,
   "vols": 4
 },
 {
   "proprietaire": "Pacific Sky Aviation Inc.",
   "avions": 2,
   "vols": 4
 },
 {
   "proprietaire": "Leipold Aircraft Llc",
   "avions": 1,
   "vols": 4
 },
 {
   "proprietaire": "Walker & Dunlop Llc",
   "avions": 1,
   "vols": 4
 },
 {
   "proprietaire": "Ravencrest Llc",
   "avions": 1,
   "vols": 4
 },
 {
   "proprietaire": "Rcr 6 Llc",
   "avions": 1,
   "vols": 4
 },
 {
   "proprietaire": "Air Alsie",
   "avions": 2,
   "vols": 4
 },
 {
   "proprietaire": "Sierra American Corporation",
   "avions": 3,
   "vols": 4
 },
 {
   "proprietaire": "Adin Ag",
   "avions": 2,
   "vols": 4
 },
 {
   "proprietaire": "Sierra Delta Llc",
   "avions": 1,
   "vols": 4
 },
 {
   "proprietaire": "Wilbur & Orville Inc",
   "avions": 1,
   "vols": 4
 },
 {
   "proprietaire": "Sun Country Airlines",
   "avions": 1,
   "vols": 4
 },
 {
   "proprietaire": "Corporate",
   "avions": 5,
   "vols": 4
 },
 {
   "proprietaire": "Glen Avalon Llc",
   "avions": 1,
   "vols": 4
 },
 {
   "proprietaire": "Executive Airshare Llc",
   "avions": 2,
   "vols": 4
 },
 {
   "proprietaire": "jwj Llc",
   "avions": 1,
   "vols": 4
 },
 {
   "proprietaire": "N450je Llc",
   "avions": 1,
   "vols": 4
 },
 {
   "proprietaire": "Cavok Air",
   "avions": 4,
   "vols": 4
 },
 {
   "proprietaire": "Prestadora Sta Sa",
   "avions": 1,
   "vols": 3
 },
 {
   "proprietaire": "Holden Air Llc",
   "avions": 1,
   "vols": 3
 },
 {
   "proprietaire": "Hawker Rc 48 Llc",
   "avions": 1,
   "vols": 3
 },
 {
   "proprietaire": "Sl Global Llc",
   "avions": 1,
   "vols": 3
 },
 {
   "proprietaire": "Family Air Llc",
   "avions": 1,
   "vols": 3
 },
 {
   "proprietaire": "Richard L Richards Pa Trustee",
   "avions": 1,
   "vols": 3
 },
 {
   "proprietaire": "Griffin Capital Llc",
   "avions": 1,
   "vols": 3
 },
 {
   "proprietaire": "The Craig Evan Corporation",
   "avions": 3,
   "vols": 3
 },
 {
   "proprietaire": "Voyageur Airways Limited",
   "avions": 1,
   "vols": 3
 },
 {
   "proprietaire": "Cp Redux Llc",
   "avions": 1,
   "vols": 3
 },
 {
   "proprietaire": "Delaware Trust Co Trustee",
   "avions": 3,
   "vols": 3
 },
 {
   "proprietaire": "Katie Couric Media Llc",
   "avions": 1,
   "vols": 3
 },
 {
   "proprietaire": "Lhami Leasing Limited",
   "avions": 1,
   "vols": 3
 },
 {
   "proprietaire": "Entech Avion Llc",
   "avions": 1,
   "vols": 3
 },
 {
   "proprietaire": "Atsinger Aviation Llc",
   "avions": 1,
   "vols": 3
 },
 {
   "proprietaire": "Bliss Air Llc",
   "avions": 1,
   "vols": 3
 },
 {
   "proprietaire": "Blackbird Air Charter A/s",
   "avions": 1,
   "vols": 3
 },
 {
   "proprietaire": "Jet Black Aviation Group Llc",
   "avions": 1,
   "vols": 3
 },
 {
   "proprietaire": "Aeronaves TSM, S.A. de C.V.",
   "avions": 2,
   "vols": 3
 },
 {
   "proprietaire": "Nelson-jackson Llc",
   "avions": 1,
   "vols": 3
 },
 {
   "proprietaire": "Jochco Investments Llc",
   "avions": 1,
   "vols": 3
 },
 {
   "proprietaire": "Aero Jet Aviation I Inc",
   "avions": 4,
   "vols": 3
 },
 {
   "proprietaire": "Royal Air Freight Inc",
   "avions": 1,
   "vols": 3
 },
 {
   "proprietaire": "Aero J I Sa De Cv",
   "avions": 1,
   "vols": 3
 },
 {
   "proprietaire": "Meisner Aircraft Inc",
   "avions": 1,
   "vols": 3
 },
 {
   "proprietaire": "Air Saint-Pierre",
   "avions": 1,
   "vols": 3
 },
 {
   "proprietaire": "Tag Aviation Spain Sl",
   "avions": 1,
   "vols": 2
 },
 {
   "proprietaire": "Ac Spe 4 Llc",
   "avions": 1,
   "vols": 2
 },
 {
   "proprietaire": "Access Helicopters Ltd",
   "avions": 1,
   "vols": 2
 },
 {
   "proprietaire": "Ace Belgium Freighters",
   "avions": 1,
   "vols": 2
 },
 {
   "proprietaire": "Aed Investors Llc",
   "avions": 1,
   "vols": 2
 },
 {
   "proprietaire": "Agl Lease Llc",
   "avions": 1,
   "vols": 2
 },
 {
   "proprietaire": "Air Astana",
   "avions": 1,
   "vols": 2
 },
 {
   "proprietaire": "Air Baltic",
   "avions": 2,
   "vols": 2
 },
 {
   "proprietaire": "Air Charter Scotland",
   "avions": 1,
   "vols": 2
 },
 {
   "proprietaire": "Air Hamburg",
   "avions": 1,
   "vols": 2
 },
 {
   "proprietaire": "Aj Dwoskin & Associates Inc",
   "avions": 1,
   "vols": 2
 },
 {
   "proprietaire": "Albinati Aviation Ltd",
   "avions": 1,
   "vols": 2
 },
 {
   "proprietaire": "Allen Barry K",
   "avions": 1,
   "vols": 2
 },
 {
   "proprietaire": "Allied Wings Limited Partnership, By Its General Partner, Allied Wings Project Holdings Inc",
   "avions": 1,
   "vols": 2
 },
 {
   "proprietaire": "Andretti Autosport Aviation Inc",
   "avions": 1,
   "vols": 2
 },
 {
   "proprietaire": "Ascend Enterprises Llc",
   "avions": 1,
   "vols": 2
 },
 {
   "proprietaire": "Atlas Air Inc",
   "avions": 1,
   "vols": 2
 },
 {
   "proprietaire": "Avire Llc",
   "avions": 2,
   "vols": 2
 },
 {
   "proprietaire": "Bake Air Llc",
   "avions": 1,
   "vols": 2
 },
 {
   "proprietaire": "Bridgeton Capital Llc",
   "avions": 1,
   "vols": 2
 },
 {
   "proprietaire": "C2 Aviation Llc",
   "avions": 1,
   "vols": 2
 },
 {
   "proprietaire": "Career Aviation Company Inc",
   "avions": 1,
   "vols": 2
 },
 {
   "proprietaire": "Charles Komar & Sons Inc",
   "avions": 1,
   "vols": 2
 },
 {
   "proprietaire": "Concierge U",
   "avions": 1,
   "vols": 2
 },
 {
   "proprietaire": "Czech Air Force",
   "avions": 1,
   "vols": 2
 },
 {
   "proprietaire": "D S Advisors Inc",
   "avions": 1,
   "vols": 2
 },
 {
   "proprietaire": "Darren Hardy Llc",
   "avions": 1,
   "vols": 2
 },
 {
   "proprietaire": "Delaware Aircraft Trust Llc Trustee",
   "avions": 1,
   "vols": 2
 },
 {
   "proprietaire": "Delta Private Jets",
   "avions": 2,
   "vols": 2
 },
 {
   "proprietaire": "Dougherty Air Trustee Llc Trustee",
   "avions": 1,
   "vols": 2
 },
 {
   "proprietaire": "East Coast Flight Services Inc",
   "avions": 1,
   "vols": 2
 },
 {
   "proprietaire": "East Coast Jets Inc",
   "avions": 1,
   "vols": 2
 },
 {
   "proprietaire": "Emeril Air Llc",
   "avions": 1,
   "vols": 2
 },
 {
   "proprietaire": "Empresa De Transportes Aereos Los Boldos",
   "avions": 1,
   "vols": 2
 },
 {
   "proprietaire": "Esmark Aviation Llc",
   "avions": 1,
   "vols": 2
 },
 {
   "proprietaire": "Exa Llc",
   "avions": 1,
   "vols": 2
 },
 {
   "proprietaire": "Fa Flyer G1 Llc",
   "avions": 1,
   "vols": 2
 },
 {
   "proprietaire": "Fe 5070 Llc",
   "avions": 1,
   "vols": 2
 },
 {
   "proprietaire": "Float Alaska Holdings Llc",
   "avions": 2,
   "vols": 2
 },
 {
   "proprietaire": "Flower In The Field Av Llc",
   "avions": 1,
   "vols": 2
 },
 {
   "proprietaire": "Flying Brick Llc",
   "avions": 1,
   "vols": 2
 },
 {
   "proprietaire": "Flying Service Nv",
   "avions": 1,
   "vols": 2
 },
 {
   "proprietaire": "Freon Holdings Llc",
   "avions": 1,
   "vols": 2
 },
 {
   "proprietaire": "G4sp Holdings Llc",
   "avions": 1,
   "vols": 2
 },
 {
   "proprietaire": "Gulfstream 451 Llc",
   "avions": 1,
   "vols": 2
 },
 {
   "proprietaire": "Hawker Acquisition Llc",
   "avions": 1,
   "vols": 2
 },
 {
   "proprietaire": "Hawker Rc 36 Llc",
   "avions": 1,
   "vols": 2
 },
 {
   "proprietaire": "Highland Vista Llc",
   "avions": 1,
   "vols": 2
 },
 {
   "proprietaire": "Hop-a-jet Worldwide Jet Charter Inc",
   "avions": 1,
   "vols": 2
 },
 {
   "proprietaire": "Hungarian Air Force",
   "avions": 1,
   "vols": 2
 },
 {
   "proprietaire": "Iraqi Airways",
   "avions": 1,
   "vols": 2
 },
 {
   "proprietaire": "Jacura Delaware Inc",
   "avions": 1,
   "vols": 2
 },
 {
   "proprietaire": "Jah2015an680pa Llc",
   "avions": 1,
   "vols": 2
 },
 {
   "proprietaire": "Jj Trans Llc",
   "avions": 1,
   "vols": 2
 },
 {
   "proprietaire": "Journey Aviation 638 Llc",
   "avions": 1,
   "vols": 2
 },
 {
   "proprietaire": "Justice Air Inc",
   "avions": 1,
   "vols": 2
 },
 {
   "proprietaire": "Kba Llc",
   "avions": 1,
   "vols": 2
 },
 {
   "proprietaire": "Kedzie Aircraft Llc",
   "avions": 1,
   "vols": 2
 },
 {
   "proprietaire": "Kiewit Engineering Group Inc",
   "avions": 1,
   "vols": 2
 },
 {
   "proprietaire": "Lauda Motion Executive",
   "avions": 1,
   "vols": 2
 },
 {
   "proprietaire": "Lgav8 Llc",
   "avions": 1,
   "vols": 2
 },
 {
   "proprietaire": "Luxwing",
   "avions": 1,
   "vols": 2
 },
 {
   "proprietaire": "Max Aircraft Llc",
   "avions": 1,
   "vols": 2
 },
 {
   "proprietaire": "Meander Air Ii Llc",
   "avions": 1,
   "vols": 2
 },
 {
   "proprietaire": "Mhs Aviation Gmbh",
   "avions": 1,
   "vols": 2
 },
 {
   "proprietaire": "Mid Central Leasing Llc",
   "avions": 1,
   "vols": 2
 },
 {
   "proprietaire": "Miller William H Iii",
   "avions": 1,
   "vols": 2
 },
 {
   "proprietaire": "Mwm Consulting Llc",
   "avions": 1,
   "vols": 2
 },
 {
   "proprietaire": "N D Air Llc",
   "avions": 1,
   "vols": 2
 },
 {
   "proprietaire": "N328rp Aviation Llc",
   "avions": 1,
   "vols": 2
 },
 {
   "proprietaire": "Nejets Sales Inc",
   "avions": 1,
   "vols": 2
 },
 {
   "proprietaire": "North Cariboo Flying Service Ltd",
   "avions": 1,
   "vols": 2
 },
 {
   "proprietaire": "Orange Whip Llc",
   "avions": 1,
   "vols": 2
 },
 {
   "proprietaire": "Phoenix Air Group Inc",
   "avions": 1,
   "vols": 2
 },
 {
   "proprietaire": "Phoenix Management Inc",
   "avions": 1,
   "vols": 2
 },
 {
   "proprietaire": "Pumpjack Aviation Llc",
   "avions": 1,
   "vols": 2
 },
 {
   "proprietaire": "Qatar Executive",
   "avions": 1,
   "vols": 2
 },
 {
   "proprietaire": "Red Moon 88 Llc",
   "avions": 1,
   "vols": 2
 },
 {
   "proprietaire": "Rose Valley Leasing Llc",
   "avions": 1,
   "vols": 2
 },
 {
   "proprietaire": "Salt Whistle Llc",
   "avions": 1,
   "vols": 2
 },
 {
   "proprietaire": "Sc Aviation Inc",
   "avions": 1,
   "vols": 2
 },
 {
   "proprietaire": "Sea Hawk Inc",
   "avions": 1,
   "vols": 2
 },
 {
   "proprietaire": "Sky West Airlines Inc",
   "avions": 1,
   "vols": 2
 },
 {
   "proprietaire": "Sun Air",
   "avions": 1,
   "vols": 2
 },
 {
   "proprietaire": "Td Air Llc",
   "avions": 1,
   "vols": 2
 },
 {
   "proprietaire": "Tennthom Aviation Corp",
   "avions": 1,
   "vols": 2
 },
 {
   "proprietaire": "Tradewind Aviation",
   "avions": 1,
   "vols": 2
 },
 {
   "proprietaire": "Ukraine Air Alliance",
   "avions": 1,
   "vols": 2
 },
 {
   "proprietaire": "Unijet Sa",
   "avions": 1,
   "vols": 2
 },
 {
   "proprietaire": "United States Marine Corps",
   "avions": 1,
   "vols": 2
 },
 {
   "proprietaire": "Usa Jet Airlines Inc",
   "avions": 1,
   "vols": 2
 },
 {
   "proprietaire": "Venti Capital Llc",
   "avions": 1,
   "vols": 2
 },
 {
   "proprietaire": "Volkswagen Group",
   "avions": 1,
   "vols": 2
 },
 {
   "proprietaire": "Weiss Special Operations Llc",
   "avions": 1,
   "vols": 2
 },
 {
   "proprietaire": "Wing Aviation Group Llc",
   "avions": 1,
   "vols": 2
 },
 {
   "proprietaire": "Worthe Development Company Llc",
   "avions": 1,
   "vols": 2
 },
 {
   "proprietaire": "Yolo Aviation Llc",
   "avions": 1,
   "vols": 2
 },
 {
   "proprietaire": "Pfc Holdings Llc",
   "avions": 1,
   "vols": 1
 },
 {
   "proprietaire": "Wyoming Associates Inc",
   "avions": 1,
   "vols": 1
 },
 {
   "proprietaire": "Diamond Leasing Group Llc",
   "avions": 1,
   "vols": 1
 },
 {
   "proprietaire": "Keewatin Air Lp As Represented By Its General Partner, Keewatin Air Gp Inc. (kivalliq Air Nunavut Lifeline)",
   "avions": 1,
   "vols": 1
 },
 {
   "proprietaire": "Tenax Aerospace Llc",
   "avions": 2,
   "vols": 1
 },
 {
   "proprietaire": "Cargo Aircraft Management Inc",
   "avions": 1,
   "vols": 1
 },
 {
   "proprietaire": "Sovereign Of The Sky Llc",
   "avions": 1,
   "vols": 1
 },
 {
   "proprietaire": "Hi Fly Malta",
   "avions": 1,
   "vols": 1
 },
 {
   "proprietaire": "Ducera Aviation Llc",
   "avions": 1,
   "vols": 1
 },
 {
   "proprietaire": "Ifl Group Inc",
   "avions": 1,
   "vols": 1
 },
 {
   "proprietaire": "Meyer Tool Inc",
   "avions": 1,
   "vols": 1
 },
 {
   "proprietaire": "Servicios Aereos Across",
   "avions": 1,
   "vols": 1
 },
 {
   "proprietaire": "Volga-dnepr Airlines",
   "avions": 1,
   "vols": 1
 },
 {
   "proprietaire": "Gmac Air Llc",
   "avions": 1,
   "vols": 1
 },
 {
   "proprietaire": "Air Azores",
   "avions": 1,
   "vols": 1
 },
 {
   "proprietaire": "Midwest Nas Inc",
   "avions": 1,
   "vols": 1
 },
 {
   "proprietaire": "Thomson Airways",
   "avions": 1,
   "vols": 1
 },
 {
   "proprietaire": "Thunder Airlines Limited",
   "avions": 1,
   "vols": 1
 },
 {
   "proprietaire": "N45ax Llc",
   "avions": 1,
   "vols": 1
 },
 {
   "proprietaire": "2010 Mck Llc",
   "avions": 1,
   "vols": 1
 },
 {
   "proprietaire": "Canadian North Inc.",
   "avions": 1,
   "vols": 1
 },
 {
   "proprietaire": "Rigi Inc",
   "avions": 7,
   "vols": 1
 },
 {
   "proprietaire": "Glf4 1044 Llc",
   "avions": 1,
   "vols": 1
 },
 {
   "proprietaire": "Acemac Llc",
   "avions": 1,
   "vols": 1
 },
 {
   "proprietaire": "Confectionery Advantage Llc",
   "avions": 1,
   "vols": 1
 },
 {
   "proprietaire": "Rlr Leasing Llc",
   "avions": 1,
   "vols": 1
 },
 {
   "proprietaire": "Nasa",
   "avions": 1,
   "vols": 1
 },
 {
   "proprietaire": "Airlec Air Espace",
   "avions": 1,
   "vols": 1
 },
 {
   "proprietaire": "Cu Iv Llc",
   "avions": 1,
   "vols": 1
 },
 {
   "proprietaire": "Amc Aviation",
   "avions": 1,
   "vols": 1
 },
 {
   "proprietaire": "Aqua Sun Investments Llc",
   "avions": 1,
   "vols": 1
 },
 {
   "proprietaire": "Expeditus Holdings Llc",
   "avions": 1,
   "vols": 1
 },
 {
   "proprietaire": "Exxaero",
   "avions": 1,
   "vols": 1
 },
 {
   "proprietaire": "Vipjet Ltd",
   "avions": 1,
   "vols": 1
 },
 {
   "proprietaire": "Top Aces Inc.",
   "avions": 1,
   "vols": 1
 },
 {
   "proprietaire": "Arkoma Consulting Llc",
   "avions": 1,
   "vols": 1
 },
 {
   "proprietaire": "Swiss Air-Ambulance Ltd.",
   "avions": 1,
   "vols": 1
 },
 {
   "proprietaire": "Bslcc-iv Llc",
   "avions": 1,
   "vols": 1
 },
 {
   "proprietaire": "Ftg Assets Llc",
   "avions": 1,
   "vols": 1
 },
 {
   "proprietaire": "Karma55ba Llc",
   "avions": 1,
   "vols": 1
 },
 {
   "proprietaire": "Central Mountain Air Ltd",
   "avions": 1,
   "vols": 1
 },
 {
   "proprietaire": "Cb80pt Llc",
   "avions": 1,
   "vols": 1
 },
 {
   "proprietaire": "Government Of Canada, National Research Council",
   "avions": 1,
   "vols": 1
 },
 {
   "proprietaire": "Sma Holdings Llc",
   "avions": 1,
   "vols": 1
 },
 {
   "proprietaire": "French Air Force",
   "avions": 1,
   "vols": 1
 },
 {
   "proprietaire": "Global Jet Luxembourg",
   "avions": 1,
   "vols": 1
 },
 {
   "proprietaire": "Dfm Aviation Limited Partnership",
   "avions": 1,
   "vols": 1
 },
 {
   "proprietaire": "Maklee Air Llc",
   "avions": 1,
   "vols": 1
 },
 {
   "proprietaire": "Flying Dutchman Endeavors Llc",
   "avions": 1,
   "vols": 1
 },
 {
   "proprietaire": "Gv Air Inc",
   "avions": 1,
   "vols": 0
 },
 {
   "proprietaire": "Hambrick James L",
   "avions": 1,
   "vols": 0
 },
 {
   "proprietaire": "Hat Trick Air Llc",
   "avions": 1,
   "vols": 0
 },
 {
   "proprietaire": "Byte Me Transportation Inc",
   "avions": 1,
   "vols": 0
 },
 {
   "proprietaire": "Udr Inc",
   "avions": 1,
   "vols": 0
 },
 {
   "proprietaire": "Hawker Beechcraft",
   "avions": 1,
   "vols": 0
 },
 {
   "proprietaire": "102662 Canada Inc.",
   "avions": 1,
   "vols": 0
 },
 {
   "proprietaire": "Business Jet Managers Inc",
   "avions": 1,
   "vols": 0
 },
 {
   "proprietaire": "Health Care Relocations Ltd.",
   "avions": 1,
   "vols": 0
 },
 {
   "proprietaire": "Heli Source Ltd.",
   "avions": 1,
   "vols": 0
 },
 {
   "proprietaire": "Helicopteros Dominicanos Sa",
   "avions": 1,
   "vols": 0
 },
 {
   "proprietaire": "Helidosa Sa",
   "avions": 1,
   "vols": 0
 },
 {
   "proprietaire": "Henley Aviation Inc",
   "avions": 1,
   "vols": 0
 },
 {
   "proprietaire": "Hershey Co",
   "avions": 1,
   "vols": 0
 },
 {
   "proprietaire": "Hhi Holdings Llc",
   "avions": 1,
   "vols": 0
 },
 {
   "proprietaire": "Hhwr Whitetail Ranch Llc",
   "avions": 1,
   "vols": 0
 },
 {
   "proprietaire": "Hibbard Enterprises Llc",
   "avions": 1,
   "vols": 0
 },
 {
   "proprietaire": "2353581 Ontario Inc.",
   "avions": 1,
   "vols": 0
 },
 {
   "proprietaire": "Himes Island Air Llc",
   "avions": 1,
   "vols": 0
 },
 {
   "proprietaire": "Holm Leasing Llc",
   "avions": 1,
   "vols": 0
 },
 {
   "proprietaire": "Unicorp Aviation Llc",
   "avions": 1,
   "vols": 0
 },
 {
   "proprietaire": "0869234 Bc Ltd",
   "avions": 1,
   "vols": 0
 },
 {
   "proprietaire": "Brent Van Moorsel",
   "avions": 1,
   "vols": 0
 },
 {
   "proprietaire": "I.M.P. Group Limited (Execaire)",
   "avions": 10,
   "vols": 0
 },
 {
   "proprietaire": "Brenda Wolfe",
   "avions": 1,
   "vols": 0
 },
 {
   "proprietaire": "Image Air Charter Ltd.",
   "avions": 2,
   "vols": 0
 },
 {
   "proprietaire": "Brampton Flying Club",
   "avions": 1,
   "vols": 0
 },
 {
   "proprietaire": "International Air Services Inc Trustee",
   "avions": 1,
   "vols": 0
 },
 {
   "proprietaire": "Interport Aviation Llc",
   "avions": 1,
   "vols": 0
 },
 {
   "proprietaire": "Union Underwear Co Inc",
   "avions": 1,
   "vols": 0
 },
 {
   "proprietaire": "Irving Air Service Inc.",
   "avions": 1,
   "vols": 0
 },
 {
   "proprietaire": "Island Air Flight School & Charters Inc.",
   "avions": 1,
   "vols": 0
 },
 {
   "proprietaire": "J Jets Inc",
   "avions": 1,
   "vols": 0
 },
 {
   "proprietaire": "J R S Sky Inc",
   "avions": 1,
   "vols": 0
 },
 {
   "proprietaire": "Jacobs Irwin Mark Trustee",
   "avions": 1,
   "vols": 0
 },
 {
   "proprietaire": "2341224 Ontario Inc.",
   "avions": 1,
   "vols": 0
 },
 {
   "proprietaire": "2141409 Ontario Inc.",
   "avions": 1,
   "vols": 0
 },
 {
   "proprietaire": "Jason Macbean",
   "avions": 1,
   "vols": 0
 },
 {
   "proprietaire": "Bollinger Enterprises Llc",
   "avions": 1,
   "vols": 0
 },
 {
   "proprietaire": "Jedami Air Llc",
   "avions": 1,
   "vols": 0
 },
 {
   "proprietaire": "Jet-share Aviation Inc.",
   "avions": 1,
   "vols": 0
 },
 {
   "proprietaire": "Blue Man Air Llc",
   "avions": 1,
   "vols": 0
 },
 {
   "proprietaire": "Jetco Llc",
   "avions": 1,
   "vols": 0
 },
 {
   "proprietaire": "Jfw Leasing Llc",
   "avions": 1,
   "vols": 0
 },
 {
   "proprietaire": "2080061 Ontario Inc. (skycare Air Ambulance)",
   "avions": 1,
   "vols": 0
 },
 {
   "proprietaire": "Blue Horizons Holdings Llc",
   "avions": 1,
   "vols": 0
 },
 {
   "proprietaire": "Jlj Equipment Leasing Corp",
   "avions": 1,
   "vols": 0
 },
 {
   "proprietaire": "Jml Jet Ii Llc",
   "avions": 1,
   "vols": 0
 },
 {
   "proprietaire": "Bgot Capital Holdings Llc",
   "avions": 1,
   "vols": 0
 },
 {
   "proprietaire": "John A. Kenny",
   "avions": 1,
   "vols": 0
 },
 {
   "proprietaire": "2011376 Ontario Limited",
   "avions": 1,
   "vols": 0
 },
 {
   "proprietaire": "Jpt Associates Llc",
   "avions": 1,
   "vols": 0
 },
 {
   "proprietaire": "Jr Aviation Llc",
   "avions": 1,
   "vols": 0
 },
 {
   "proprietaire": "Jsca Lll",
   "avions": 1,
   "vols": 0
 },
 {
   "proprietaire": "Jsg Aviation Llc",
   "avions": 1,
   "vols": 0
 },
 {
   "proprietaire": "Jssp Llc",
   "avions": 1,
   "vols": 0
 },
 {
   "proprietaire": "United States Dept Of The Interior",
   "avions": 1,
   "vols": 0
 },
 {
   "proprietaire": "Jvation Llc",
   "avions": 1,
   "vols": 0
 },
 {
   "proprietaire": "Ka Llc",
   "avions": 1,
   "vols": 0
 },
 {
   "proprietaire": "Kac Md Llc",
   "avions": 1,
   "vols": 0
 },
 {
   "proprietaire": "Kal Aviation Group Inc.",
   "avions": 1,
   "vols": 0
 },
 {
   "proprietaire": "Beta Air Llc",
   "avions": 1,
   "vols": 0
 },
 {
   "proprietaire": "Bergstrom Pioneer Auto And Truck Leasing Inc",
   "avions": 1,
   "vols": 0
 },
 {
   "proprietaire": "Karol Atmosfera Llc",
   "avions": 1,
   "vols": 0
 },
 {
   "proprietaire": "Bear Air Llc",
   "avions": 2,
   "vols": 0
 },
 {
   "proprietaire": "Winds Calm Llc",
   "avions": 1,
   "vols": 0
 },
 {
   "proprietaire": "Keller Companies Inc",
   "avions": 2,
   "vols": 0
 },
 {
   "proprietaire": "Vase Corp V",
   "avions": 1,
   "vols": 0
 },
 {
   "proprietaire": "Killa Katchka Inc",
   "avions": 1,
   "vols": 0
 },
 {
   "proprietaire": "King Three Llc",
   "avions": 1,
   "vols": 0
 },
 {
   "proprietaire": "Bdag 7x Llc",
   "avions": 1,
   "vols": 0
 },
 {
   "proprietaire": "Kodiak Operations Limited",
   "avions": 1,
   "vols": 0
 },
 {
   "proprietaire": "Kramer Ltd",
   "avions": 1,
   "vols": 0
 },
 {
   "proprietaire": "Kreos Aviation Inc.",
   "avions": 1,
   "vols": 0
 },
 {
   "proprietaire": "Kruger Inc.",
   "avions": 1,
   "vols": 0
 },
 {
   "proprietaire": "Bbsi Air I Llc",
   "avions": 1,
   "vols": 0
 },
 {
   "proprietaire": "L & P Transportation Llc",
   "avions": 1,
   "vols": 0
 },
 {
   "proprietaire": "Lakelse Air Ltd",
   "avions": 1,
   "vols": 0
 },
 {
   "proprietaire": "Laneybird Llc",
   "avions": 1,
   "vols": 0
 },
 {
   "proprietaire": "Worldwide Jet Charter Inc",
   "avions": 1,
   "vols": 0
 },
 {
   "proprietaire": "Leblond Antoine",
   "avions": 1,
   "vols": 0
 },
 {
   "proprietaire": "Bay Equipment Llc",
   "avions": 1,
   "vols": 0
 },
 {
   "proprietaire": "Leolear Holdings Llc",
   "avions": 1,
   "vols": 0
 },
 {
   "proprietaire": "Léon Raymond",
   "avions": 1,
   "vols": 0
 },
 {
   "proprietaire": "Les Chantiers De Chibougamau Ltee.",
   "avions": 1,
   "vols": 0
 },
 {
   "proprietaire": "Bass Pro Llc",
   "avions": 1,
   "vols": 0
 },
 {
   "proprietaire": "Lexa International Corp",
   "avions": 1,
   "vols": 0
 },
 {
   "proprietaire": "Versajet Inc.",
   "avions": 1,
   "vols": 0
 },
 {
   "proprietaire": "Lgm Enterprises Llc",
   "avions": 1,
   "vols": 0
 },
 {
   "proprietaire": "Aviation Jolina S.E.C.",
   "avions": 2,
   "vols": 0
 },
 {
   "proprietaire": "Lid Brokerage & Realty Co. (1977) Ltd.",
   "avions": 1,
   "vols": 0
 },
 {
   "proprietaire": "London Air Services Limited",
   "avions": 2,
   "vols": 0
 },
 {
   "proprietaire": "Lone Mountain Aircraft Llc",
   "avions": 1,
   "vols": 0
 },
 {
   "proprietaire": "Long Creek Aviation Llc",
   "avions": 1,
   "vols": 0
 },
 {
   "proprietaire": "Lopez Tej Llc",
   "avions": 1,
   "vols": 0
 },
 {
   "proprietaire": "Aviation Cozach Inc.",
   "avions": 1,
   "vols": 0
 },
 {
   "proprietaire": "Lung Biotechnology Pbc",
   "avions": 1,
   "vols": 0
 },
 {
   "proprietaire": "Luxaviation Belgium",
   "avions": 1,
   "vols": 0
 },
 {
   "proprietaire": "Avex Holdings Inc",
   "avions": 1,
   "vols": 0
 },
 {
   "proprietaire": "M A R Aviation 77 Llc",
   "avions": 1,
   "vols": 0
 },
 {
   "proprietaire": "Maconix Ltd",
   "avions": 1,
   "vols": 0
 },
 {
   "proprietaire": "Avanti Air",
   "avions": 1,
   "vols": 0
 },
 {
   "proprietaire": "Magic Johnson Entertainment Inc",
   "avions": 1,
   "vols": 0
 },
 {
   "proprietaire": "Magna International Inc.",
   "avions": 1,
   "vols": 0
 },
 {
   "proprietaire": "Aurora Ventures Llc",
   "avions": 1,
   "vols": 0
 },
 {
   "proprietaire": "Mainstream Distribution Inc",
   "avions": 1,
   "vols": 0
 },
 {
   "proprietaire": "Manitoulin Transport Inc.",
   "avions": 1,
   "vols": 0
 },
 {
   "proprietaire": "Manufacturers And Traders Trust Co",
   "avions": 1,
   "vols": 0
 },
 {
   "proprietaire": "Marbina Interests Office Llc",
   "avions": 1,
   "vols": 0
 },
 {
   "proprietaire": "Marine Capital Inc.",
   "avions": 1,
   "vols": 0
 },
 {
   "proprietaire": "Maritime Air Charter Limited",
   "avions": 1,
   "vols": 0
 },
 {
   "proprietaire": "Martin O'bomsawin",
   "avions": 1,
   "vols": 0
 },
 {
   "proprietaire": "Martini Aviation Ltd.",
   "avions": 1,
   "vols": 0
 },
 {
   "proprietaire": "Atlantis Aviation Limited Partnership; By Its Managing General Partner Atlantis Air Corp.",
   "avions": 1,
   "vols": 0
 },
 {
   "proprietaire": "Massmutual Asset Finance Llc",
   "avions": 1,
   "vols": 0
 },
 {
   "proprietaire": "Max Aviation Inc.",
   "avions": 4,
   "vols": 0
 },
 {
   "proprietaire": "May Ten Llc",
   "avions": 1,
   "vols": 0
 },
 {
   "proprietaire": "Mayim Rabim Llc",
   "avions": 1,
   "vols": 0
 },
 {
   "proprietaire": "Maynard Aviation Llc",
   "avions": 1,
   "vols": 0
 },
 {
   "proprietaire": "Mccain Foods Limited",
   "avions": 1,
   "vols": 0
 },
 {
   "proprietaire": "Mch Wilson Inc",
   "avions": 1,
   "vols": 0
 },
 {
   "proprietaire": "1867829 Alberta Ltd",
   "avions": 1,
   "vols": 0
 },
 {
   "proprietaire": "Astec Industries Inc",
   "avions": 1,
   "vols": 0
 },
 {
   "proprietaire": "Merck Sharp & Dohme Llc",
   "avions": 1,
   "vols": 0
 },
 {
   "proprietaire": "Mermerus Llc",
   "avions": 1,
   "vols": 0
 },
 {
   "proprietaire": "Meruelo Group Llc",
   "avions": 1,
   "vols": 0
 },
 {
   "proprietaire": "Asaph Fipke",
   "avions": 1,
   "vols": 0
 },
 {
   "proprietaire": "Zephyr Air Llc",
   "avions": 1,
   "vols": 0
 },
 {
   "proprietaire": "1776 Aviation Services Llc",
   "avions": 1,
   "vols": 0
 },
 {
   "proprietaire": "Miramonte Aviation Llc",
   "avions": 1,
   "vols": 0
 },
 {
   "proprietaire": "Mlg Inc.",
   "avions": 1,
   "vols": 0
 },
 {
   "proprietaire": "Mma Consulting Inc",
   "avions": 1,
   "vols": 0
 },
 {
   "proprietaire": "Mmap2 Llc",
   "avions": 1,
   "vols": 0
 },
 {
   "proprietaire": "Montel Equipement Minier Inc.",
   "avions": 1,
   "vols": 0
 },
 {
   "proprietaire": "Ari Properties Llc",
   "avions": 1,
   "vols": 0
 },
 {
   "proprietaire": "Morningstar Partners Ltd. (aurora Jet Partners)",
   "avions": 3,
   "vols": 0
 },
 {
   "proprietaire": "Mount Royal University",
   "avions": 1,
   "vols": 0
 },
 {
   "proprietaire": "Mullett Leasing Llc",
   "avions": 1,
   "vols": 0
 },
 {
   "proprietaire": "Musco Sports Lighting Llc",
   "avions": 1,
   "vols": 0
 },
 {
   "proprietaire": "Mva Aviation Ltd",
   "avions": 1,
   "vols": 0
 },
 {
   "proprietaire": "Vt Air Llc",
   "avions": 1,
   "vols": 0
 },
 {
   "proprietaire": "N A Citation (2012) Llc",
   "avions": 1,
   "vols": 0
 },
 {
   "proprietaire": "Wal-mart Canada Corp.",
   "avions": 1,
   "vols": 0
 },
 {
   "proprietaire": "N1870g Leasing Llc",
   "avions": 1,
   "vols": 0
 },
 {
   "proprietaire": "N278mc Llc",
   "avions": 1,
   "vols": 0
 },
 {
   "proprietaire": "1769856 Ontario Inc.",
   "avions": 1,
   "vols": 0
 },
 {
   "proprietaire": "N409bg Llc",
   "avions": 1,
   "vols": 0
 },
 {
   "proprietaire": "Arab Wings Ltd",
   "avions": 1,
   "vols": 0
 },
 {
   "proprietaire": "N45zf Llc",
   "avions": 1,
   "vols": 0
 },
 {
   "proprietaire": "N80mh Holdings Llc",
   "avions": 1,
   "vols": 0
 },
 {
   "proprietaire": "N898mw Inc Trustee",
   "avions": 1,
   "vols": 0
 },
 {
   "proprietaire": "Wallace Rogers Iii",
   "avions": 1,
   "vols": 0
 },
 {
   "proprietaire": "Apex Helicopters Inc.",
   "avions": 1,
   "vols": 0
 },
 {
   "proprietaire": "Nestle Purina Petcare Co",
   "avions": 1,
   "vols": 0
 },
 {
   "proprietaire": "Aosky Corp",
   "avions": 1,
   "vols": 0
 },
 {
   "proprietaire": "New Bremen Investments Inc",
   "avions": 1,
   "vols": 0
 },
 {
   "proprietaire": "New Horizons Aviation Llc",
   "avions": 1,
   "vols": 0
 },
 {
   "proprietaire": "New York City Police Department",
   "avions": 1,
   "vols": 0
 },
 {
   "proprietaire": "Nicholas Christopher",
   "avions": 1,
   "vols": 0
 },
 {
   "proprietaire": "1507796 Ontario Limited",
   "avions": 1,
   "vols": 0
 },
 {
   "proprietaire": "Anderson Air Ltd",
   "avions": 3,
   "vols": 0
 },
 {
   "proprietaire": "Northland Airmotive Llc",
   "avions": 1,
   "vols": 0
 },
 {
   "proprietaire": "Nutrien",
   "avions": 1,
   "vols": 0
 },
 {
   "proprietaire": "Nware Aviation Inc",
   "avions": 1,
   "vols": 0
 },
 {
   "proprietaire": "Ocs Real Estate Holdings Llc",
   "avions": 1,
   "vols": 0
 },
 {
   "proprietaire": "Oii Leasing Llc",
   "avions": 1,
   "vols": 0
 },
 {
   "proprietaire": "Old Bonita Air Llc",
   "avions": 1,
   "vols": 0
 },
 {
   "proprietaire": "On Eagles Wings Llc",
   "avions": 1,
   "vols": 0
 },
 {
   "proprietaire": "One Eleven Aero Llc",
   "avions": 2,
   "vols": 0
 },
 {
   "proprietaire": "One Gallon Llc",
   "avions": 1,
   "vols": 0
 },
 {
   "proprietaire": "Amc Aviation Llc",
   "avions": 1,
   "vols": 0
 },
 {
   "proprietaire": "Warren Ross Cresswell",
   "avions": 1,
   "vols": 0
 },
 {
   "proprietaire": "Orlando Plane Partners Llc",
   "avions": 1,
   "vols": 0
 },
 {
   "proprietaire": "Osama Arafat",
   "avions": 1,
   "vols": 0
 },
 {
   "proprietaire": "Pack Wikert Ii Llc",
   "avions": 1,
   "vols": 0
 },
 {
   "proprietaire": "Pakawalup Llc",
   "avions": 1,
   "vols": 0
 },
 {
   "proprietaire": "Altair Advanced Industries Inc",
   "avions": 1,
   "vols": 0
 },
 {
   "proprietaire": "Panorama Fixed Wings Ltd.",
   "avions": 2,
   "vols": 0
 },
 {
   "proprietaire": "Parachutisme Nouvel Air Inc.",
   "avions": 1,
   "vols": 0
 },
 {
   "proprietaire": "Alliance 171 Llc",
   "avions": 1,
   "vols": 0
 },
 {
   "proprietaire": "Partner Jet Inc.",
   "avions": 2,
   "vols": 0
 },
 {
   "proprietaire": "Paul Renny",
   "avions": 1,
   "vols": 0
 },
 {
   "proprietaire": "Pcsa 1 Llc",
   "avions": 1,
   "vols": 0
 },
 {
   "proprietaire": "Perdue Farms Inc",
   "avions": 1,
   "vols": 0
 },
 {
   "proprietaire": "Phenom 300 Llc",
   "avions": 2,
   "vols": 0
 },
 {
   "proprietaire": "Phénom S.e.c.",
   "avions": 1,
   "vols": 0
 },
 {
   "proprietaire": "Waterloo-wellington Flying Club",
   "avions": 2,
   "vols": 0
 },
 {
   "proprietaire": "Waterloo-Wellington Flying Club",
   "avions": 1,
   "vols": 0
 },
 {
   "proprietaire": "Plane 79 Llc",
   "avions": 1,
   "vols": 0
 },
 {
   "proprietaire": "Platinum Aviation Llc",
   "avions": 1,
   "vols": 0
 },
 {
   "proprietaire": "Pmc Distribution Inc",
   "avions": 1,
   "vols": 0
 },
 {
   "proprietaire": "Alci Aviation Ltd.",
   "avions": 2,
   "vols": 0
 },
 {
   "proprietaire": "Pog Capital Inc",
   "avions": 1,
   "vols": 0
 },
 {
   "proprietaire": "Alain Boucher",
   "avions": 1,
   "vols": 0
 },
 {
   "proprietaire": "Pottier Michael",
   "avions": 1,
   "vols": 0
 },
 {
   "proprietaire": "Aj Air Ltd",
   "avions": 1,
   "vols": 0
 },
 {
   "proprietaire": "Airmed International Llc",
   "avions": 1,
   "vols": 0
 },
 {
   "proprietaire": "Pridgeon & Clay Inc",
   "avions": 1,
   "vols": 0
 },
 {
   "proprietaire": "Aircraft Holdings Inc",
   "avions": 1,
   "vols": 0
 },
 {
   "proprietaire": "Profundity Llc",
   "avions": 1,
   "vols": 0
 },
 {
   "proprietaire": "Promanex Inc.",
   "avions": 1,
   "vols": 0
 },
 {
   "proprietaire": "Aircraft Guaranty Corp Trustee",
   "avions": 3,
   "vols": 0
 },
 {
   "proprietaire": "Province Of Manitoba",
   "avions": 1,
   "vols": 0
 },
 {
   "proprietaire": "Province Of Ontario, Ministry Of Community Safety And Correctional Services",
   "avions": 1,
   "vols": 0
 },
 {
   "proprietaire": "Waylawn Limited",
   "avions": 1,
   "vols": 0
 },
 {
   "proprietaire": "Airblue Eagle Inc",
   "avions": 1,
   "vols": 0
 },
 {
   "proprietaire": "Wd Journeys Inc",
   "avions": 1,
   "vols": 0
 },
 {
   "proprietaire": "Airbill Inc",
   "avions": 1,
   "vols": 0
 },
 {
   "proprietaire": "Queen Victoria Air Limited Partnership 1, By Its General Partner, Queen Victoria Air Inc.",
   "avions": 1,
   "vols": 0
 },
 {
   "proprietaire": "Radair Llc",
   "avions": 1,
   "vols": 0
 },
 {
   "proprietaire": "Air Metro Llc",
   "avions": 1,
   "vols": 0
 },
 {
   "proprietaire": "Rambus Management Inc",
   "avions": 1,
   "vols": 0
 },
 {
   "proprietaire": "Randolph Aviation Llc",
   "avions": 3,
   "vols": 0
 },
 {
   "proprietaire": "Air Gato Enterprises Inc",
   "avions": 3,
   "vols": 0
 },
 {
   "proprietaire": "Ray Mcfeetors",
   "avions": 1,
   "vols": 0
 },
 {
   "proprietaire": "Air Dixon Llc",
   "avions": 1,
   "vols": 0
 },
 {
   "proprietaire": "Air Bahnik Llc",
   "avions": 1,
   "vols": 0
 },
 {
   "proprietaire": "Weinrich Air Inc",
   "avions": 1,
   "vols": 0
 },
 {
   "proprietaire": "Air Ambulance By Air Trek Inc",
   "avions": 1,
   "vols": 0
 },
 {
   "proprietaire": "Aic Global Holdings Inc.",
   "avions": 1,
   "vols": 0
 },
 {
   "proprietaire": "Ricardo Pascoe",
   "avions": 1,
   "vols": 0
 },
 {
   "proprietaire": "Aes Tri-state Inc",
   "avions": 1,
   "vols": 0
 },
 {
   "proprietaire": "Rlb Holdings Transportation Llc",
   "avions": 1,
   "vols": 0
 },
 {
   "proprietaire": "Aerospace Leasing Llc",
   "avions": 1,
   "vols": 0
 },
 {
   "proprietaire": "Robert Lehtonen",
   "avions": 1,
   "vols": 0
 },
 {
   "proprietaire": "Rock-tenn Xls Ii Llc",
   "avions": 1,
   "vols": 0
 },
 {
   "proprietaire": "Rock Jet Solutions Llc",
   "avions": 1,
   "vols": 0
 },
 {
   "proprietaire": "Rockwell Automation Inc",
   "avions": 1,
   "vols": 0
 },
 {
   "proprietaire": "Wwe Jet Services Inc",
   "avions": 1,
   "vols": 0
 },
 {
   "proprietaire": "Ross Aviation Inc",
   "avions": 1,
   "vols": 0
 },
 {
   "proprietaire": "Aerosafin Sa",
   "avions": 1,
   "vols": 0
 },
 {
   "proprietaire": "Aerojobeni Sa",
   "avions": 1,
   "vols": 0
 },
 {
   "proprietaire": "Montreal Flying Club Inc.",
   "avions": 1,
   "vols": 0
 },
 {
   "proprietaire": "Aero X Aviation Llc",
   "avions": 1,
   "vols": 0
 },
 {
   "proprietaire": "Rpc Strategies Llc",
   "avions": 1,
   "vols": 0
 },
 {
   "proprietaire": "1431128 Alberta Ltd",
   "avions": 1,
   "vols": 0
 },
 {
   "proprietaire": "Samara Aviation Inc.",
   "avions": 1,
   "vols": 0
 },
 {
   "proprietaire": "Sander Geophysics Limited",
   "avions": 4,
   "vols": 0
 },
 {
   "proprietaire": "Sanfelippo Suncity Inc",
   "avions": 1,
   "vols": 0
 },
 {
   "proprietaire": "Sapphire Air Ii Llc",
   "avions": 1,
   "vols": 0
 },
 {
   "proprietaire": "138883 Canada Inc",
   "avions": 1,
   "vols": 0
 },
 {
   "proprietaire": "Scb Falcon Llc",
   "avions": 1,
   "vols": 0
 },
 {
   "proprietaire": "West Fraser Air Ltd",
   "avions": 1,
   "vols": 0
 },
 {
   "proprietaire": "Shamrock Capital Corp Llc",
   "avions": 1,
   "vols": 0
 },
 {
   "proprietaire": "Shoreland Transport Inc.",
   "avions": 1,
   "vols": 0
 },
 {
   "proprietaire": "Aero Pegasus Llc",
   "avions": 1,
   "vols": 0
 },
 {
   "proprietaire": "Adam Wachtel",
   "avions": 1,
   "vols": 0
 },
 {
   "proprietaire": "Sierra Juliet Llc",
   "avions": 1,
   "vols": 0
 },
 {
   "proprietaire": "Sierra Pacific Industries",
   "avions": 1,
   "vols": 0
 },
 {
   "proprietaire": "Acqr Leasing Llc",
   "avions": 1,
   "vols": 0
 },
 {
   "proprietaire": "Ack Saratoga Cooperative Ltd Partnership",
   "avions": 1,
   "vols": 0
 },
 {
   "proprietaire": "Sky Explorer Ltd",
   "avions": 1,
   "vols": 0
 },
 {
   "proprietaire": "A O Smith Corp",
   "avions": 1,
   "vols": 0
 },
 {
   "proprietaire": "Sky Velocity Aviation Llc",
   "avions": 1,
   "vols": 0
 },
 {
   "proprietaire": "126700 Aircraft Canada Inc. (lake Central Airways)",
   "avions": 1,
   "vols": 0
 },
 {
   "proprietaire": "Skycharter Limited",
   "avions": 1,
   "vols": 0
 },
 {
   "proprietaire": "9929711 Canada Inc.",
   "avions": 1,
   "vols": 0
 },
 {
   "proprietaire": "9916288 Canada Inc.",
   "avions": 1,
   "vols": 0
 },
 {
   "proprietaire": "Skyways Inc",
   "avions": 1,
   "vols": 0
 },
 {
   "proprietaire": "9453-2322 Québec Inc.",
   "avions": 1,
   "vols": 0
 },
 {
   "proprietaire": "9377-1004 Québec Inc.",
   "avions": 1,
   "vols": 0
 },
 {
   "proprietaire": "Sl Management Llc",
   "avions": 1,
   "vols": 0
 },
 {
   "proprietaire": "Sls Travel Llc",
   "avions": 1,
   "vols": 0
 },
 {
   "proprietaire": "Sn1237 Llc",
   "avions": 1,
   "vols": 0
 },
 {
   "proprietaire": "Sobeys Capital Incorporated",
   "avions": 2,
   "vols": 0
 },
 {
   "proprietaire": "Soucy Aviation Inc.",
   "avions": 1,
   "vols": 0
 },
 {
   "proprietaire": "Southeast Air Transportation Inc",
   "avions": 1,
   "vols": 0
 },
 {
   "proprietaire": "Southern Aircraft Consultancy Inc Trustee",
   "avions": 1,
   "vols": 0
 },
 {
   "proprietaire": "Southern Ontario Water Conditioning Inc.",
   "avions": 1,
   "vols": 0
 },
 {
   "proprietaire": "Southern Sky Aviation Llc",
   "avions": 1,
   "vols": 0
 },
 {
   "proprietaire": "Spark Aviation Llc",
   "avions": 1,
   "vols": 0
 },
 {
   "proprietaire": "Speedbird Aviation Llc",
   "avions": 1,
   "vols": 0
 },
 {
   "proprietaire": "Spotlight Management Llc",
   "avions": 1,
   "vols": 0
 },
 {
   "proprietaire": "Srarombert Aviation Llc",
   "avions": 1,
   "vols": 0
 },
 {
   "proprietaire": "St Catharines Flying Club",
   "avions": 1,
   "vols": 0
 },
 {
   "proprietaire": "St. Thomas Flight Centre Ltd.",
   "avions": 1,
   "vols": 0
 },
 {
   "proprietaire": "Steven Brothers Aviation Llc",
   "avions": 1,
   "vols": 0
 },
 {
   "proprietaire": "Stf Investment Cc",
   "avions": 1,
   "vols": 0
 },
 {
   "proprietaire": "Strand Capital Group Llc",
   "avions": 1,
   "vols": 0
 },
 {
   "proprietaire": "Studer Fertilizer Inc",
   "avions": 1,
   "vols": 0
 },
 {
   "proprietaire": "926724 Ontario Ltd.",
   "avions": 1,
   "vols": 0
 },
 {
   "proprietaire": "126700 Aircraft Canada Inc.",
   "avions": 1,
   "vols": 0
 },
 {
   "proprietaire": "9223-8724 Québec Inc.",
   "avions": 1,
   "vols": 0
 },
 {
   "proprietaire": "917ms Llc",
   "avions": 1,
   "vols": 0
 },
 {
   "proprietaire": "Suncor Energy Inc. Suncor Energie Inc.",
   "avions": 1,
   "vols": 0
 },
 {
   "proprietaire": "Sunnyfield Aviation Associates Llc",
   "avions": 1,
   "vols": 0
 },
 {
   "proprietaire": "9159509 Canada Inc.",
   "avions": 1,
   "vols": 0
 },
 {
   "proprietaire": "9115-9996 Québec Inc",
   "avions": 1,
   "vols": 0
 },
 {
   "proprietaire": "9094-6039 Quebec Inc",
   "avions": 1,
   "vols": 0
 },
 {
   "proprietaire": "9000-3153 Quebec Inc",
   "avions": 1,
   "vols": 0
 },
 {
   "proprietaire": "888676 Alberta Inc",
   "avions": 1,
   "vols": 0
 },
 {
   "proprietaire": "711 Cody Inc",
   "avions": 1,
   "vols": 0
 },
 {
   "proprietaire": "Syncrude Canada Ltd",
   "avions": 2,
   "vols": 0
 },
 {
   "proprietaire": "Tacocat Llc",
   "avions": 1,
   "vols": 0
 },
 {
   "proprietaire": "0827259 Bc Ltd",
   "avions": 1,
   "vols": 0
 },
 {
   "proprietaire": "Tak Aviation Llc",
   "avions": 1,
   "vols": 0
 },
 {
   "proprietaire": "Tauck Peter F",
   "avions": 1,
   "vols": 0
 },
 {
   "proprietaire": "Taughannock Aviation Corp",
   "avions": 1,
   "vols": 0
 },
 {
   "proprietaire": "Tcn Transport 300 Llc",
   "avions": 1,
   "vols": 0
 },
 {
   "proprietaire": "10613592 Canada Inc.",
   "avions": 1,
   "vols": 0
 },
 {
   "proprietaire": "Technisonic Industries Ltd.",
   "avions": 1,
   "vols": 0
 },
 {
   "proprietaire": "Televantos Holdings Llc",
   "avions": 1,
   "vols": 0
 },
 {
   "proprietaire": "Telus Communications Inc.",
   "avions": 1,
   "vols": 0
 },
 {
   "proprietaire": "Tend-air Llc",
   "avions": 1,
   "vols": 0
 },
 {
   "proprietaire": "White Birch Aviation Llc",
   "avions": 1,
   "vols": 0
 },
 {
   "proprietaire": "Terence R Cunningham",
   "avions": 1,
   "vols": 0
 },
 {
   "proprietaire": "Textron Aviation Inc",
   "avions": 1,
   "vols": 0
 },
 {
   "proprietaire": "Textron Financial Corp",
   "avions": 1,
   "vols": 0
 },
 {
   "proprietaire": "701019 Nb Inc.",
   "avions": 1,
   "vols": 0
 },
 {
   "proprietaire": "The Bank Of Nova Scotia",
   "avions": 1,
   "vols": 0
 },
 {
   "proprietaire": "691042 N.-b. Inc",
   "avions": 1,
   "vols": 0
 },
 {
   "proprietaire": "Thin Air Holding Llc",
   "avions": 1,
   "vols": 0
 },
 {
   "proprietaire": "Thk Holdings Llc",
   "avions": 1,
   "vols": 0
 },
 {
   "proprietaire": "Titan Aviation Llc",
   "avions": 1,
   "vols": 0
 },
 {
   "proprietaire": "Tli Aviation Llc",
   "avions": 1,
   "vols": 0
 },
 {
   "proprietaire": "Corporate Wings Llc",
   "avions": 1,
   "vols": 0
 },
 {
   "proprietaire": "Cosmic Joke Llc",
   "avions": 1,
   "vols": 0
 },
 {
   "proprietaire": "Costar Field Research Llc",
   "avions": 1,
   "vols": 0
 },
 {
   "proprietaire": "Costco Wholesale Corp",
   "avions": 2,
   "vols": 0
 },
 {
   "proprietaire": "Cox Aviation Llc",
   "avions": 1,
   "vols": 0
 },
 {
   "proprietaire": "Command Air Llc",
   "avions": 1,
   "vols": 0
 },
 {
   "proprietaire": "Cti Of North Carolina Inc",
   "avions": 1,
   "vols": 0
 },
 {
   "proprietaire": "Cxlh2 Llc",
   "avions": 1,
   "vols": 0
 },
 {
   "proprietaire": "Tm Cj3 Llc",
   "avions": 1,
   "vols": 0
 },
 {
   "proprietaire": "D & E Aviation Llc",
   "avions": 1,
   "vols": 0
 },
 {
   "proprietaire": "Tp Aviation Ii Llc",
   "avions": 1,
   "vols": 0
 },
 {
   "proprietaire": "Dassault Falcon Jet Corp",
   "avions": 1,
   "vols": 0
 },
 {
   "proprietaire": "David G. Fountain",
   "avions": 1,
   "vols": 0
 },
 {
   "proprietaire": "Delafield Co",
   "avions": 1,
   "vols": 0
 },
 {
   "proprietaire": "Delastek Inc.",
   "avions": 1,
   "vols": 0
 },
 {
   "proprietaire": "White Mountains Capital Llc",
   "avions": 1,
   "vols": 0
 },
 {
   "proprietaire": "Cola Express Llc",
   "avions": 1,
   "vols": 0
 },
 {
   "proprietaire": "Coca-cola Bottling Company",
   "avions": 1,
   "vols": 0
 },
 {
   "proprietaire": "Clyde Air Llc",
   "avions": 1,
   "vols": 0
 },
 {
   "proprietaire": "Trans-exec Air Service Inc",
   "avions": 2,
   "vols": 0
 },
 {
   "proprietaire": "Dennis Fortier",
   "avions": 1,
   "vols": 0
 },
 {
   "proprietaire": "Development Authority Of Dekalb County",
   "avions": 1,
   "vols": 0
 },
 {
   "proprietaire": "Dhz Llc",
   "avions": 1,
   "vols": 0
 },
 {
   "proprietaire": "Classic Wings Inc.",
   "avions": 1,
   "vols": 0
 },
 {
   "proprietaire": "Dog Air Llc",
   "avions": 1,
   "vols": 0
 },
 {
   "proprietaire": "Dorssers Usa Inc",
   "avions": 1,
   "vols": 0
 },
 {
   "proprietaire": "Transcanada Pipelines Limited",
   "avions": 2,
   "vols": 0
 },
 {
   "proprietaire": "Douglas (doug) Sinclair",
   "avions": 1,
   "vols": 0
 },
 {
   "proprietaire": "Dynamic Aviation Llc",
   "avions": 1,
   "vols": 0
 },
 {
   "proprietaire": "E & A Aviation Llc",
   "avions": 1,
   "vols": 0
 },
 {
   "proprietaire": "Eagle Air Llc",
   "avions": 1,
   "vols": 0
 },
 {
   "proprietaire": "Citation X17 Ventures Llc",
   "avions": 1,
   "vols": 0
 },
 {
   "proprietaire": "Eal Leasing Inc",
   "avions": 1,
   "vols": 0
 },
 {
   "proprietaire": "Transnet Aviation Group Llc",
   "avions": 1,
   "vols": 0
 },
 {
   "proprietaire": "6769292 Canada Inc.",
   "avions": 1,
   "vols": 0
 },
 {
   "proprietaire": "Econtrols Operations Llc",
   "avions": 1,
   "vols": 0
 },
 {
   "proprietaire": "Elbow River Helicopters Ltd.",
   "avions": 1,
   "vols": 0
 },
 {
   "proprietaire": "Elmar Marine Corp",
   "avions": 1,
   "vols": 0
 },
 {
   "proprietaire": "Tremlease Leasing Inc.",
   "avions": 1,
   "vols": 0
 },
 {
   "proprietaire": "Emerson Electric Co",
   "avions": 1,
   "vols": 0
 },
 {
   "proprietaire": "Trevor W Hicks",
   "avions": 1,
   "vols": 0
 },
 {
   "proprietaire": "Cit2 Holdings Llc",
   "avions": 1,
   "vols": 0
 },
 {
   "proprietaire": "Enterprise Holdings Inc",
   "avions": 1,
   "vols": 0
 },
 {
   "proprietaire": "Eon Airborne Inc.",
   "avions": 1,
   "vols": 0
 },
 {
   "proprietaire": "Tri-city Aero Maintenance Inc.",
   "avions": 1,
   "vols": 0
 },
 {
   "proprietaire": "Estrie Hélicoptères Inc.",
   "avions": 1,
   "vols": 0
 },
 {
   "proprietaire": "Evertz Microsystems Ltd.",
   "avions": 1,
   "vols": 0
 },
 {
   "proprietaire": "Tudor Investment Corp",
   "avions": 1,
   "vols": 0
 },
 {
   "proprietaire": "Cinitsa Llc",
   "avions": 1,
   "vols": 0
 },
 {
   "proprietaire": "Christopher O. Elgar",
   "avions": 1,
   "vols": 0
 },
 {
   "proprietaire": "650584 Alberta Inc (latitude Air Ambulance)",
   "avions": 2,
   "vols": 0
 },
 {
   "proprietaire": "Falcon 50 Llc",
   "avions": 1,
   "vols": 0
 },
 {
   "proprietaire": "Cgg Aviation (canada) Limited",
   "avions": 1,
   "vols": 0
 },
 {
   "proprietaire": "Cffi Ventures Inc.",
   "avions": 2,
   "vols": 0
 },
 {
   "proprietaire": "Fc Mustang Llc",
   "avions": 1,
   "vols": 0
 },
 {
   "proprietaire": "650584 Alberta Inc",
   "avions": 1,
   "vols": 0
 },
 {
   "proprietaire": "Cessna Finance Corp",
   "avions": 1,
   "vols": 0
 },
 {
   "proprietaire": "Cavu Aviation Llc",
   "avions": 1,
   "vols": 0
 },
 {
   "proprietaire": "Cava Llc",
   "avions": 1,
   "vols": 0
 },
 {
   "proprietaire": "Cascades Inc.",
   "avions": 2,
   "vols": 0
 },
 {
   "proprietaire": "Tvc Transportation Llc",
   "avions": 1,
   "vols": 0
 },
 {
   "proprietaire": "618232 Alberta Ltd.",
   "avions": 1,
   "vols": 0
 },
 {
   "proprietaire": "Fly Anytime Llc",
   "avions": 1,
   "vols": 0
 },
 {
   "proprietaire": "5gus Inc",
   "avions": 1,
   "vols": 0
 },
 {
   "proprietaire": "514744 Ontario Limited",
   "avions": 1,
   "vols": 0
 },
 {
   "proprietaire": "Flying Success Llc",
   "avions": 1,
   "vols": 0
 },
 {
   "proprietaire": "Flyteme Aviation Llc",
   "avions": 1,
   "vols": 0
 },
 {
   "proprietaire": "Flyway Travel Llc",
   "avions": 1,
   "vols": 0
 },
 {
   "proprietaire": "Fort Aero House Llc",
   "avions": 1,
   "vols": 0
 },
 {
   "proprietaire": "Fournier Pierre-marc",
   "avions": 1,
   "vols": 0
 },
 {
   "proprietaire": "Freedman Stephen Eric",
   "avions": 1,
   "vols": 0
 },
 {
   "proprietaire": "Freiburger Aviation Inc.",
   "avions": 1,
   "vols": 0
 },
 {
   "proprietaire": "U-haul Business Consultants Inc",
   "avions": 1,
   "vols": 0
 },
 {
   "proprietaire": "Frist Aviation Llc",
   "avions": 1,
   "vols": 0
 },
 {
   "proprietaire": "Ftc-llc",
   "avions": 1,
   "vols": 0
 },
 {
   "proprietaire": "Capital Holdings 209 Llc",
   "avions": 1,
   "vols": 0
 },
 {
   "proprietaire": "Future Electronics Inc.",
   "avions": 1,
   "vols": 0
 },
 {
   "proprietaire": "G 137 Llc",
   "avions": 1,
   "vols": 0
 },
 {
   "proprietaire": "U-haul Co Of Oregon",
   "avions": 1,
   "vols": 0
 },
 {
   "proprietaire": "Galaxy Airways Inc.",
   "avions": 1,
   "vols": 0
 },
 {
   "proprietaire": "Gama Charters Inc",
   "avions": 1,
   "vols": 0
 },
 {
   "proprietaire": "Gandel Investments P/l",
   "avions": 1,
   "vols": 0
 },
 {
   "proprietaire": "Gbbc Flight Llc",
   "avions": 1,
   "vols": 0
 },
 {
   "proprietaire": "Capital City Jet Center Inc",
   "avions": 1,
   "vols": 0
 },
 {
   "proprietaire": "General Avileasing Inc",
   "avions": 1,
   "vols": 0
 },
 {
   "proprietaire": "General Dynamics Mission Systems Inc",
   "avions": 1,
   "vols": 0
 },
 {
   "proprietaire": "General Electric Co",
   "avions": 1,
   "vols": 0
 },
 {
   "proprietaire": "General Industries Llc",
   "avions": 1,
   "vols": 0
 },
 {
   "proprietaire": "Genuine Parts Co",
   "avions": 1,
   "vols": 0
 },
 {
   "proprietaire": "Geotech Aviation Ltd.",
   "avions": 1,
   "vols": 0
 },
 {
   "proprietaire": "Cape Clear Llc",
   "avions": 1,
   "vols": 0
 },
 {
   "proprietaire": "Canal Air Llc",
   "avions": 1,
   "vols": 0
 },
 {
   "proprietaire": "Gestion Matthieu Delorme Inc.",
   "avions": 1,
   "vols": 0
 },
 {
   "proprietaire": "Canadian Utilities Limited",
   "avions": 1,
   "vols": 0
 },
 {
   "proprietaire": "Canadian Pacific Railway Company",
   "avions": 1,
   "vols": 0
 },
 {
   "proprietaire": "Global Aircraft Solutions Llc Trustee",
   "avions": 1,
   "vols": 0
 },
 {
   "proprietaire": "Global Flight Inc",
   "avions": 1,
   "vols": 0
 },
 {
   "proprietaire": "Global Jetcare Inc",
   "avions": 1,
   "vols": 0
 },
 {
   "proprietaire": "Golf Air Inc",
   "avions": 1,
   "vols": 0
 },
 {
   "proprietaire": "Canadian Helicopters Limited - Hélicoptères Canadiens Limitée",
   "avions": 3,
   "vols": 0
 },
 {
   "proprietaire": "Canadian Energy Services L. P.",
   "avions": 1,
   "vols": 0
 },
 {
   "proprietaire": "Government Of Canada, Royal Canadian Mounted Police",
   "avions": 5,
   "vols": 0
 },
 {
   "proprietaire": "Grandview Aviation Llc",
   "avions": 1,
   "vols": 0
 },
 {
   "proprietaire": "Cameron Air Service Ltd",
   "avions": 2,
   "vols": 0
 },
 {
   "proprietaire": "Cambria Aviation Llc",
   "avions": 1,
   "vols": 0
 },
 {
   "proprietaire": "Grondin Transport Inc.",
   "avions": 1,
   "vols": 0
 },
 {
   "proprietaire": "Elivation - Geyser Group Inc.",
   "avions": 1,
   "vols": 0
 },
 {
   "proprietaire": "Guay Inc.",
   "avions": 1,
   "vols": 0
 },
 {
   "proprietaire": "Gujer, Hans-jürg",
   "avions": 1,
   "vols": 0
 },
 {
   "proprietaire": "2395173 Ontario Limited",
   "avions": 1,
   "vols": 0
 },
 {
   "proprietaire": "Gulfstream Aerospace Corp",
   "avions": 1,
   "vols": 0
 },
 {
   "proprietaire": "Gulfstream Leasing Llc",
   "avions": 1,
   "vols": 0
 }
]