{
  "project_info": {
    "project_number": "860626293153",
    "firebase_url": "https://berwig-gerenciadorfinanceiro.firebaseio.com",
    "project_id": "berwig-gerenciadorfinanceiro",
    "storage_bucket": "berwig-gerenciadorfinanceiro.appspot.com"
  },
  "client": [
    {
      "client_info": {
        "mobilesdk_app_id": "1:860626293153:android:a7b38d24f812e907",
        "android_client_info": {
          "package_name": "io.github.mathiasberwig.gerenciadorfinanceiro"
        }
      },
      "oauth_client": [
        {
          "client_id": "860626293153-0orj1cubhmqm5373bjp1ghejs3j5hbi5.apps.googleusercontent.com",
          "client_type": 3
        }
      ],
      "api_key": [
        {
          "current_key": "AIzaSyAPRVGWhBcJqRRm0xvadaiPEKXjgtVC3VU"
        }
      ],
      "services": {
        "analytics_service": {
          "status": 1
        },
        "appinvite_service": {
          "status": 1,
          "other_platform_oauth_client": []
        },
        "ads_service": {
          "status": 2
        }
      }
    }
  ],
  "configuration_version": "1"
}