[gd_scene load_steps=9 format=1]

[ext_resource path="res://scripts/pikachu.gd" type="Script" id=1]
[ext_resource path="res://models/pikachu/pikachu.scn" type="PackedScene" id=2]
[ext_resource path="res://sprites/particle_clouds.png" type="Texture" id=3]
[ext_resource path="res://sfx/sound_coin.wav" type="Sample" id=4]
[ext_resource path="res://sfx/sound_hit.wav" type="Sample" id=5]

[sub_resource type="CapsuleShape" id=1]

radius = 0.15
height = 0.2

[sub_resource type="FixedMaterial" id=2]

flags/visible = true
flags/double_sided = false
flags/invert_faces = false
flags/unshaded = false
flags/on_top = false
flags/lightmap_on_uv2 = true
flags/colarray_is_srgb = true
params/blend_mode = 0
params/depth_draw = 1
params/line_width = 0.0
fixed_flags/use_alpha = true
fixed_flags/use_color_array = false
fixed_flags/use_point_size = false
fixed_flags/discard_alpha = false
fixed_flags/use_xy_normalmap = false
params/diffuse = Color( 0.917969, 0.736774, 0.681305, 1 )
params/specular = Color( 0, 0, 0, 1 )
params/emission = Color( 0, 0, 0, 1 )
params/specular_exp = 40
params/detail_mix = 1.0
params/normal_depth = 1
params/shader = 0
params/shader_param = 0.5
params/glow = 0
params/point_size = 1.0
uv_xform = Transform( 1, 0, 0, 0, 1, 0, 0, 0, 1, 0, 0, 0 )
textures/diffuse = ExtResource( 3 )
textures/diffuse_tc = 0
textures/detail_tc = 0
textures/specular_tc = 0
textures/emission_tc = 0
textures/specular_exp_tc = 0
textures/glow_tc = 0
textures/normal_tc = 0
textures/shade_param_tc = 0

[sub_resource type="SampleLibrary" id=3]

samples/sound_coin = {
"db": 0.0,
"pitch": 1.0,
"priority": 0,
"sample": ExtResource( 4 )
}
samples/sound_hit = {
"db": 0.0,
"pitch": 1.0,
"priority": 0,
"sample": ExtResource( 5 )
}

[node name="pikachu" type="KinematicBody"]

_import_transform = Transform( 1, 0, 0, 0, 1, 0, 0, 0, 1, 0, 0, 0 )
input/ray_pickable = true
input/capture_on_drag = false
shape_count = 1
shapes/0/shape = SubResource( 1 )
shapes/0/transform = Transform( 1, 0, 0, 0, -4.37114e-08, -1, 0, 1, -4.37114e-08, 0, 0.249611, 0 )
shapes/0/trigger = false
collision/layers = 1
collision/mask = 1
collide_with/static = true
collide_with/kinematic = true
collide_with/rigid = true
collide_with/character = true
collision/margin = 0.001
script/script = ExtResource( 1 )

[node name="col" type="CollisionShape" parent="."]

_import_transform = Transform( 1, 0, 0, 0, 1, 0, 0, 0, 1, 0, 0, 0 )
transform/local = Transform( 1, 0, 0, 0, -4.37114e-08, -1, 0, 1, -4.37114e-08, 0, 0.249611, 0 )
shape = SubResource( 1 )
trigger = false
_update_shape_index = 0

[node name="pikachu" parent="." instance=ExtResource( 2 )]

transform/local = Transform( -0.380763, 0, -1.24069e-07, 0, 0.380763, 0, 1.24069e-07, 0, -0.380763, 0, 0, 0 )

[node name="particle" type="Particles" parent="."]

_import_transform = Transform( 1, 0, 0, 0, 1, 0, 0, 0, 1, 0, 0, 0 )
layers = 1
geometry/visible = true
geometry/material_override = null
geometry/cast_shadow = 1
geometry/receive_shadows = true
geometry/range_begin = 0.0
geometry/range_end = 0.0
geometry/extra_cull_margin = 0.0
geometry/billboard = false
geometry/billboard_y = false
geometry/depth_scale = false
geometry/visible_in_all_rooms = false
geometry/use_baked_light = false
geometry/baked_light_tex_id = 0
material = SubResource( 2 )
amount = 4
emitting = true
visibility = AABB( -4, -4, -4, 8, 8, 8 )
emission_extents = Vector3( 0.1, 0.1, 0.1 )
emission_base_velocity = Vector3( 0, 0.2, 0 )
emission_points = Vector3Array(  )
gravity_normal = Vector3( 0, 0.1, 0 )
local_coords = false
emit_timeout = 0.0
vars/lifetime = 0.1
vars/spread = 0.2
vars/gravity = 9.8
vars/linear_vel = 0.2
vars/angular_vel = 30.0
vars/linear_accel = 0.0
vars/radial_accel = 0.0
vars/tan_accel = 0.0
vars/damping = 0.0
vars/initial_size = 0.04
vars/final_size = 0.12
vars/initial_angle = 0.0
vars/height_from_velocity = false
vars/height = 1.0
vars/height_speed_scale = 0.0
rand/lifetime = 0.0
rand/spread = 0.0
rand/gravity = 0.0
rand/linear_vel = 0.0
rand/angular_vel = 0.0
rand/linear_accel = 0.0
rand/radial_accel = 0.0
rand/tan_accel = 0.0
rand/damping = 0.0
rand/initial_size = 0.0
rand/final_size = 0.0
rand/initial_angle = 0.0
rand/height = 0.0
rand/height_speed_scale = 0.0
color_phases/count = 0
phase_0/pos = 0.0
phase_0/color = Color( 1, 1, 1, 1 )
phase_1/pos = 1.0
phase_1/color = Color( 0, 0, 0, 1 )
phase_2/pos = 1.0
phase_2/color = Color( 0, 0, 0, 1 )
phase_3/pos = 1.0
phase_3/color = Color( 0, 0, 0, 1 )

[node name="sfx" type="SpatialSamplePlayer" parent="."]

_import_transform = Transform( 1, 0, 0, 0, 1, 0, 0, 0, 1, 0, 0, 0 )
params/volume_db = 0.0
params/pitch_scale = 1.0
params/attenuation/min_distance = 1.0
params/attenuation/max_distance = 100.0
params/attenuation/distance_exp = 1.0
params/emission_cone/degrees = 180.0
params/emission_cone/attenuation_db = -6.0
config/polyphony = 1
config/samples = SubResource( 3 )


