[gd_scene load_steps=14 format=1]

[ext_resource path="res://scripts/game.gd" type="Script" id=1]
[ext_resource path="res://fonts/kenvector_med.fnt" type="BitmapFont" id=2]
[ext_resource path="res://fonts/kenvector_big.fnt" type="BitmapFont" id=3]
[ext_resource path="res://sprites/ui/blue_button00.png" type="Texture" id=4]
[ext_resource path="res://fonts/kenvector.fnt" type="BitmapFont" id=5]
[ext_resource path="res://skybox.cbm" type="CubeMap" id=6]
[ext_resource path="res://prefabs/pikachu.tscn" type="PackedScene" id=7]
[ext_resource path="res://scripts/level.gd" type="Script" id=8]
[ext_resource path="res://sfx/Rest_Outro.opus" type="AudioStream" id=9]

[sub_resource type="GDScript" id=1]

script/source = "extends Label

func _ready():
	set_process(true);

func _process(delta):
	set_text(\"FPS: \"+str(OS.get_frames_per_second()));"

[sub_resource type="Animation" id=2]

length = 1.0
loop = false
step = 0.1
tracks/0/type = "value"
tracks/0/path = NodePath(".:visibility/visible")
tracks/0/interp = 1
tracks/0/imported = false
tracks/0/keys = {
"times": FloatArray( 0.5 ),
"transitions": FloatArray( 1 ),
"update": 1,
"values": [ true ]
}
tracks/1/type = "value"
tracks/1/path = NodePath(".:visibility/opacity")
tracks/1/interp = 1
tracks/1/imported = false
tracks/1/keys = {
"times": FloatArray( 0.5, 1 ),
"transitions": FloatArray( 1, 1 ),
"update": 0,
"values": [ 0.0, 1.0 ]
}

[sub_resource type="Environment" id=3]

ambient_light/enabled = true
ambient_light/color = Color( 1, 1, 1, 1 )
ambient_light/energy = 1.0
fxaa/enabled = false
background/mode = 4
background/color = Color( 0, 0, 0, 1 )
background/cubemap = ExtResource( 6 )
background/energy = 1.0
background/scale = 1.0
background/glow = 0.0
background/canvas_max_layer = null
glow/enabled = false
glow/blur_passes = 1
glow/blur_scale = 1
glow/blur_strength = 1
glow/blur_blend_mode = null
glow/bloom = 0.1
glow/bloom_treshold = 0.5
dof_blur/enabled = false
dof_blur/blur_passes = 1
dof_blur/begin = 100.0
dof_blur/range = 10.0
hdr/enabled = false
hdr/tonemapper = 0
hdr/exposure = 0.4
hdr/white = 1.0
hdr/glow_treshold = 0.95
hdr/glow_scale = 0.2
hdr/min_luminance = 0.4
hdr/max_luminance = 8.0
hdr/exposure_adj_speed = 0.5
fog/enabled = false
fog/begin = 10.0
fog/begin_color = Color( 1, 1, 1, 1 )
fog/end_color = Color( 1, 1, 1, 1 )
fog/attenuation = 0.5
fog/bg = true
bcs/enabled = false
bcs/brightness = 1.0
bcs/contrast = 1.0
bcs/saturation = 1.0
srgb/enabled = false

[sub_resource type="GDScript" id=4]

script/source = "
extends Camera

var offset = Vector3();
var target = null;

func _ready():
	offset = get_translation();
	target = get_node(\"../pikachu\");
	
	set_process(true);

func _process(delta):
	var pos = get_translation();
	pos.x = lerp(pos.x, target.get_translation().x, 10*delta);
	pos.y = offset.y;#+target.get_translation().y;
	pos.z = offset.z+target.get_translation().z;
	set_translation(pos);
"

[node name="game" type="Node"]

script/script = ExtResource( 1 )

[node name="gui" type="Control" parent="."]

anchor/right = 1
anchor/bottom = 1
focus/ignore_mouse = false
focus/stop_mouse = true
size_flags/horizontal = 2
size_flags/vertical = 2
margin/left = 0.0
margin/top = 0.0
margin/right = 0.0
margin/bottom = 0.0

[node name="fps" type="Label" parent="gui"]

focus/ignore_mouse = true
focus/stop_mouse = true
size_flags/horizontal = 2
size_flags/vertical = 0
margin/left = 380.0
margin/top = 10.0
margin/right = 470.0
margin/bottom = 24.0
text = "FPS:"
align = 2
percent_visible = 1.0
lines_skipped = 0
max_lines_visible = -1
script/script = SubResource( 1 )

[node name="lblScore" type="Label" parent="gui"]

focus/ignore_mouse = true
focus/stop_mouse = true
size_flags/horizontal = 2
size_flags/vertical = 0
margin/left = 30.0
margin/top = 30.0
margin/right = 187.0
margin/bottom = 54.0
custom_fonts/font = ExtResource( 2 )
custom_colors/font_color = Color( 1, 1, 1, 1 )
text = "Score: 0"
percent_visible = 1.0
lines_skipped = 0
max_lines_visible = -1

[node name="lblChallenge" type="Label" parent="gui"]

focus/ignore_mouse = true
focus/stop_mouse = true
size_flags/horizontal = 2
size_flags/vertical = 0
margin/left = 98.0
margin/top = 554.0
margin/right = 378.0
margin/bottom = 590.0
custom_fonts/font = ExtResource( 3 )
custom_colors/font_color = Color( 1, 1, 1, 1 )
custom_colors/font_color_shadow = Color( 0, 0, 0, 1 )
align = 1
valign = 1
percent_visible = 1.0
lines_skipped = 0
max_lines_visible = -1

[node name="panel_gameover" type="Control" parent="gui"]

editor/display_folded = true
anchor/left = 3
anchor/top = 3
anchor/right = 3
anchor/bottom = 3
focus/ignore_mouse = false
focus/stop_mouse = true
size_flags/horizontal = 2
size_flags/vertical = 2
margin/left = 160.0
margin/top = 160.0
margin/right = -160.0
margin/bottom = -160.0

[node name="lblGameover" type="Label" parent="gui/panel_gameover"]

focus/ignore_mouse = true
focus/stop_mouse = true
size_flags/horizontal = 2
size_flags/vertical = 0
margin/left = 0.0
margin/top = 0.0
margin/right = 320.0
margin/bottom = 36.0
custom_fonts/font = ExtResource( 3 )
custom_colors/font_color = Color( 1, 1, 1, 1 )
text = "Game over!"
align = 1
percent_visible = 1.0
lines_skipped = 0
max_lines_visible = -1

[node name="btnRestart" type="TextureButton" parent="gui/panel_gameover"]

editor/display_folded = true
anchor/left = 3
anchor/top = 1
anchor/right = 3
anchor/bottom = 1
focus/ignore_mouse = false
focus/stop_mouse = true
size_flags/horizontal = 2
size_flags/vertical = 2
margin/left = 95.0
margin/top = 160.0
margin/right = -95.0
margin/bottom = 111.0
toggle_mode = false
enabled_focus_mode = 2
shortcut = null
textures/normal = ExtResource( 4 )
params/resize_mode = 0
params/stretch_mode = 0

[node name="label" type="Label" parent="gui/panel_gameover/btnRestart"]

focus/ignore_mouse = true
focus/stop_mouse = true
size_flags/horizontal = 2
size_flags/vertical = 0
margin/left = 0.0
margin/top = 0.0
margin/right = 190.0
margin/bottom = 49.0
custom_fonts/font = ExtResource( 5 )
custom_colors/font_color = Color( 1, 0.994568, 0.652344, 1 )
text = "Restart"
align = 1
valign = 1
percent_visible = 1.0
lines_skipped = 0
max_lines_visible = -1

[node name="btnQuit" type="TextureButton" parent="gui/panel_gameover"]

editor/display_folded = true
anchor/left = 3
anchor/top = 1
anchor/right = 3
anchor/bottom = 1
focus/ignore_mouse = false
focus/stop_mouse = true
size_flags/horizontal = 2
size_flags/vertical = 2
margin/left = 95.0
margin/top = 100.0
margin/right = -95.0
margin/bottom = 51.0
toggle_mode = false
enabled_focus_mode = 2
shortcut = null
textures/normal = ExtResource( 4 )
params/resize_mode = 0
params/stretch_mode = 0

[node name="label" type="Label" parent="gui/panel_gameover/btnQuit"]

focus/ignore_mouse = true
focus/stop_mouse = true
size_flags/horizontal = 2
size_flags/vertical = 0
margin/left = 0.0
margin/top = 0.0
margin/right = 190.0
margin/bottom = 49.0
custom_fonts/font = ExtResource( 5 )
custom_colors/font_color = Color( 1, 0.994568, 0.652344, 1 )
text = "Quit"
align = 1
valign = 1
percent_visible = 1.0
lines_skipped = 0
max_lines_visible = -1

[node name="AnimationPlayer" type="AnimationPlayer" parent="gui/panel_gameover"]

playback/process_mode = 1
playback/default_blend_time = 0.0
root/root = NodePath("..")
anims/fade_in = SubResource( 2 )
playback/active = true
playback/speed = 1.0
blend_times = [  ]
autoplay = ""

[node name="env" type="Spatial" parent="."]

_import_transform = Transform( 1, 0, 0, 0, 1, 0, 0, 0, 1, 0, 0, 0 )

[node name="WorldEnvironment" type="WorldEnvironment" parent="env"]

_import_transform = Transform( 1, 0, 0, 0, 1, 0, 0, 0, 1, 0, 0, 0 )
environment = SubResource( 3 )

[node name="DirectionalLight" type="DirectionalLight" parent="env"]

_import_transform = Transform( 1, 0, 0, 0, 1, 0, 0, 0, 1, 0, 0, 0 )
transform/local = Transform( 0.819152, -0.286788, 0.496732, -0.148452, 0.73051, 0.666571, -0.554032, -0.619764, 0.555824, 0, 0, 0 )
layers = 1
params/enabled = true
params/editor_only = false
params/bake_mode = 0
params/energy = 0.2
colors/diffuse = Color( 1, 1, 1, 1 )
colors/specular = Color( 1, 1, 1, 1 )
shadow/shadow = true
shadow/darkening = 0.0
shadow/z_offset = 0.05
shadow/z_slope_scale = 0.0
shadow/esm_multiplier = 60.0
shadow/blur_passes = 1.0
projector = null
operator = 0
shadow/mode = 3
shadow/max_distance = 20.0
shadow/split_weight = 0.5
shadow/zoffset_scale = 2.0

[node name="Camera" type="Camera" parent="env"]

_import_transform = Transform( 1, 0, 0, 0, 1, 0, 0, 0, 1, 0, 0, 0 )
transform/local = Transform( 1, 0, 0, 0, 0.939693, 0.34202, 0, -0.34202, 0.939693, 0, 1.5, 2 )
projection = 0
fov = 60.0
near = 0.1
far = 100.0
keep_aspect = 1
current = false
visible_layers = 1048575
environment = null
h_offset = 0.0
v_offset = 0.0
script/script = SubResource( 4 )

[node name="pikachu" parent="env" instance=ExtResource( 7 )]

transform/local = Transform( 1, 0, 0, 0, 1, 0, 0, 0, 1, 0, 0.1, 0 )

[node name="level" type="Spatial" parent="env"]

_import_transform = Transform( 1, 0, 0, 0, 1, 0, 0, 0, 1, 0, 0, 0 )
script/script = ExtResource( 8 )

[node name="music" type="StreamPlayer" parent="."]

stream/stream = ExtResource( 9 )
stream/play = false
stream/loop = true
stream/volume_db = 0.0
stream/autoplay = false
stream/paused = false
stream/loop_restart_time = 0.0
stream/buffering_ms = 500


