<?xml version="1.0" encoding="UTF-8" standalone="no"?>
<!-- Created with Inkscape (http://www.inkscape.org/) -->

<svg
   xmlns:dc="http://purl.org/dc/elements/1.1/"
   xmlns:cc="http://creativecommons.org/ns#"
   xmlns:rdf="http://www.w3.org/1999/02/22-rdf-syntax-ns#"
   xmlns:svg="http://www.w3.org/2000/svg"
   xmlns="http://www.w3.org/2000/svg"
   xmlns:sodipodi="http://sodipodi.sourceforge.net/DTD/sodipodi-0.dtd"
   xmlns:inkscape="http://www.inkscape.org/namespaces/inkscape"
   width="300"
   height="300"
   viewBox="0 0 79.374998 79.375002"
   version="1.1"
   id="svg8"
   inkscape:version="0.92.5 (2060ec1f9f, 2020-04-08)"
   sodipodi:docname="piechart-tutors.svg">
  <defs
     id="defs2" />
  <sodipodi:namedview
     id="base"
     pagecolor="#ffffff"
     bordercolor="#666666"
     borderopacity="1.0"
     inkscape:pageopacity="0.0"
     inkscape:pageshadow="2"
     inkscape:zoom="0.35"
     inkscape:cx="-167.14286"
     inkscape:cy="560"
     inkscape:document-units="mm"
     inkscape:current-layer="g833"
     showgrid="false"
     units="px"
     inkscape:window-width="1920"
     inkscape:window-height="1009"
     inkscape:window-x="1920"
     inkscape:window-y="0"
     inkscape:window-maximized="1" />
  <metadata
     id="metadata5">
    <rdf:RDF>
      <cc:Work
         rdf:about="">
        <dc:format>image/svg+xml</dc:format>
        <dc:type
           rdf:resource="http://purl.org/dc/dcmitype/StillImage" />
        <dc:title></dc:title>
      </cc:Work>
    </rdf:RDF>
  </metadata>
  <g
     inkscape:label="Ebene 1"
     inkscape:groupmode="layer"
     id="layer1"
     transform="translate(0,-217.62498)" />
  <g
     id="g833"
     inkscape:groupmode="layer"
     inkscape:label="Chart-Layer: ['w:10', 'm:17']">
    <circle
       id="circle819"
       style="stroke:#ececec;fill:#f9f9f9"
       r="30"
       cy="39.6874999992"
       cx="39.6874999992" />
    <path
       id="path821"
       style="fill:none;stroke:#000000;stroke-width:1.0px;stroke-linecap:butt;stroke-linejoin:miter;stroke-opacity:1"
       d="m 51.5698996486,67.2339803292 1.18823996494,2.754648033" />
    <text
       id="text823"
       style="font-size:8px;font-style:normal;font-variant:normal;font-weight:normal;font-stretch:normal;font-family:sans-serif;-inkscape-font-specification:Bitstream Charter;fill:#000000"
       y="73.8250603843"
       x="53.5502995901">w</text>
    <path
       style="fill:#b0d18a;fill-opacity:1;stroke:none"
       d="M 69.6875,39.6875 A 30,30 0 0 1 51.5699,67.23398 30,30 0 0 1 19.100261,61.508719 L 39.6875,39.6875 Z"
       id="path825" />
    <path
       id="path827"
       style="fill:none;stroke:#000000;stroke-width:1.0px;stroke-linecap:butt;stroke-linejoin:miter;stroke-opacity:1"
       d="m 27.8050823458,12.1410274354 -1.18824176535,-2.75464725638" />
    <text
       id="text829"
       style="font-size:8px;font-style:normal;font-variant:normal;font-weight:normal;font-stretch:normal;font-family:sans-serif;-inkscape-font-specification:Bitstream Charter;fill:#000000;text-align:end;text-anchor:end"
       y="9.54994867477"
       x="25.8246794035">m</text>
    <path
       style="fill:#7e9e59;fill-opacity:1;stroke:none"
       d="M 19.100261,61.508719 A 30,30 0 0 1 13.420742,25.194142 30,30 0 0 1 47.170704,10.635793 30,30 0 0 1 69.6875,39.687461 l -30,3.9e-5 z"
       id="path831" />
  </g>
</svg>
