<?xml version="1.0" encoding="UTF-8" standalone="no"?>
<!-- Created with Inkscape (http://www.inkscape.org/) -->

<svg
   id="svg5"
   version="1.1"
   viewBox="0 0 241.74586 242.00665"
   height="914.67078"
   width="913.68506"
   sodipodi:docname="piechart-participants.svg"
   inkscape:version="1.1.2 (0a00cf5339, 2022-02-04)"
   xmlns:inkscape="http://www.inkscape.org/namespaces/inkscape"
   xmlns:sodipodi="http://sodipodi.sourceforge.net/DTD/sodipodi-0.dtd"
   xmlns="http://www.w3.org/2000/svg"
   xmlns:svg="http://www.w3.org/2000/svg">
  <sodipodi:namedview
     id="namedview7"
     pagecolor="#ffffff"
     bordercolor="#666666"
     borderopacity="1.0"
     inkscape:pageshadow="2"
     inkscape:pageopacity="0.0"
     inkscape:pagecheckerboard="0"
     inkscape:document-units="mm"
     showgrid="false"
     inkscape:zoom="0.77593294"
     inkscape:cx="429.1608"
     inkscape:cy="310.59385"
     inkscape:window-width="1280"
     inkscape:window-height="1368"
     inkscape:window-x="3200"
     inkscape:window-y="0"
     inkscape:window-maximized="0"
     inkscape:current-layer="g895"
     units="px"
     fit-margin-top="1"
     fit-margin-left="77"
     fit-margin-right="77"
     fit-margin-bottom="1"
     width="759.68506px" />
  <defs
     id="defs2" />
  <g
     inkscape:label="Ebene 1"
     inkscape:groupmode="layer"
     id="layer1"
     transform="translate(15.872917,-27.636303)" />
  <g
     inkscape:groupmode="layer"
     inkscape:label="Chart-Layer: m:61,w:51"
     id="g895"
     transform="translate(15.872917,-27.636303)">
    <circle
       cx="105"
       cy="148.5"
       r="100"
       style="fill:#f9f9f9;stroke:#ececec"
       id="circle881" />
    <path
       d="m 91.021,247.518 -1.11832,7.92145"
       style="fill:none;stroke:#000000;stroke-width:2;stroke-linecap:butt"
       id="path883" />
    <text
       style="font-style:normal;font-variant:normal;font-weight:normal;font-stretch:normal;font-size:20px;font-family:sans-serif;-inkscape-font-specification:'Bitstream Charter';text-align:end;text-anchor:end;fill:#000000"
       x="93.856438"
       y="269.37836"
       id="text885">m</text>
    <path
       sodipodi:type="arc"
       sodipodi:cx="105"
       sodipodi:cy="148.5"
       sodipodi:rx="100"
       sodipodi:ry="100"
       sodipodi:start="0"
       sodipodi:end="3.4220913"
       style="fill:#7e9e59;fill-opacity:1;stroke:none"
       id="path887"
       sodipodi:arc-type="slice"
       d="M 205,148.5 A 100,100 0 0 1 146.6961,239.39244 100,100 0 0 1 39.771294,224.2972 100,100 0 0 1 8.9082485,120.81652 L 105,148.5 Z" />
    <path
       d="m 118.979,49.4819 1.11831,-7.92145"
       style="fill:none;stroke:#000000;stroke-width:2;stroke-linecap:butt"
       id="path889" />
    <text
       style="font-style:normal;font-variant:normal;font-weight:normal;font-stretch:normal;font-size:20px;font-family:sans-serif;-inkscape-font-specification:'Bitstream Charter';text-align:start;text-anchor:start;fill:#000000"
       x="114.02682"
       y="38.838387"
       id="text891">w</text>
    <path
       sodipodi:type="arc"
       sodipodi:cx="105"
       sodipodi:cy="148.5"
       sodipodi:rx="100"
       sodipodi:ry="100"
       sodipodi:start="3.4220913"
       sodipodi:end="6.283184"
       style="fill:#c5ea9a;fill-opacity:1;stroke:none"
       id="path893"
       sodipodi:arc-type="slice"
       d="M 8.9082485,120.81652 A 100,100 0 0 1 118.97893,49.481873 100,100 0 0 1 205,148.49987 L 105,148.5 Z" />
  </g>
</svg>
