<?xml version="1.0" encoding="UTF-8" standalone="no"?>
<!-- Created with Inkscape (http://www.inkscape.org/) -->

<svg
   xmlns:dc="http://purl.org/dc/elements/1.1/"
   xmlns:cc="http://creativecommons.org/ns#"
   xmlns:rdf="http://www.w3.org/1999/02/22-rdf-syntax-ns#"
   xmlns:svg="http://www.w3.org/2000/svg"
   xmlns="http://www.w3.org/2000/svg"
   xmlns:sodipodi="http://sodipodi.sourceforge.net/DTD/sodipodi-0.dtd"
   xmlns:inkscape="http://www.inkscape.org/namespaces/inkscape"
   width="300"
   height="300"
   viewBox="0 0 79.374998 79.375002"
   version="1.1"
   id="svg8"
   sodipodi:docname="piechart-participants.svg"
   inkscape:version="0.92.5 (2060ec1f9f, 2020-04-08)">
  <defs
     id="defs2" />
  <sodipodi:namedview
     id="base"
     pagecolor="#ffffff"
     bordercolor="#666666"
     borderopacity="1.0"
     inkscape:pageopacity="0.0"
     inkscape:pageshadow="2"
     inkscape:zoom="1.88"
     inkscape:cx="-73.682602"
     inkscape:cy="129.46281"
     inkscape:document-units="mm"
     inkscape:current-layer="g1044"
     showgrid="false"
     units="px"
     inkscape:window-width="1920"
     inkscape:window-height="1009"
     inkscape:window-x="1920"
     inkscape:window-y="0"
     inkscape:window-maximized="1" />
  <metadata
     id="metadata5">
    <rdf:RDF>
      <cc:Work
         rdf:about="">
        <dc:format>image/svg+xml</dc:format>
        <dc:type
           rdf:resource="http://purl.org/dc/dcmitype/StillImage" />
        <dc:title />
      </cc:Work>
    </rdf:RDF>
  </metadata>
  <g
     id="g1044"
     inkscape:groupmode="layer"
     inkscape:label="Chart-Layer: ['w:64', 'm:73', 'd:2']">
    <circle
       id="circle1024"
       style="stroke:#ececec;fill:#f9f9f9"
       r="30"
       cy="39.6874999992"
       cx="39.6874999992" />
    <path
       id="path1026"
       style="fill:none;stroke:#000000;stroke-width:1.0px;stroke-linecap:butt;stroke-linejoin:miter;stroke-opacity:1"
       d="m 43.4071408184,69.4560114194 0.371964081922,2.97685114202" />
    <text
       id="text1028"
       style="font-size:8px;font-style:normal;font-variant:normal;font-weight:normal;font-stretch:normal;font-family:sans-serif;-inkscape-font-specification:Bitstream Charter;fill:#000000"
       y="76.4174299895"
       x="44.027080955">w</text>
    <path
       style="fill:#c5ea9a;fill-opacity:1;stroke:none"
       d="M 69.6875,39.6875 A 30,30 0 0 1 43.407141,69.456011 30,30 0 0 1 10.609882,47.069378 L 39.6875,39.6875 Z"
       id="path1030" />
    <path
       id="path1032"
       style="fill:none;stroke:#000000;stroke-width:1.0px;stroke-linecap:butt;stroke-linejoin:miter;stroke-opacity:1"
       d="m 34.6264786053,10.1174803433 -0.50610213939,-2.95700196559" />
    <text
       id="text1034"
       style="font-size:8px;font-style:normal;font-variant:normal;font-weight:normal;font-stretch:normal;font-family:sans-serif;-inkscape-font-specification:Bitstream Charter;fill:#000000;text-align:end;text-anchor:end"
       y="7.18914373399"
       x="33.7829750397">m</text>
    <path
       style="fill:#7e9e59;fill-opacity:1;stroke:none"
       d="M 10.609882,47.069378 A 30,30 0 0 1 19.917729,17.123011 30,30 0 0 1 50.827806,11.832634 30,30 0 0 1 69.564983,36.978988 L 39.6875,39.6875 Z"
       id="path1036" />
    <path
       id="path1038"
       style="fill:none;stroke:#000000;stroke-width:1.0px;stroke-linecap:butt;stroke-linejoin:miter;stroke-opacity:1"
       d="m 69.6568540994,38.3318397107 2.99693541002,-0.13556602885" />
    <text
       id="text1040"
       style="font-size:8px;font-style:normal;font-variant:normal;font-weight:normal;font-stretch:normal;font-family:sans-serif;-inkscape-font-specification:Bitstream Charter;fill:#000000"
       y="40.1058963293"
       x="74.6517464494">d</text>
    <path
       style="fill:#e2ffc2;fill-opacity:1;stroke:none"
       d="m 69.564983,36.978988 a 30,30 0 0 1 0.122517,2.708473 l -30,3.9e-5 z"
       id="path1042" />
  </g>
</svg>
