<svg xmlns="http://www.w3.org/2000/svg" viewBox="-7 -7 38 38"
    stroke-width="1" fill="none" stroke="currentColor" width="150" height="150" color="currentColor">
    <line x1="0.55" y1="22.5" x2="23.45" y2="22.5"></line>
    <line x1="9.14" y1="1.5" x2="21.55" y2="22.5"></line>
    <line x1="14.86" y1="1.5" x2="2.45" y2="22.5"></line>
    <polygon
        points="15.82 22.5 8.18 22.5 12 14.86 15.82 22.5"></polygon>
    <circle cx="12" cy="12" r="18" />
</svg>
