{
    "givenName": "Max",
    "familyName": "Mustermann",
    "gender": "genderfluid",
    "sex": "MALE",
    "birthDate": "2000-01-01",
    "street": "St. Michael Straße",
    "streetNumber": "15",
    "postalCode": "86450",
    "city": "Altenmünster",
    "country": "Deutschland",
    "classYear": "CLASS5",
    "telephone": "+498999998000",
    "emailParents": "erika.mustermann@example.com",
    "emailSelf": "max.mustermann@example.com",
    "topicWishes": ["Komplexe Zahlen", "Zauberwürfel"],
    "emergencyContact_0": { "name": "Erika Mustermann", "telephone": "+498999998002" },
    "emergencyContact_1": { "name": "Tobi Mustermann", "telephone": "+498999998003" },
    "emergencyContact_2": { "name": "Oma", "telephone": "+498999998004" },
    "arrival": "BUS",
    "departure": "BUS",
    "departureNotes": "",
    "nutrition": "VEGAN",
    "foodRestriction": "Nüsse, Kaffee",
    "healthImpairment": ["Kaffeeallergie"],
    "drugs": [],
    "removeTicks": true,
    "roomPartnerWishes": ["A", "B"],
    "zirkelPartnerWishes": ["C", "D"],
    "fractivityWishes": ["Bogenschießen", "TheCrew"],
    "instruments": ["Tuba"],
    "pool": true,
    "leavingPremise": true,
    "carpoolDataSharing": false,
    "statistics": "NOT_SPECIFIED",
    "additionalNotes": "Das ist ein Test!\nDanke!",
    "participationPermission": true,
    "termsAndConditionsAgreement_mathecamp": true,
    "privacyAgreement": true,
    "contacts": [
        { "name": "Erika Mustermann", "telephone": "+498999998002" },
        { "name": "Tobi Mustermann", "telephone": "+498999998003" },
        { "name": "Oma", "telephone": "+498999998004" }
    ],
    "additionalEmails": ["erika.mustermann@example.com"],
    "medicalNotes": ["Kaffeeallergie"],
    "registrationTimestamp": "2000-01-01 12:00:00"
}
