;Aspachtal;Bootshaus I;Bootshaus II;Bootshaus III;Bücherstube;Dachgarten;Eichholz;Fuchsberg;Gewächshaus;Himmelreich;Kraspen;Viereckschanze;Vorraum Himmelreich;Werkraum II;Werkraum III;Werkraum IV;Wohnzimmer;Zusameck;Rehgraben;Teamzimmer
Aspachtal;0;14;14;14;4;6;4;14;14;6;4;4;6;10;10;10;14;4;2;2
Bootshaus I;14;0;2;2;14;14;14;14;14;14;14;14;14;10;10;10;14;14;2;2
Bootshaus II;14;2;0;2;14;14;14;14;14;14;14;14;14;10;10;10;14;14;2;2
Bootshaus III;14;2;2;0;14;14;14;14;14;14;14;14;14;10;10;10;14;14;2;2
Bücherstube;4;14;14;14;0;6;4;14;14;6;4;4;6;10;10;10;14;4;2;2
Dachgarten;6;14;14;14;6;0;6;14;14;8;6;6;8;10;10;10;14;6;2;2
Eichholz;4;14;14;14;4;6;0;14;14;6;4;4;6;10;10;10;14;4;2;2
Fuchsberg;14;14;14;14;14;14;14;0;14;14;14;14;14;14;14;14;14;14;2;2
Gewächshaus;14;14;14;14;14;14;14;14;0;14;14;14;14;14;14;14;14;14;2;2
Himmelreich;6;14;14;14;6;8;6;14;14;0;6;6;8;10;10;10;14;6;2;2
Kraspen;4;14;14;14;4;6;4;14;14;6;0;4;6;10;10;10;14;4;2;2
Viereckschanze;4;14;14;14;4;6;4;14;14;6;4;0;6;10;10;10;14;4;2;2
Vorraum Himmelreich;14;14;14;14;6;8;6;14;14;8;14;6;0;10;10;10;14;6;2;2
Werkraum II;10;14;14;14;10;10;10;14;14;10;10;10;10;0;2;2;14;10;2;2
Werkraum III;10;14;14;14;10;10;10;14;14;10;10;10;10;2;0;2;14;10;2;2
Werkraum IV;10;14;14;14;10;10;10;14;14;10;10;10;10;2;2;0;14;10;2;2
Wohnzimmer;14;14;14;14;14;14;14;14;14;14;14;14;14;14;14;14;0;14;2;2
Zusameck;4;15;15;15;4;6;4;14;14;6;4;4;6;10;10;10;14;0;2;2
Rehgraben;3;7;7;7;3;3;3;6;3;3;3;3;3;3;3;3;5;3;0;0
Teamzimmer;3;7;7;7;3;3;3;6;3;3;3;3;3;3;3;3;5;3;0;0
